<svg width="3" height="3" viewBox="0 0 3 3" fill="none" xmlns="http://www.w3.org/2000/svg">
<path fill-rule="evenodd" clip-rule="evenodd" d="M1.20623 0.889932L1.08923 0.813933C1.06023 0.788933 1.05323 0.751933 1.07123 0.724933C1.08823 0.696934 1.12523 0.687934 1.16023 0.703934C1.46822 0.901932 1.77622 1.09293 2.08122 1.28993L2.12422 1.31793L2.15222 1.33493L2.18022 1.35293C2.21122 1.37393 2.25322 1.36393 2.27422 1.33293C2.29422 1.30093 2.28522 1.25893 2.25322 1.23893L2.22622 1.22093L2.19822 1.20293L2.15722 1.17693V1.17593C1.85122 0.979931 1.54122 0.785933 1.23423 0.588935C1.14723 0.532935 1.01423 0.562935 0.956228 0.642934C0.955228 0.643934 0.954228 0.645934 0.953228 0.646934C0.953228 0.647934 0.953228 0.647934 0.952228 0.647934C0.952228 0.648934 0.952228 0.648934 0.952228 0.649934C0.951228 0.650934 0.950228 0.652934 0.949228 0.653934C0.900228 0.739933 0.929228 0.872932 1.01523 0.928932L1.11623 0.993931L1.13923 1.00793L1.16623 1.02593L1.19423 1.04393C1.22623 1.06393 1.26823 1.05493 1.28822 1.02393C1.30922 0.991931 1.29922 0.949932 1.26823 0.928932L1.24023 0.911932L1.21223 0.893932L1.20623 0.889932Z" fill="#ED5A5A"/>
<path fill-rule="evenodd" clip-rule="evenodd" d="M1.79625 0.494937V0.355938C1.80225 0.316939 1.83025 0.291939 1.86225 0.291939C1.89525 0.291939 1.92225 0.316939 1.92825 0.355938C1.92825 0.720935 1.93325 1.08393 1.93325 1.44693V1.49793V1.53093V1.56393C1.93325 1.60193 1.96325 1.63293 2.00124 1.63293C2.03924 1.63293 2.06924 1.60193 2.06924 1.56393V1.53093V1.49793V1.44893C2.06924 1.08593 2.06424 0.719935 2.06424 0.355938C2.06424 0.251939 1.96825 0.15594 1.86925 0.15094C1.86725 0.15094 1.86525 0.15094 1.86325 0.15094H1.86225H1.86125C1.85925 0.15094 1.85725 0.15094 1.85525 0.15094C1.75725 0.15594 1.66025 0.251939 1.66025 0.355938V0.475937V0.501937V0.534937V0.567936C1.66025 0.605936 1.69025 0.635936 1.72825 0.635936C1.76625 0.635936 1.79625 0.605936 1.79625 0.567936V0.534937V0.501937V0.494937Z" fill="#ED5A5A"/>
<path fill-rule="evenodd" clip-rule="evenodd" d="M2.63723 0.813933C2.66623 0.788933 2.67323 0.751933 2.65523 0.724933C2.63723 0.696934 2.60123 0.687934 2.56623 0.703934C2.53523 0.722933 2.50523 0.742933 2.47523 0.761933L2.36123 0.834933C2.32923 0.855932 2.28723 0.846932 2.26623 0.814933C2.24623 0.782933 2.25523 0.740933 2.28723 0.720933L2.34123 0.685934C2.39123 0.653934 2.44223 0.620934 2.49223 0.588935C2.57923 0.532935 2.71223 0.562935 2.76923 0.642934C2.77123 0.643934 2.77223 0.645934 2.77323 0.646934C2.77323 0.647934 2.77323 0.647934 2.77323 0.647934C2.77423 0.648934 2.77423 0.648934 2.77423 0.649934C2.77523 0.650934 2.77623 0.652934 2.77723 0.653934C2.82622 0.739933 2.79723 0.872932 2.71123 0.928932L2.06923 1.34093V1.17893L2.63723 0.813933ZM1.93323 1.42893C1.70123 1.57793 1.46924 1.72692 1.23724 1.87692C1.14724 1.93392 1.00924 1.90092 0.954241 1.81592V1.81492L0.953241 1.81392C0.898241 1.72892 0.926241 1.58993 1.01524 1.53193C1.37624 1.30093 1.73623 1.07193 2.09723 0.841932V0.842932L2.16723 0.797933C2.19823 0.777933 2.24023 0.786933 2.26123 0.818933C2.28123 0.849932 2.27223 0.891932 2.24023 0.912932L2.12623 0.985931L2.12523 0.984931C1.78023 1.20593 1.43524 1.42393 1.08924 1.64693C1.05924 1.67293 1.05324 1.71092 1.07124 1.73992C1.08924 1.76792 1.12624 1.77792 1.16324 1.76192L1.93323 1.26693V1.42893Z" fill="#2F548E"/>
<path fill-rule="evenodd" clip-rule="evenodd" d="M1.28323 1.06393C1.28323 1.02593 1.31423 0.995934 1.35123 0.995934C1.38923 0.995934 1.41923 1.02593 1.41923 1.06393C1.41923 1.10193 1.38923 1.13193 1.35123 1.13193C1.31323 1.13193 1.28323 1.10093 1.28323 1.06393Z" fill="#2F548E"/>
<path fill-rule="evenodd" clip-rule="evenodd" d="M2.26922 1.37293C2.26922 1.33493 2.29922 1.30493 2.33722 1.30493C2.37422 1.30493 2.40522 1.33593 2.40522 1.37293C2.40522 1.41093 2.37422 1.44093 2.33622 1.44093C2.29922 1.44093 2.26822 1.41093 2.26922 1.37293Z" fill="#2F548E"/>
<path fill-rule="evenodd" clip-rule="evenodd" d="M1.61124 1.14893L1.56424 1.11893L1.53524 1.10093L1.50824 1.08293C1.48024 1.06493 1.43724 1.07093 1.41624 1.10493C1.39424 1.13893 1.40524 1.17893 1.43224 1.19593L1.46124 1.21493L1.49024 1.23393L1.51424 1.24893C1.74724 1.39893 2.25623 1.72692 2.48923 1.87692C2.57823 1.93392 2.71723 1.90092 2.77123 1.81592L2.77223 1.81492L2.77323 1.81392C2.82723 1.72892 2.80023 1.58992 2.71123 1.53193L2.59423 1.45693L2.55023 1.42893L2.52123 1.40993L2.49323 1.39193C2.46623 1.37493 2.42323 1.37993 2.40123 1.41393C2.38023 1.44793 2.39123 1.48793 2.41823 1.50593L2.44723 1.52393L2.47623 1.54293L2.48423 1.54792V1.54892L2.63723 1.64692C2.66723 1.67292 2.67323 1.71092 2.65423 1.73992C2.63623 1.76792 2.59923 1.77792 2.56323 1.76192C2.33723 1.61692 1.85323 1.30493 1.61124 1.14893Z" fill="#ED5A5A"/>
<path fill-rule="evenodd" clip-rule="evenodd" d="M1.81323 1.23293C1.81323 1.20493 1.83623 1.18293 1.86323 1.18293C1.89123 1.18293 1.91323 1.20593 1.91323 1.23293C1.91323 1.25993 1.89023 1.28293 1.86323 1.28293C1.83523 1.28193 1.81323 1.25993 1.81323 1.23293Z" fill="#2F548E"/>
<path fill-rule="evenodd" clip-rule="evenodd" d="M1.69225 0.653939C1.72325 0.632939 1.76525 0.642939 1.78625 0.673939C1.80625 0.705938 1.79725 0.747938 1.76525 0.767938C1.73325 0.788938 1.69125 0.778938 1.67125 0.747938C1.65125 0.715938 1.66025 0.673939 1.69225 0.653939Z" fill="#2F548E"/>
<path fill-rule="evenodd" clip-rule="evenodd" d="M1.96424 1.64993C1.99624 1.62993 2.03824 1.63893 2.05924 1.67093C2.07924 1.70192 2.07024 1.74392 2.03824 1.76492C2.00624 1.78492 1.96424 1.77592 1.94425 1.74392C1.92425 1.71192 1.93325 1.66993 1.96424 1.64993Z" fill="#2F548E"/>
<path fill-rule="evenodd" clip-rule="evenodd" d="M1.79725 0.97493V0.919931V0.884931V0.852931C1.79725 0.820932 1.76925 0.786932 1.72925 0.787932C1.68925 0.787932 1.66125 0.818932 1.66125 0.850931V0.884931V0.919931V0.947931C1.66025 1.22493 1.66025 1.82992 1.66025 2.10792C1.66025 2.21392 1.76225 2.31192 1.86425 2.31192H1.86525H1.86625C1.96725 2.31192 2.06924 2.21392 2.06924 2.10792V1.96892H2.07024V1.91592V1.88192V1.84892C2.07024 1.81692 2.04224 1.78392 2.00224 1.78392C1.96225 1.78392 1.93325 1.81492 1.93325 1.84692V1.88192L1.93425 1.91592V1.92592H1.93325V2.10792C1.92725 2.14692 1.89825 2.17292 1.86525 2.17292C1.83125 2.17292 1.80325 2.14692 1.79625 2.10792C1.79625 1.83892 1.79725 1.26293 1.79725 0.97493Z" fill="#ED5A5A"/>
</svg>
