<svg width="18" height="17" viewBox="0 0 18 17" fill="none" xmlns="http://www.w3.org/2000/svg">
<path d="M16.8339 10.3257L15.3019 9.12783C15.3214 8.9431 15.338 8.72715 15.338 8.49867C15.338 8.27018 15.3221 8.05423 15.3019 7.8695L16.8353 6.6709C17.12 6.4459 17.1978 6.04658 17.0165 5.71397L15.4235 2.95768C15.2533 2.64658 14.8804 2.48685 14.5019 2.62643L12.6943 3.35212C12.3478 3.10212 11.9846 2.89102 11.6089 2.72227L11.3339 0.804915C11.2887 0.441016 10.9721 0.166016 10.5978 0.166016H7.40334C7.02903 0.166016 6.71308 0.441016 6.66861 0.799349L6.39293 2.72367C6.02903 2.88757 5.67141 3.0959 5.30959 3.35352L3.49709 2.62575C3.15748 2.4945 2.75123 2.6417 2.58248 2.95143L0.98736 5.71117C0.799176 6.02923 0.876943 6.44242 1.16793 6.67298L2.69986 7.8709C2.67554 8.10492 2.66376 8.3084 2.66376 8.49938C2.66376 8.69037 2.67558 8.89382 2.69986 9.12855L1.16653 10.3271C0.881794 10.5528 0.80471 10.9521 0.98596 11.2841L2.57903 14.0403C2.74918 14.3507 3.11861 14.5118 3.50054 14.3716L5.30819 13.6459C5.65403 13.8952 6.01721 14.1063 6.39293 14.2757L6.66793 16.1924C6.71304 16.5577 7.02903 16.8327 7.40403 16.8327H10.5985C10.9728 16.8327 11.2894 16.5577 11.3339 16.1994L11.6096 14.2757C11.9735 14.1112 12.3304 13.9035 12.6929 13.6452L14.5054 14.373C14.5929 14.407 14.6839 14.4243 14.7776 14.4243C15.0471 14.4243 15.295 14.2771 15.42 14.048L17.02 11.2771C17.1978 10.9521 17.12 10.5528 16.8339 10.3257ZM9.00054 11.2771C7.46861 11.2771 6.22278 10.0313 6.22278 8.49935C6.22278 6.96742 7.46861 5.72158 9.00054 5.72158C10.5325 5.72158 11.7783 6.96742 11.7783 8.49935C11.7783 10.0313 10.5325 11.2771 9.00054 11.2771Z" fill="white"/>
</svg>
