<svg width="20" height="21" viewBox="0 0 20 21" fill="none" xmlns="http://www.w3.org/2000/svg">
<path d="M13.8179 3.83301C13.0362 3.84477 12.2716 4.05586 11.6013 4.44496C10.9309 4.83405 10.3786 5.38738 9.99999 6.04906C9.62142 5.38738 9.06907 4.83405 8.39872 4.44496C7.72836 4.05586 6.96375 3.84477 6.18209 3.83301C4.93602 3.88538 3.76202 4.41271 2.91659 5.29979C2.07115 6.18687 1.62299 7.36159 1.67002 8.56731C1.67002 11.6208 4.99229 14.9556 7.77866 17.2167C8.40079 17.7224 9.18737 17.9997 9.99999 17.9997C10.8126 17.9997 11.5992 17.7224 12.2213 17.2167C15.0077 14.9556 18.33 11.6208 18.33 8.56731C18.377 7.36159 17.9288 6.18687 17.0834 5.29979C16.238 4.41271 15.064 3.88538 13.8179 3.83301ZM11.3293 16.1892C10.9572 16.4923 10.4864 16.6585 9.99999 16.6585C9.51355 16.6585 9.04275 16.4923 8.67067 16.1892C5.10405 13.2942 3.05835 10.5168 3.05835 8.56731C3.01089 7.71763 3.31266 6.88427 3.89784 6.24898C4.48302 5.61369 5.30413 5.22802 6.18209 5.17607C7.06004 5.22802 7.88115 5.61369 8.46633 6.24898C9.05151 6.88427 9.35328 7.71763 9.30583 8.56731C9.30583 8.74541 9.37896 8.91622 9.50914 9.04216C9.63932 9.16809 9.81589 9.23884 9.99999 9.23884C10.1841 9.23884 10.3607 9.16809 10.4908 9.04216C10.621 8.91622 10.6942 8.74541 10.6942 8.56731C10.6467 7.71763 10.9485 6.88427 11.5337 6.24898C12.1188 5.61369 12.9399 5.22802 13.8179 5.17607C14.6959 5.22802 15.517 5.61369 16.1021 6.24898C16.6873 6.88427 16.9891 7.71763 16.9416 8.56731C16.9416 10.5168 14.8959 13.2942 11.3293 16.1865V16.1892Z" fill="#3685C8"/>
<path d="M11.3293 16.1892C10.9572 16.4923 10.4864 16.6585 9.99999 16.6585C9.51355 16.6585 9.04275 16.4923 8.67067 16.1892C5.10405 13.2942 3.05835 10.5168 3.05835 8.56731C3.01089 7.71763 3.31266 6.88427 3.89784 6.24898C4.48302 5.61369 5.30413 5.22802 6.18209 5.17607C7.06004 5.22802 7.88115 5.61369 8.46633 6.24898C9.05151 6.88427 9.35328 7.71763 9.30583 8.56731C9.30583 8.74541 9.37896 8.91622 9.50914 9.04216C9.63932 9.16809 9.81589 9.23884 9.99999 9.23884C10.1841 9.23884 10.3607 9.16809 10.4908 9.04216C10.621 8.91622 10.6942 8.74541 10.6942 8.56731C10.6467 7.71763 10.9485 6.88427 11.5337 6.24898C12.1188 5.61369 12.9399 5.22802 13.8179 5.17607C14.6959 5.22802 15.517 5.61369 16.1021 6.24898C16.6873 6.88427 16.9891 7.71763 16.9416 8.56731C16.9416 10.5168 14.8959 13.2942 11.3293 16.1865V16.1892Z" fill="#3685C8"/>
</svg>
