<svg width="20" height="21" viewBox="0 0 20 21" fill="none" xmlns="http://www.w3.org/2000/svg">
<g clip-path="url(#clip0)">
<path d="M11.7786 2.34084C11.7786 2.14299 11.6076 1.98847 11.4108 2.00842L3.08816 2.85194L2.91338 2.73249L11.1549 1.83786L11.1455 1.74607L2.79645 2.65202L2.65122 2.55206L10.9883 1.64045L10.9776 1.54803L2.53365 2.47158L2.37333 2.36156L10.8393 1.42481L10.8299 1.33302L2.25703 2.28109L2.07722 2.15849L10.6539 1.20477L10.6432 1.11235L1.96028 2.07802L1.76665 1.94474L2.04453 1.91582L10.4531 1.00197C10.6386 0.981811 10.7343 0.769887 10.6267 0.617447C10.5755 0.544937 10.4891 0.505795 10.4009 0.515146L1.03532 1.50748C0.956056 1.51588 0.895905 1.58274 0.895905 1.66245V2.03464V13.8066C0.895905 14.1303 1.05252 14.4339 1.31622 14.6215L2.33646 15.3473C2.53409 15.4879 2.77607 15.5518 3.01736 15.5273L3.83568 15.444V3.42154L11.477 2.67337C11.6481 2.65662 11.7786 2.51276 11.7786 2.34084Z" fill="white"/>
<path d="M15.3593 4.73946C15.3595 4.5415 15.1884 4.3868 14.9915 4.40678L6.66857 5.25087L6.4938 5.13142L14.7353 4.23679L14.7259 4.14437L6.37686 5.05032L6.23163 4.95098L14.5687 4.03875L14.5587 3.94696L6.11407 4.86988L5.95438 4.75986L14.421 3.82311L14.4109 3.73132L5.83744 4.67939L5.65826 4.55679L14.2343 3.60306L14.2242 3.51064L5.54133 4.47632L5.34769 4.34303L5.62494 4.31412L14.034 3.40034C14.2196 3.38018 14.3151 3.16795 14.2071 3.01571C14.1559 2.94358 14.0698 2.90469 13.9819 2.914L4.61574 3.90579C4.53647 3.91418 4.47632 3.98104 4.47632 4.06075V4.43294V16.205C4.47632 16.5286 4.63291 16.8322 4.89658 17.0198L5.91724 17.746C6.11503 17.8867 6.35724 17.9507 6.59872 17.926L7.41672 17.8423V5.81984L15.0578 5.07164C15.2287 5.0549 15.3591 4.91124 15.3593 4.73946Z" fill="white"/>
<path fill-rule="evenodd" clip-rule="evenodd" d="M10.4143 7.787L10.2402 7.66692L18.4824 6.77292L18.4717 6.68113L10.1232 7.58645L9.97802 7.48711L18.3151 6.57551L18.3038 6.48309L9.85982 7.40664L9.69951 7.29662L18.1661 6.35987L18.1567 6.26745L9.5832 7.21552L9.40465 7.09292L17.9807 6.1392L17.9706 6.04741L9.28771 7.01245L9.09407 6.8798L9.37133 6.85088L17.7807 5.93588C17.9661 5.91571 18.0614 5.70361 17.9534 5.55157C17.9023 5.4796 17.8163 5.44082 17.7285 5.45012L8.36087 6.44261C8.28196 6.45097 8.22208 6.51753 8.22208 6.59688V6.96907V18.7411C8.22208 19.0647 8.37867 19.3683 8.64234 19.5559L9.66334 20.2824C9.86092 20.4229 10.1028 20.4869 10.3441 20.4624L18.204 19.6644C18.7145 19.6126 19.1029 19.1828 19.103 18.6696L19.1046 8.01174C19.1047 7.41947 18.5929 6.9569 18.0036 7.01671L10.4143 7.787ZM12.2023 11.4239C12.2023 12.2501 12.9166 12.8952 13.7385 12.8114L16.219 12.5583C16.9307 12.4857 17.472 11.8864 17.472 11.171C17.472 10.3449 16.758 9.69994 15.9362 9.78367L13.4556 10.0364C12.7438 10.1089 12.2023 10.7084 12.2023 11.4239Z" fill="white"/>
</g>
<defs>
<clipPath id="clip0">
<rect width="20" height="20" fill="white" transform="translate(0 0.5)"/>
</clipPath>
</defs>
</svg>
