<svg width="12" height="14" viewBox="0 0 12 14" fill="none" xmlns="http://www.w3.org/2000/svg">
<path d="M2.008 11H12V1.66671C12 1.31309 11.8595 0.973947 11.6095 0.723898C11.3594 0.47385 11.0203 0.333374 10.6667 0.333374H2C1.196 0.333374 0 0.866041 0 2.33337V11.6667C0 13.134 1.196 13.6667 2 13.6667H11.3333C11.7015 13.6667 12 13.3682 12 13C12 12.6319 11.7015 12.3334 11.3333 12.3334H2.008C1.7 12.3254 1.33333 12.2034 1.33333 11.6667C1.33333 11.13 1.7 11.008 2.008 11ZM3.33333 3.66671C3.33333 3.29852 3.63181 3.00004 4 3.00004H8.66667C9.03486 3.00004 9.33333 3.29852 9.33333 3.66671C9.33333 4.0349 9.03486 4.33337 8.66667 4.33337H4C3.63181 4.33337 3.33333 4.0349 3.33333 3.66671Z" fill="#6C6866"/>
</svg>
