<svg width="16" height="16" viewBox="0 0 16 16" fill="none" xmlns="http://www.w3.org/2000/svg">
<path d="M13.3333 2H2.66659C1.93125 2 1.33325 2.598 1.33325 3.33333V12.6667C1.33325 13.402 1.93125 14 2.66659 14H13.3333C14.0686 14 14.6666 13.402 14.6666 12.6667V3.33333C14.6666 2.598 14.0686 2 13.3333 2ZM11.9999 4.66667C12.3681 4.66667 12.6666 4.96514 12.6666 5.33333C12.6666 5.70152 12.3681 6 11.9999 6H9.99992C9.63173 6 9.33325 5.70152 9.33325 5.33333C9.33325 4.96514 9.63173 4.66667 9.99992 4.66667H11.9999ZM9.33325 8C9.33325 7.63181 9.63173 7.33333 9.99992 7.33333H11.9999C12.3681 7.33333 12.6666 7.63181 12.6666 8C12.6666 8.36819 12.3681 8.66667 11.9999 8.66667H9.99992C9.63173 8.66667 9.33325 8.36819 9.33325 8ZM3.66658 12.6667C3.1143 12.6667 2.66659 12.2189 2.66659 11.6667V4.33333C2.66659 3.78105 3.1143 3.33333 3.66659 3.33333H6.33325C6.88554 3.33333 7.33325 3.78105 7.33325 4.33333V11.6667C7.33325 12.219 6.88554 12.6667 6.33325 12.6667H3.66658Z" fill="#6C6866"/>
</svg>
