<svg width="16" height="16" viewBox="0 0 16 16" fill="none" xmlns="http://www.w3.org/2000/svg">
<path d="M8.00094 1.3335C6.09617 1.3335 4.53911 2.89056 4.53911 4.79533C4.53911 6.70011 6.09617 8.25717 8.00094 8.25717C9.90571 8.25717 11.4628 6.70011 11.4628 4.79533C11.4628 2.89056 9.90571 1.3335 8.00094 1.3335Z" fill="#6C6866"/>
<path d="M13.9421 11.0237C13.8514 10.7969 13.7305 10.5853 13.5944 10.3888C12.899 9.36077 11.8257 8.6805 10.6163 8.51421C10.4652 8.49911 10.2989 8.52932 10.1779 8.62003C9.54301 9.08866 8.78716 9.33053 8.00105 9.33053C7.21494 9.33053 6.45909 9.08866 5.82417 8.62003C5.70322 8.52932 5.53693 8.48398 5.38577 8.51421C4.1764 8.6805 3.08797 9.36077 2.4077 10.3888C2.27165 10.5853 2.1507 10.812 2.06002 11.0237C2.01468 11.1144 2.02978 11.2202 2.07512 11.3109C2.19607 11.5226 2.34723 11.7342 2.48328 11.9156C2.69492 12.2028 2.92168 12.4598 3.17868 12.7017C3.39031 12.9133 3.63218 13.1099 3.87408 13.3064C5.06832 14.1983 6.50447 14.6669 7.98595 14.6669C9.46743 14.6669 10.9036 14.1983 12.0978 13.3064C12.3397 13.125 12.5815 12.9133 12.7932 12.7017C13.0351 12.4598 13.2769 12.2028 13.4886 11.9156C13.6398 11.7191 13.7759 11.5226 13.8968 11.3109C13.9723 11.2202 13.9874 11.1144 13.9421 11.0237Z" fill="#6C6866"/>
</svg>
