<svg width="3" height="4" viewBox="0 0 3 4" fill="none" xmlns="http://www.w3.org/2000/svg">
<path fill-rule="evenodd" clip-rule="evenodd" d="M2.76417 3.17696C2.76417 3.17796 2.76417 3.17896 2.76417 3.17996C2.76417 3.22196 2.73217 3.25796 2.68317 3.26596H1.76718V3.26496H1.63718C1.58918 3.26496 1.55118 3.30395 1.55118 3.35095C1.55118 3.39795 1.58918 3.43595 1.63718 3.43595H1.64318V3.43695H2.68317C2.81617 3.43695 2.94117 3.30895 2.93917 3.18196V3.17996V3.17896C2.93717 2.61596 2.93717 1.72797 2.93917 1.16397V1.16297V1.16097C2.93917 1.15497 2.93917 1.14797 2.93917 1.14197H2.93817C2.92817 1.02097 2.80917 0.905975 2.68317 0.905975H2.63717H2.50717C2.46017 0.905975 2.42217 0.943975 2.42217 0.990975C2.42217 1.03797 2.46017 1.07597 2.50717 1.07597H2.55417V1.07697H2.68317C2.73217 1.08497 2.76417 1.12097 2.76417 1.16297C2.76417 1.16397 2.76417 1.16497 2.76417 1.16597V3.17696Z" fill="#2F548E"/>
<path d="M2.82916 1.40297H0.870178V2.08196H2.82916V1.40297Z" fill="#2F548E"/>
<path fill-rule="evenodd" clip-rule="evenodd" d="M0.877176 1.16497C0.877176 1.16397 0.877176 1.16297 0.877176 1.16297V1.16197C0.877176 1.11997 0.909176 1.08397 0.958176 1.07597H2.18417V1.07697H2.31416C2.36116 1.07697 2.40016 1.03897 2.40016 0.991975C2.40016 0.943975 2.36116 0.905975 2.31416 0.905975H2.30816H0.958176C0.825177 0.905975 0.700178 1.03397 0.701178 1.16097V1.16197V1.16397C0.703178 1.72597 0.703178 2.61496 0.701178 3.17796V3.17996V3.18096C0.701178 3.18796 0.702178 3.19396 0.702178 3.20096C0.713178 3.32095 0.832177 3.43595 0.958176 3.43595H1.31317V3.43695H1.44317C1.49117 3.43695 1.52917 3.39895 1.52917 3.35095C1.52917 3.30395 1.49117 3.26596 1.44317 3.26596H1.39717H0.958176C0.909176 3.25796 0.877176 3.22196 0.877176 3.17996V3.17896C0.877176 3.17896 0.877176 3.17796 0.877176 3.17696V1.16497Z" fill="#ED5A5A"/>
<path fill-rule="evenodd" clip-rule="evenodd" d="M2.17716 2.56896C2.25315 2.56596 2.31315 2.52896 2.31315 2.48396C2.31315 2.43696 2.24715 2.39796 2.16616 2.39796H2.00516V2.39896H1.69316V2.39796H1.53216C1.45116 2.39796 1.38516 2.43696 1.38516 2.48396C1.38516 2.52896 1.44516 2.56596 1.52216 2.56896H1.53216H1.59216H1.69316H2.16616H2.17716Z" fill="#ED5A5A"/>
<path fill-rule="evenodd" clip-rule="evenodd" d="M2.04117 2.90796C2.08617 2.90496 2.12117 2.86796 2.12117 2.82296C2.12117 2.77596 2.08217 2.73796 2.03518 2.73796H1.94118H1.75818H1.66318C1.61618 2.73796 1.57718 2.77596 1.57718 2.82296C1.57718 2.86796 1.61218 2.90496 1.65718 2.90796H1.66318H1.69818H1.75818H2.03518H2.04117Z" fill="#ED5A5A"/>
</svg>
