{
    "name": "Hephaistos Importer for Starfinder",
    "script": "hephaistos-importer.js",
    "version": "0.12.0",
    "description": "",
    "authors": "Hephaistos",
    "roll20userid": "9112005",
    "dependencies": [],
    "patreon": "https://www.patreon.com/hephaistos_official"
}