text,classify
식단 계획의 현재 상황을 요약해주세요.,요약
구글 에널리틱스 설치 (방문 웹페이지 분석),등록
캠페인의 진행 상황을 요약해주세요.,요약
**다이어리 미팅,등록
W/F리뷰- 3.3 조사 M/L,등록
"당분가 gsheet에서 사용 (ikew- 전문가 네트워크, 관심사 추적)",등록
가족 모임의 준비 상태를 요약해주세요.,요약
그룹 스터디 시작 전까지 스터디 계획의 수정 상황을 알려줘.,요약
다음 분기에 대한 비즈니스 계획 진행 상황 보기.,요약
연주회 준비에 대한 계획의 진행 사항을 전해주세요.,요약
내 외국여행 계획을 만들어 주실 수 있나요?,등록
연구 프로젝트에 대한 계획을 작성해주세요.,등록
카카오톡 비즈니스 계정 전환,등록
브로셔 1차 인쇄,등록
w31-8 1차 영업- 기업,등록
기술 세미나 참여 계획의 진행 사항을 업데이트해주세요.,요약
사진 전시회 준비 상황의 진행 사항을 알려줘.,요약
스포츠 팀 활동에 대한 계획을 구체화해주세요.,등록
논문 제출 마감일 전에 논문 계획의 현재 상황을 확인해줘.,요약
프로젝트 계획을 등록하고 싶어요.,등록
CS 매뉴얼 작성,등록
외국여행 계획의 최신 업데이트를 전해주세요.,요약
내일까지 내일의 아침 회의에 대한 계획을 완성해줘.,등록
가정의 날 준비 상태를 업데이트해주세요.,요약
통합 c/s솔루션 시범 사용,등록
차주 월요일까지 새로운 고객 서비스 계획의 진행 상황 파악하기.,요약
워크샵 준비와 실행(반나절),등록
직장에서의 승진 계획을 작성해주세요.,등록
차 연구 계획의 최신 업데이트를 보여줘.,요약
개발 팀 미팅 시작 전에 논의할 사항들의 계획 상황을 알려줘.,요약
집에서 할 수 있는 DIY 프로젝트 계획을 만들어봐.,등록
블로그 업데이트 계획을 구성해주세요.,등록
주말 등산 계획을 위한 경로를 설계해봐.,등록
우주 탐사에 대한 자료 조사 계획을 만들어봐.,등록
개인 목표 달성 계획의 진행 상태를 알려주세요.,요약
고객- 키워드광고,등록
이번 주 회의에 다룰 주제들을 요약해서 안내해줄 수 있을까?,요약
이번 달 마감일까지 수행된 마케팅 전략의 성과를 요약해서 알려줄래?,요약
3월 31일까지 Q1 업무 리뷰 계획의 진행 상황 확인하기.,요약
브라우저 스크랩 정리,등록
일요일까지 다가오는 월요일의 업무 계획을 구성해봐.,등록
w34-1 iKew 기획,등록
가정의 날 준비 계획을 작성해주세요.,등록
데이트 계획을 구상해주세요.,등록
차주 월요일까지 팀의 현재 상황을 요약해서 알려줄 수 있을까?,요약
집에 가기 전까지 업무 보고서 개선 계획의 최신 상태를 업데이트해줘.,요약
회사 세미나의 계획을 등록해주세요.,등록
주택 구매 계획의 진행 상황을 알려주세요.,요약
집 수리에 대한 계획을 만들어주세요.,등록
아이디어 브레인스토밍 회의(시간잡기),등록
새로운 브랜드 전략을 오늘 밤까지 계획하자.,등록
이번 주 금요일까지 향후 업무 일정을 요약해서 공유해줄래?,요약
시나리오3 리뷰 및 추가 완료,등록
가이드 문서 작성,등록
스터디 그룹의 계획을 등록해주세요.,등록
내일의 일정 진행 상태를 알려주세요.,요약
도서 구입 계획을 만들어 주세요.,등록
올해 끝나기 전에 내년의 업무 계획의 진행 상황을 보고해줘.,요약
요가 복습 계획의 진행 상황을 알려줘.,요약
watcher WF구성,등록
오늘의 할 일 리스트를 등록하고 싶어요.,등록
기부 계획의 현재 상태를 업데이트해주세요.,요약
이번 분기 끝나기 전에 다음 분기 업무 계획의 진행 상황을 보고해줘.,요약
프로젝트 시작 2주 전에 프로젝트 계획의 현재 상황을 알려줘.,요약
온라인 코스 참여 계획을 만들어주세요.,등록
비즈니스 트립 전에 트립 일정을 계획해줘.,등록
"시나리오1,2,4 리뷰와 최적화",등록
새로운 가게 오픈 프로젝트의 진행 상황을 2023년 8월 1일까지 보고해줘.,요약
다음 달의 주요 이슈에 대한 계획 진행 상황은 어떠니?,요약
휘트니스 계획의 진행 상태를 알려주세요.,요약
출장 계획의 현재 상황을 업데이트해주세요.,요약
차주 월요일까지 새로운 고객 서비스 계획 세우기.,등록
주말 계획에 대한 진행 상태를 알려줄 수 있을까?,요약
오늘 저녁까지 내일의 일정 계획 진행 상황 확인하기.,요약
식물 기르기를 위한 관리 일정을 설정해봐.,등록
내일까지 이번 주 업무 계획의 변경 사항을 알려줘.,요약
비즈니스 네트워킹 이벤트 참석 계획을 짜주세요.,등록
주말 야외활동 계획의 현재 상황을 알려주세요.,요약
연말까지 올해의 마무리 업무 계획 진행 상황 확인하기.,요약
새로운 브랜드 전략의 오늘까지의 진행 상황을 파악하자.,요약
내일까지 팀 미팅 아젠다의 준비 상황을 알려줘.,요약
이번 달 마감까지 수행된 마케팅 전략의 효과를 요약해서 알려줄래?,요약
제 회의 계획을 등록해주세요.,등록
이루미(헬퍼)로 업무파악,등록
강아지 훈련 계획의 현재 상태를 요약해주세요.,요약
올해의 마무리 업무 계획 진행 상황은 어떠니?,요약
휴식 및 리프레시 계획의 최신 정보를 전해주세요.,요약
차주 월요일까지 팀 빌딩 활동에 대한 진행 상황을 요약해서 알려줄 수 있을까?,요약
커버레터(엽서크기),등록
가이드 문서 업데이트,등록
세미나 시작 전까지 세미나에 대한 마지막 계획을 완성해봐.,등록
기타 연습 일정의 현재 진행 상황을 보여줘.,요약
차주 월요일까지 프로젝트 일정을 등록해줄래?,등록
세미나 계획의 진행 상황을 알려주세요.,요약
다음 주 월요일까지 웹사이트 업데이트 계획하기.,등록
그림 그리기에 대한 훈련 계획을 작성하자.,등록
워크샵의 계획 진행 상황을 요약해주세요.,요약
이번 주 금요일까지 마케팅 캠페인의 성과 요약을 준비해봐.,요약
친구들과의 모임 계획을 짜주세요.,등록
다음 분기 비즈니스 계획의 주요 목표를 요약해서 공유해줄래?,요약
W/F 테스트 진행,등록
hrd insight (우리가 고객에게 소개할 만한 wf 추려내기),등록
"2024년 2월 14일까지, 발렌타인데이 특별 프로모션 계획을 작성하자.",등록
다음 주 시작 전에 전반적인 업무 진행 상황을 요약해서 보고해줄래?,요약
휴가 끝나기 전에 휴가 후 업무 계획의 진행 상황을 알려줘.,요약
개인적인 운동 루틴을 설계해주세요.,등록
홈바에서 칵테일 파티를 위한 메뉴를 작성해줘.,등록
개인 훈련 계획을 등록해주세요.,등록
사진 촬영 세션에 대한 계획을 구성해주세요.,등록
다음 주 회의에 다룰 주요 사안을 요약해서 준비해봐.,요약
이번 달 마지막 날까지 재무 보고서 작성 계획하기.,등록
다음 주 회의에 대한 아젠다를 요약해서 준비해봐.,요약
연구 프로젝트의 진행 상황을 요약해주세요.,요약
수요일까지 다음주 워크샵 아젠다의 준비 상황을 확인해줘.,요약
건강검진 일정의 최신 정보를 전해주세요.,요약
비즈니스 트립 전에 트립 일정 계획의 현재 상황을 알려줘.,요약
마라톤 훈련 계획의 진행 상황을 보고해줘.,요약
재테크 계획의 진행 상황을 요약해주세요.,요약
홍보물 제작,등록
프로젝트 시작 전에 프로젝트 일정 계획하기.,등록
"2023년 10월 15일까지, 헬스 트레이닝을 위한 개인 일정을 만들어줘.",등록
"2024년 1월 1일까지, 신년 파티 준비에 대한 타임라인을 세워봐.",등록
요가 복습을 위한 주간 계획을 구성하자.,등록
식물 관리 일정의 현재 상황을 알려줘.,요약
통합 c/s솔루션,등록
휴가 전에 휴가 동안 읽을 책 목록을 계획하자.,등록
승진 계획에 대한 진행 상황을 요약해주세요.,요약
교육 및 트레이닝 계획의 진행 상태를 알려주세요.,요약
현재까지의 고객 서비스 개선 사항을 요약해서 알려줄 수 있을까?,요약
친환경 생활 계획을 설정해주세요.,등록
미팅 시작 30분 전에 미팅 아젠다의 진행 상황을 확인해줘.,요약
연말까지 연말 이벤트에 대한 전체 계획을 완성해봐.,등록
캠페인 계획을 등록하고 싶어요.,등록
이번 주말까지 팀 빌딩 아이디어 기획의 진행 상태를 확인해줘.,요약
신년 파티 준비 상황의 현재 상황을 2024년 1월 1일까지 보여줘.,요약
프로젝트 시작 전에 프로젝트 일정 진행 상황 파악하기.,요약
스포츠 팀 활동의 진행 상태를 요약해주세요.,요약
"2023년 9월 30일까지, 가을 휴가를 위한 여행 계획을 작성해봐.",등록
내일까지 발표 준비 진행 상황 알려주겠니?,요약
투자 계획의 최신 정보를 전해주세요.,요약
현재까지의 고객 서비스 개선 사항을 요약해서 알려줄 수 있을까?,요약
영화 스크립트 작성 계획의 현재 상태를 알려줘.,요약
오늘 저녁까지 내일의 일정 계획 진행 상황 확인하기.,요약
이번 주의 계획을 등록하고 싶습니다.,등록
다음 주 토요일까지 봉사 활동 계획하기.,등록
음악 제작 계획의 진행 상황을 알려봐.,요약
취미 활동의 진행 상황을 요약해주세요.,요약
고객- 조사1 사무실 주변 시세 파악,등록
투자 계획을 작성해주실 수 있나요?,등록
자격증 준비를 위한 스케줄을 작성해주세요.,등록
칵테일 메뉴 계획의 현재 진행 상황을 보고해줘.,요약
패션 디자인 프로젝트의 최신 업데이트를 보여줘.,요약
금요일 저녁까지 주말 업무 계획의 진행 상태를 업데이트해줘.,요약
개인화 맞춤 대시보드 디자인,등록
"2023년 10월 10일까지, 재무 관리 시스템 개선에 대한 계획을 만들어봐.",등록
시나리오3 prestudy 1차 진행1,등록
이번 주 금요일까지 팀 빌딩에 대한 아이디어 계획 진행 상황 보기.,요약
다음 주 월요일까지 웹사이트 업데이트 계획의 진행 상황 보기.,요약
휴가 전까지 업무 위임 계획의 진행 상황을 업데이트해줘.,요약
금요일까지 진행된 프로젝트의 주요 사항을 요약해서 보고해줄래?,요약
기념일 계획의 현재 상황을 알려주세요.,요약
사전조사: 정신건강 관련 지표 알아보기,등록
현재까지 진행된 고객 서비스 개선 사항을 요약해서 알려줄 수 있을까?,요약
오늘까지 진행된 프로젝트의 핵심 결과를 요약해서 보고해줄 수 있을까?,요약
정원 가꾸기에 대한 일정을 설계해주세요.,등록
이번 주의 일정 진행 상황을 요약해주세요.,요약
미팅 시작 30분 전에 미팅 아젠다를 정리해봐.,등록
팀 빌딩 전에 팀 빌딩에 대한 계획을 짜봐.,등록
신제품 출시 계획에 대한 현재 진행 상황은 어떠니?,요약
기타를 배우기 위한 연습 일정을 기획하게 해줘.,등록
웹사이트 개편 계획의 최신 상황을 2023년 11월 20일까지 알려줘.,요약
알파 베타 서비스 진행,등록
개발 팀 미팅 시작 전에 논의할 사항들을 계획해봐.,등록
전화 솔루션(3자통화)시범 사용,등록
개인프로젝트용 W/F 작성,등록
점심시간 전에 점심시간 업무 계획의 진행 상황을 보여줘.,요약
취업 준비 상태를 업데이트해주세요.,요약
이번 달 마지막 주에 대한 일정 계획 진행 상황은 어떠니?,요약
봉사활동 일정의 현재 상태를 알려주세요.,요약
차주 월요일까지 팀 회의에 대한 준비 상황 어떻게 되고 있니?,요약
"2023년 8월 1일까지, 새로운 가게 오픈에 대한 프로젝트 계획을 설계해봐.",등록
담주 월요일까지 진행 중인 프로젝트 수정 계획의 현재 상황을 알려줘.,요약
리뷰와 다음 단계 계획,등록
발렌타인데이 특별 프로모션 계획의 최신 업데이트를 2024년 2월 14일까지 알려줘.,요약
Research 담당 시험지 만들기,등록
프로젝트 시작 2주 전에 프로젝트 계획을 완성해줘.,등록
휴식 및 리프레시 계획을 짜주세요.,등록
이번 주 회의에 다룰 주제들을 요약해서 안내해줄 수 있을까?,요약
봉사활동에 대한 일정을 구성해주세요.,등록
새 학기 시작 전에 학기 계획의 진행 상황을 보고해줘.,요약
개인적인 건강 계획을 짜주세요.,등록
대학원 입학 준비 계획을 구성해주실 수 있나요?,등록
금요일까지 진행된 프로젝트의 주요 성과를 요약해서 보고해줄래?,요약
시나리오3 prestudy 1차 진행2,등록
"업체에서 요구하는 자료목록 받아오기(홈페이지주소: kchloe.co (kchloe.kewtea.com), 글내용, 그림 사진등",등록
골프 스윙 개선 훈련 계획의 현재 상황을 전해봐.,요약
취미 활동 계획을 등록해주세요.,등록
내일까지 팀 미팅에 대한 아젠다를 준비해줘.,등록
금요일까지 진행된 프로젝트의 주요 사항을 요약해서 보고해줄래?,요약
출장 계획을 세워주실 수 있나요?,등록
다음 분기에 대한 비즈니스 계획 마련하기.,등록
인력 리쿠르팅,등록
W/F리뷰- 3.2.2 작업체크와 할당,등록
프로젝트 보고서 마감 일주일 전까지 보고서를 완성해줘.,등록
방학 시작 전에 방학 동안의 학습 계획을 짜봐.,등록
다음 주 토요일까지 봉사 활동 계획 진행 상황 파악하기.,요약
다음 주 월요일까지 업무 보고서를 등록해줄 수 있을까?,등록
트렌디한 관심사 단어와 할일 제안 구성해 보기,등록
주말 일정의 현재 상황을 요약해주세요.,요약
목요일까지 이번 주간 일정 계획 진행 상황 파악하기.,요약
휘트니스 계획을 등록하고 싶어요.,등록
친구들과의 모임 준비 상황을 전해주세요.,요약
목요일까지 이번 주간 일정 계획의 진행 상황 파악하기.,요약
온라인 판매를 위한 마케팅 전략을 세워봐.,등록
figma디자이너 리쿠르팅,등록
금요일까지 프로젝트 계획에 대한 진행 상황 알 수 있을까?,요약
DIY 프로젝트 계획의 최신 업데이트를 보여줘.,요약
W/F 리뷰- 3.2.0 가입로그인,등록
웹디자인 공부 계획을 작성하자.,등록
홈페이지 시안 구성하여 디자인/구현 작업 맡기기,등록
해외스마트시티 개발 사례/연구내용 조사,등록
다음 주 월요일까지 웹사이트 업데이트 계획 진행 상황 확인하기.,요약
차주 월요일까지 프로젝트 진행 상황에 대한 요약 보고를 해줄래?,요약
개인 사업에 대한 계획을 세워주세요.,등록
다음 주 회의에 대한 아젠다를 요약해서 준비해봐.,요약
금요일까지 작성해야 할 보고서 진행 상황 파악하기.,요약
다음 주 월요일까지 웹사이트 리뉴얼 계획 진행 상태를 알 수 있을까?,요약
서비스 업데이트 계획에 대한 최신 정보 알려줄 수 있을까?,요약
이번 주 금요일까지 세일즈 팀의 영업 전략을 계획해봐.,등록
주택 구매 계획을 짜주세요.,등록
신제품 개발에 대한 계획을 제작하자.,등록
대회 시작 전에 대회 준비 계획의 진행 상태를 업데이트해줘.,요약
가을 휴가 계획의 진행 상황을 2023년 9월 30일까지 보고해줘.,요약
간단히 문서 계획서 작성하여 전달,등록
12시까지 오늘 점심 회의에 대한 계획을 세워봐.,등록
요리 학습의 진행사항을 업데이트해주세요.,요약
기부 계획을 세워주실 수 있나요?,등록
요리 학습 계획을 만들어 주세요.,등록
연주회 준비에 대한 계획을 설정해주세요.,등록
이벤트 준비의 진행 상태를 요약해주세요.,요약
오전 근무 시작 전에 오전 일과 계획을 만들어봐.,등록
고전 음악을 이해하기 위한 학습 계획을 작성하자.,등록
12시까지 오늘의 점심 회의 계획의 진행 상황을 보고해줘.,요약
오늘의 할 일 리스트 진행 상황을 알려주세요.,요약
고객 서비스 개선 프로젝트의 마감일까지 계획을 마무리해줘.,등록
올해 끝나기 전에 새로운 사업 계획 진행 상황은 어떠니?,요약
등산 계획에 대한 최신 업데이트를 보여줘.,요약
휴가 전까지 휴가 동안의 업무 위임 계획을 세워봐.,등록
내부운영 1차,등록
내일까지 이번 주 업무 계획 정리하기.,등록
새로운 스타트업 아이디어에 대한 계획을 만들어 주세요.,등록
이번 달 말까지 신규 직원 온보딩 계획을 마련하자.,등록
판매 계획에 대한 최신 진행 상황을 알려줄래?,요약
"2023년 11월 20일까지, 웹사이트 개편에 대한 구체적인 계획을 만들어줘.",등록
사업 계획의 현재 상황을 알려주세요.,요약
휴가 계획에 대한 진행 상태는 어떠니?,요약
새 학기 시작 전에 학기 계획을 정리해봐.,등록
홈 스테이징 계획의 진행 상태를 알려주세요.,요약
휴가 전에 휴가 동안 읽을 책 목록의 준비 상태 확인하기.,요약
취미 클래스 참여 계획을 설정해주세요.,등록
개인 훈련 계획의 진행 상태를 요약해주세요.,요약
IT 솔루션 검토,등록
올해 끝나기 전에 내년의 업무 계획을 세워봐.,등록
언어 학습 계획의 진행 상황을 보여줘.,요약
홈 스테이징에 대한 계획을 구상해주세요.,등록
새로 배우려는 언어 학습 계획을 설정해주세요.,등록
이번 달 마지막 날까지 재무 보고서 작성 계획 진행 상황 확인하기.,요약
admin ui staff 모드에 추가해 두기,등록
오전 근무 시작 전에 오전 일과 계획의 진행 상황을 알려줘.,요약
고객 선물 준비(박스 업체 알아보기),등록
이번 주 금요일까지 향후 일정과 우선순위를 요약해서 공유해줄래?,요약
조사보고서/컨텐츠 작성 리쿠르트: wf 매뉴얼작성/컨텐츠writer,등록
온라인 판매 마케팅 전략의 진행 상황을 보고해줘.,요약
내일까지 이번 주 업무 계획 진행 상황 확인하기.,요약
여름 휴가 계획의 최신 업데이트를 알려봐.,요약
수업 시작 전에 수업 계획을 세워봐.,등록
W33-1 관심사 단어 관련 W/F 만들기(상담자료),등록
다음 분기에 대한 비즈니스 계획 진행 상황 확인하기.,요약
전화 솔루션 (3자통화),등록
명함제작- 오프린트미,등록
차주 월요일까지 새로운 고객 서비스 계획 진행 상황 파악하기.,요약
갤러리 전시회 시작 전에 전시회 계획의 진행 상황을 보고해줘.,요약
W/F리뷰- 3.2.6 prestudy 진행,등록
홍보 및 1차 영업,등록
대학원 입학 준비의 진행 사항을 요약해주세요.,요약
고객선물기획과 준비,등록
사진 촬영 세션의 진행 사항을 알려주세요.,요약
기업용 전화 및 cs통합 솔루션 쇼핑/검토 요청,등록
운동 루틴 진행상황을 업데이트해주세요.,요약
기획자 리쿠르팅,등록
이벤트 준비의 진행사항을 업데이트해주세요.,요약
새로운 팀 프로젝트 시작 전에 프로젝트 계획을 설계해줘.,등록
시나리오3 prestudy 내용 draft,등록
갤러리 전시회 시작 전에 전시회 계획을 마무리해줘.,등록
건강검진에 대한 일정을 구성해주세요.,등록
수요일까지 다음주 워크샵에 대한 아젠다를 정리해봐.,등록
신제품 개발 계획의 진행 상황을 보고해줘.,요약
내일까지 아침 회의 계획의 진행 상황을 보고해줘.,요약
영화 스크립트 작성 계획을 세워봐.,등록
정리해서 홈페이지 디자인 - 정리한 홈페이지 시안을 디자인한다.,등록
"2023년 12월 31일까지, 비즈니스 확장을 위한 전략을 개발하자.",등록
이번 주 금요일까지 팀 빌딩에 대한 아이디어 계획하기.,등록
코딩 학습을 위한 일정을 정하자.,등록
새로운 팀 프로젝트 시작 전에 프로젝트 계획의 진행 상태를 보고해줘.,요약
이번 주까지 미팅 아젠다 준비 어디까지 왔는지 알려줄래?,요약
회의 시작 전에 회의 안건 준비 상황을 알려줘.,요약
다가오는 세미나에 대한 준비 상황 어떠니?,요약
개인 목표 달성 계획을 등록하고 싶어요.,등록
가족 모임 계획을 등록하고 싶어요.,등록
봉사활동 계획을 등록해주세요.,등록
목요일까지 이번 주간 일정 계획하기.,등록
이번 달 마감일까지의 업무 진행 상황을 요약해서 보고해줄래?,요약
기술 세미나 참여 계획을 만들어주세요.,등록
이번 달 마감까지 수행된 마케팅 전략의 효과를 요약해서 알려줄래?,요약
easy task 업무 활용해보기,등록
기술 습득 계획의 진행사항을 요약해주세요.,요약
7월 31일까지 하반기 사업 계획을 마련해봐.,등록
팟캐스트 제작 계획의 현재 진행 상황을 보고해줘.,요약
연말 파티 계획을 세워주세요.,등록
연말 파티 준비 상황을 요약해주세요.,요약
코딩 학습 일정의 진행 상황을 알려줘.,요약
음악제작을 위한 계획을 조율해봐.,등록
독서 계획의 현재 상황을 알려주세요.,요약
여름 휴가를 위한 여행 일정을 계획해봐.,등록
휴가 계획의 진행 상태를 알려주세요.,요약
다가오는 독서모임 일정을 설정해주세요.,등록
새로운 취미 찾기 계획을 설정해주세요.,등록
3월 31일까지 Q1 업무 리뷰 계획 진행 상황 확인하기.,요약
판매 시작 전까지 신제품 판매 전략의 현재 상황을 알려줘.,요약
다가오는 이벤트에 대한 일정을 짜주세요.,등록
현재까지의 고객 서비스 개선 사항을 요약해서 알려줄 수 있을까?,요약
다음 달의 주요 이슈에 대한 계획 진행 상황을 파악하자.,요약
w33-2 외국/국내 전체 목록 수집하여 각 항목 별 대응 방안으로 분류,등록
워크샵의 계획을 등록하고 싶습니다.,등록
월말까지 새로운 제품 라인업에 대한 계획을 완성해봐.,등록
다이어트 계획을 등록해주세요.,등록
다음 주 회의에서 전달할 주요 포인트를 요약해서 알려줄래?,요약
자동차 보험 계획에 대한 최신 정보를 요약해주세요.,요약
큐티코리아 공인인증서 갱신,등록
사진 전시회 준비를 위한 타임라인을 구성하자.,등록
w31-1 브랜드 프리미엄화,등록
스터디 그룹의 계획 진행 상황을 알려주세요.,요약
"2023년 12월 25일까지, 크리스마스 이벤트를 위한 마케팅 전략을 세워봐.",등록
Front 응대 담당자 시험지 만들기,등록
다음 분기 마케팅 계획의 현재 상황 알려주겠니?,요약
자동차 보험 계획을 검토하고 싶어요.,등록
고객- 조사2 커피 b2b판매 경쟁사 정보 파악,등록
"홍보하기- 회사 소개서, 직업 job스펙 작성 (1차)",등록
언어 학습 계획의 진행 상태를 알려주세요.,요약
개인 프로젝트의 진행 상태를 요약해주세요.,요약
홈페이지 개발(SSLEE),등록
크리스마스 이벤트 마케팅 전략의 진행 상황을 2023년 12월 25일까지 보여줘.,요약
차주 월요일까지 팀 빌딩 활동에 대한 진행 상황을 요약해서 알려줄 수 있을까?,요약
영화 제작 계획을 작성해주세요.,등록
취업 준비 계획을 만들어주세요.,등록
브랜드 로고 디자인 계획의 진행 상황을 2023년 8월 15일까지 보고해줘.,요약
모래 조각품 만들기 계획의 최신 업데이트를 알려봐.,요약
집 수리 계획에 대한 최신 정보를 알려주세요.,요약
자격증 준비 상황을 요약해주세요.,요약
주말 일정을 등록해주세요.,등록
그룹 스터디 시작 전까지 스터디 계획을 수정해봐.,등록
다이어트 계획의 진행 상태를 요약해주세요.,요약
수업 시작 전에 수업 계획의 진행 상태를 알려줘.,요약
오늘까지 완료된 프로젝트의 결과를 요약해서 알려줄 수 있을까?,요약
담주 월요일까지 진행중인 프로젝트에 대한 수정 계획을 만들어봐.,등록
채식 요리 레시피 계획의 진행 사항을 알려줘.,요약
시장분석: 비대면 비서서비스,등록
베타 테스터 초대,등록
이번 주 회의에 다룰 주제들을 요약해서 안내해줄 수 있을까?,요약
고객 서비스 개선 프로젝트의 마감일까지 계획 진행 상황을 알려줘.,요약
일요일까지 다가오는 월요일의 업무 계획 진행 상황을 알려줘.,요약
논문 작성 계획의 진행 사항을 알려주세요.,요약
이번 주 금요일까지 팀 회의에 대한 아젠다를 등록해봐.,등록
사업 계획을 등록해주세요.,등록
차 종류에 대한 연구 계획을 만들어봐.,등록
다음 주 시작 전에 전체적인 업무 진행 상황을 요약해서 보고해줄래?,요약
새로운 기술 습득을 위한 계획을 구체화해주세요.,등록
비즈니스 확장 전략의 최신 업데이트를 2023년 12월 31일까지 보여줘.,요약
휴가 끝나기 전에 휴가 후 업무 계획을 세워봐.,등록
헬퍼 등록-test보고 통과,등록
주말 야외활동 계획을 등록해주세요.,등록
회의 시작 전에 회의 안건을 세우자.,등록
모래 조각품 만들기 위한 창조적인 계획을 창출해봐.,등록
세미나 시작 전까지 세미나 계획의 최신 상태를 보여줘.,요약
독서모임 일정의 현재 진행 상태를 전해주세요.,요약
판매 시작 전까지 신제품 판매 전략을 완성해줘.,등록
다음 분기의 비즈니스 계획의 주요 내용을 요약해서 공유해줄래?,요약
다음 분기의 비즈니스 계획의 주요 목표를 요약해서 공유해줄래?,요약
오늘까지 완료된 프로젝트의 결과를 요약해서 알려줄 수 있을까?,요약
신입 사원 교육 시작 전에 교육 계획을 세워봐.,등록
우주 탐사 계획의 현재 진행 상황을 보고해줘.,요약
개인 헬스 트레이닝 일정의 현재 상황을 2023년 10월 15일까지 알려줘.,요약
다음 분기의 비즈니스 계획의 주요 내용을 요약해서 공유해줄래?,요약
논문 작성 계획을 세워주세요.,등록
금요일 저녁까지 주말 업무 계획을 짜봐.,등록
월말까지 새로운 제품 라인업 계획의 현재 상황을 보고해줘.,요약
다음 주 시작 전에 전반적인 프로젝트 진행 상황에 대한 요약을 준비해봐.,요약
친환경 생활 계획의 최신 정보를 전해주세요.,요약
이번 주말까지 팀 빌딩을 위한 아이디어를 기획해봐.,등록
재무 관리 시스템 개선 계획의 현재 상태를 2023년 10월 10일까지 알려줘.,요약
신입 사원 교육 시작 전에 교육 계획의 진행 상황을 보여줘.,요약
피드백 리뷰와 2차 영업계획,등록
내일의 일정을 등록해주세요.,등록
다음 주 시작 전에 전반적인 업무 진행 상황을 요약해서 보고해줄래?,요약
패션 디자인 프로젝트에 대한 계획을 설정해봐.,등록
집에 가기 전까지 업무 보고서에 대한 개선 계획을 만들어봐.,등록
이번 주 금요일까지 세일즈 팀의 영업 전략 계획 진행 상황을 알려줘.,요약
스타트업 아이디어에 대한 계획의 진행 상태를 알려주세요.,요약
파트타임 리쿠르트,등록
당신의 도움으로 마라톤 훈련 계획을 세워봐요.,등록
새로운 취미 찾기 계획의 최신 정보를 요약해주세요.,요약
W/F리뷰- 3.2.1 작업등록과 업데이트1,등록
내일까지 기획회의 준비 진행 상황 알려줄 수 있을까?,요약
프로젝트 보고서 마감 일주일 전까지 보고서 작성 진행 상황을 보고해줘.,요약
강아지 훈련에 대한 상세 계획을 짜주세요.,등록
웹디자인 공부 계획의 최신 업데이트를 보여줘.,요약
골프 스윙 개선을 위한 개인 훈련 계획을 제작하자.,등록
"구인공고 등록(알바천국, 사람인, 잡코리아..)",등록
Wf중 자산관리에 관한조사,등록
마라톤 대회 참가 계획을 만들어주세요.,등록
제품준비 1차 500개,등록
영화 제작 계획의 현재 상태를 전해주세요.,요약
팟캐스트 제작에 대한 전반적인 계획을 만들어봐.,등록
점심시간 전에 점심시간 동안의 업무 계획을 세워봐.,등록
process consulting 매뉴얼 -NCM메리 자전거 CS,등록
다음 달의 주요 이슈에 대한 계획을 세우자.,등록
금요일까지 진행된 프로젝트의 주요 성과를 요약해서 보고해줄래?,요약
회의 계획의 진행 상황을 알려주세요.,요약
결제단말기 신청,등록
내일까지 이번 주 업무 계획을 수정해줘.,등록
그림 그리기 훈련 계획의 현재 상태를 보고해줘.,요약
고객 서비스 개선 계획에 대한 현재 진행 상황을 알 수 있을까?,요약
다이어리 미팅 (9/20),등록
홈페이지 제작업체 연락하기-홈페이지 제작 업체에 연락해서 필요한 내용 및 비용을 정확하게 진단한다.,등록
온라인 코스 참여 상황을 요약해주세요.,요약
이번 분기 끝나기 전에 다음 분기의 업무 계획을 세워봐.,등록
휴가 계획을 등록해주세요.,등록
방학 시작 전에 방학 학습 계획의 진행 상황을 알려줘.,요약
정원 가꾸기 일정의 현재 상태를 알려주세요.,요약
연말까지 올해의 마무리 업무 계획하기.,등록
새로운 언어를 배우기 위한 학습 계획을 구성하자.,등록
재테크에 대한 계획을 구상해주세요.,등록
비즈니스 네트워킹 이벤트 참석 계획의 진행 상황을 알려주세요.,요약
도서관 방문 계획의 진행 사항을 알려주세요.,요약
각종 통계 (트랜드) 추가해 두기 -wf 개발에 재활용,등록
연말까지 연말 이벤트에 대한 전체 계획의 진행 상황을 확인해줘.,요약
고전 음악 학습 계획의 진행 상황을 알려줘.,요약
1차 영업- 파트너,등록
w31-6 staff 1차교육,등록
wf 자료정리 - 브라우저 북마크 스크랩 정리,등록
이번 주 금요일까지 팀 빌딩에 대한 아이디어 계획 진행 상황 확인하기.,요약
교육 및 트레이닝 계획을 설계해주세요.,등록
홈페이지 글과 그림 완성,등록
w31-2 W/F 1차 완성,등록
개인 플젝의 계획을 등록하고 싶습니다.,등록
이번 주 금요일까지 향후 업무 일정을 요약해서 공유해줄래?,요약
도서 구입 계획의 최신 정보를 알려주세요.,요약
"2023년 8월 15일까지, 새로운 브랜드 로고 디자인에 대한 계획을 제작해줘.",등록
영어 공부 계획의 현재 상태를 전해주세요.,요약
오늘 저녁까지 내일의 일정 계획하기.,등록
블로그 업데이트 계획의 현재 상태를 요약해주세요.,요약
7월 31일까지 하반기 사업 계획의 진행 상황을 보고해줘.,요약
개인 사업 계획의 현재 상태를 알려주세요.,요약
도서관 방문 계획을 설정해주세요.,등록
3월 31일까지 Q1 업무 리뷰 계획하기.,등록
독서 계획을 등록하고 싶습니다.,등록
조사 자료정리22-3,등록
취미 클래스 참여 상황을 전해주세요.,요약
대회 시작 전에 대회 준비 계획을 마무리해줘.,등록
다음 주 토요일까지 봉사 활동 계획 진행 상황 파악하기.,요약
기념일 계획을 등록해주세요.,등록
이번 주 회의에서 다룰 주제들을 요약해서 안내해줄 수 있을까?,요약
티하고 쿠키소싱,등록
ting search,등록
건강 계획의 진행사항을 요약해주세요.,요약
팀 빌딩 전에 팀 빌딩 계획 진행 사항을 알 수 있을까?,요약
마라톤 대회 참가 계획의 현재 상황을 요약해주세요.,요약
포장지하고 박스 소싱,등록
일주일간의 식단 계획을 등록해주세요.,등록
봉사활동의 진행 상태를 요약해주세요.,요약
이번 달 말까지 진행된 신규 직원 온보딩 계획을 확인하자.,요약
채식 요리를 위한 레시피 계획을 구상해봐.,등록
데이트 계획의 진행 사항을 알려주세요.,요약
새로운 제품 출시 계획의 현재 상태를 알려주세요.,요약
w31-3 홈페이지 제작,등록
논문 제출 마감일 전에 논문 계획을 완성해줘.,등록
새로운 영어 공부 계획을 짜주세요.,등록
자료수집정리,등록
브랜드 프르미엄 액션 플랜 수립,등록
프로젝트 진행 상황을 알려주세요.,요약
다음 분기에 대한 비즈니스 계획 진행 상황 알려주겠니?,요약
W/F리뷰- 3.2.5다이어리 미팅,등록
이번 달 마지막 날까지 재무 보고서 작성 계획의 진행 상황 보기.,요약
w31-8 1차 영업-개인,등록
w31-4 watcher spec(wf) 완성,등록
새로운 제품 출시 계획을 세워주세요.,등록
팀 빌딩 전에 팀 빌딩 계획의 진행 상황을 보고해줘.,요약
오늘까지 진행된 프로젝트의 주요 이슈를 요약해서 공유해줄 수 있을까?,요약
다가오는 이벤트 계획을 등록하고 싶어요.,등록
오늘까지 업무 수행 내용을 등록해줄래?,등록