<?xml version="1.0" encoding="UTF-8" standalone="no"?>
<svg
   version="1.1"
   viewBox="-10 0 128 128"
   id="svg6"
   sodipodi:docname="bag.svg"
   width="128"
   height="128"
   inkscape:version="1.2.2 (1:1.2.2+202212051550+b0a8486541)"
   xmlns:inkscape="http://www.inkscape.org/namespaces/inkscape"
   xmlns:sodipodi="http://sodipodi.sourceforge.net/DTD/sodipodi-0.dtd"
   xmlns="http://www.w3.org/2000/svg"
   xmlns:svg="http://www.w3.org/2000/svg">
  <defs
     id="defs10" />
  <sodipodi:namedview
     id="namedview8"
     pagecolor="#ffffff"
     bordercolor="#666666"
     borderopacity="1.0"
     inkscape:showpageshadow="2"
     inkscape:pageopacity="0.0"
     inkscape:pagecheckerboard="0"
     inkscape:deskcolor="#d1d1d1"
     showgrid="false"
     inkscape:zoom="4.8083261"
     inkscape:cx="66.551227"
     inkscape:cy="62.495761"
     inkscape:window-width="1920"
     inkscape:window-height="1016"
     inkscape:window-x="0"
     inkscape:window-y="27"
     inkscape:window-maximized="1"
     inkscape:current-layer="svg6" />
  <path
     fill="currentColor"
     d="m 77.132531,10.281125 c 0.514056,-0.171352 0.85676,-0.257028 1.028112,-0.257028 0.171352,0 0.64257,0.21419 1.413655,0.64257 0.856761,0.42838 1.713521,0.771084 2.570281,1.028113 0.856761,0.257028 2.141901,1.242302 3.855422,2.955823 1.713521,1.713521 3.084337,2.827309 4.11245,3.341366 2.141901,1.028112 2.827309,2.056224 2.056225,3.084337 -0.171352,0.342704 -0.149932,0.556894 0.06426,0.64257 0.21419,0.08568 0.449799,0.364123 0.706827,0.835342 0.257028,0.471218 0.835341,1.392235 1.73494,2.763052 0.899599,1.370817 1.349398,2.270415 1.349398,2.698795 0,1.028113 -1.242303,3.0415 -3.726908,6.040161 -1.884873,2.398929 -2.80589,3.726908 -2.763052,3.983936 0.04284,0.257028 -0.02142,0.385542 -0.192771,0.385542 -0.171353,0 -0.257029,0.08568 -0.257029,0.257028 0,0.171352 -0.21419,0.42838 -0.64257,0.771085 -0.685408,0.342704 -1.649263,1.07095 -2.891566,2.184739 -1.242303,1.113788 -2.077644,1.970548 -2.506024,2.570281 l -0.899599,1.156626 2.056225,3.084338 c 2.912985,4.283802 4.626506,8.953146 5.140563,14.008032 0.257028,1.799197 0.385542,5.890228 0.385542,12.273093 0,6.382865 -0.08568,10.645248 -0.257028,12.787149 -0.342705,3.769746 -0.985275,6.939759 -1.927711,9.51004 -0.685409,1.799197 -2.141901,4.026775 -4.369478,6.682735 -0.514057,0.68541 -1.006694,1.49933 -1.477912,2.44176 -0.471218,0.94244 -0.813922,1.41366 -1.028113,1.41366 -0.21419,0 -0.685408,0.29987 -1.413654,0.8996 -0.728247,0.59973 -1.606426,1.15663 -2.634538,1.67068 -0.856761,0.42838 -2.291834,0.98527 -4.305221,1.67068 -2.013387,0.68541 -3.234271,1.02811 -3.662651,1.02811 -0.342704,0 -1.435074,0.21419 -3.277109,0.64258 -1.842035,0.42838 -3.748326,0.72824 -5.718875,0.89959 -1.970549,0.17135 -3.812584,0.36413 -5.526105,0.57832 -1.713521,0.21419 -3.427041,0.27844 -5.140562,0.19277 -3.855422,-0.17135 -6.382865,-0.47122 -7.58233,-0.8996 -2.056225,-0.68541 -3.512717,-0.81392 -4.369478,-0.38554 -0.342704,0.17135 -0.599732,0.19279 -0.771084,0.0643 -0.171352,-0.12851 -0.685408,-0.27844 -1.542169,-0.44979 -1.456493,-0.34271 -3.46988,-0.8996 -6.040161,-1.67069 -2.570281,-0.77108 -4.026774,-1.28514 -4.369478,-1.54217 -0.342704,-0.3427 -0.792503,-0.70682 -1.349397,-1.09237 -0.556895,-0.38554 -0.856761,-0.64257 -0.899599,-0.77108 -0.04284,-0.12851 -0.364125,-0.4498 -0.963855,-0.96386 -0.599733,-0.51405 -1.070951,-1.07095 -1.413655,-1.67068 -0.685408,-1.19947 -1.370816,-1.7992 -2.056225,-1.7992 -0.342704,0 -0.535475,-0.0428 -0.578313,-0.12851 -0.04284,-0.0857 -0.02142,-0.38554 0.06426,-0.8996 0.171352,-1.37081 -0.21419,-2.65595 -1.156627,-3.85542 -0.771084,-0.942436 -1.242302,-2.998661 -1.413654,-6.168674 -0.171353,-2.484605 -0.342705,-4.54083 -0.514057,-6.168675 -0.342704,-3.25569 0.171352,-7.239626 1.542169,-11.951808 0.771085,-2.570281 2.013387,-5.054886 3.726908,-7.453815 0.771084,-1.199465 1.756358,-2.655957 2.955823,-4.369478 2.227577,-3.25569 4.583668,-6.082999 7.068273,-8.481928 l 1.670683,-1.413655 -0.899598,-1.156627 c -0.599733,-0.771084 -1.199465,-1.49933 -1.799197,-2.184739 -0.942437,-1.028112 -1.327979,-2.613119 -1.156627,-4.75502 0.08568,-1.113789 0.342705,-2.077644 0.771085,-2.891566 0.42838,-0.813923 1.28514,-1.863454 2.570281,-3.148595 l 2.184739,-2.184739 -0.899598,-1.927711 -1.028113,-1.927711 v -3.084337 c -0.08568,-3.68407 0.471218,-6.896921 1.670683,-9.638554 0.599732,-1.456493 1.627844,-3.0415 3.084337,-4.755021 0.171352,-0.257028 0.685408,-0.471218 1.542169,-0.64257 1.285141,-0.257028 2.506024,-0.06426 3.662651,0.578313 1.156627,0.642571 2.848728,1.991968 5.076305,4.048193 1.884873,1.799197 4.11245,4.369478 6.682731,7.710844 0.257028,0.42838 1.156627,1.520749 2.698796,3.277108 1.542169,1.756359 2.548862,2.955824 3.02008,3.598394 0.471218,0.64257 0.878179,1.07095 1.220884,1.285141 0.342704,0.21419 1.242302,0.321285 2.698795,0.321285 h 2.313253 l -0.128514,-1.028113 c 0,-0.685408 -0.06426,-1.563587 -0.192771,-2.634538 -0.128514,-1.070951 -0.107094,-3.341366 0.06426,-6.811245 0.171352,-3.46988 0.171352,-6.06158 0,-7.775101 -0.171352,-1.456493 -0.171352,-2.313253 0,-2.570281 0.171352,-0.257028 0.813922,-0.514056 1.927711,-0.771084 2.313253,-0.514057 4.026773,-0.471219 5.140562,0.128514 1.113789,0.514056 1.627845,0.514056 1.542169,0 -0.08568,-0.257028 -0.385542,-0.385542 -0.899599,-0.385542 L 71.349398,13.62249 c 0.08568,-0.171352 0.342704,-0.257028 0.771084,-0.257028 0.599733,0 0.985275,-0.42838 1.156627,-1.28514 0.257028,-1.028113 0.728246,-1.199465 1.413655,-0.514056 l 0.514056,0.514056 0.64257,-0.771085 c 0.428381,-0.42838 0.856761,-0.771084 1.285141,-1.028112 z M 41.983935,23.775101 c -1.756359,-1.799197 -2.891566,-2.698795 -3.405622,-2.698795 -0.771085,0 -1.542169,0.728246 -2.313253,2.184739 -0.856761,1.799197 -1.178046,3.641232 -0.963856,5.526105 0.21419,1.884873 0.963855,3.512717 2.248996,4.883534 0.599733,0.685408 1.113789,0.985274 1.542169,0.899598 0.342704,0 1.435074,0.128514 3.277109,0.385542 1.842035,0.257029 3.319946,0.556895 4.433735,0.899599 0.771084,0.171352 1.563587,0.578313 2.37751,1.220883 0.813922,0.642571 1.392235,0.921018 1.73494,0.835342 2.056225,-0.42838 3.255689,-0.813922 3.598393,-1.156627 0.171352,-0.171352 -1.884873,-2.270415 -6.168675,-6.297189 -1.542169,-1.456493 -2.548862,-2.484605 -3.02008,-3.084337 -0.471218,-0.599733 -1.585007,-1.799197 -3.341366,-3.598394 z M 37.807228,40.03213 c -0.771084,-0.471219 -1.199464,-0.706828 -1.28514,-0.706828 -0.171352,0 -0.685408,0.492637 -1.542169,1.477912 -0.85676,0.985275 -1.370816,1.692102 -1.542169,2.120482 -0.771084,1.542169 -1.028112,2.998661 -0.771084,4.369478 0.171352,0.514057 0.406961,1.028113 0.706827,1.542169 0.299867,0.514056 0.535476,0.771084 0.706828,0.771084 0.171352,0 1.349397,-1.006693 3.534136,-3.02008 2.184739,-2.013387 3.726908,-3.298528 4.626507,-3.855422 0.899598,-0.556894 1.349397,-0.878179 1.349397,-0.963855 0,-0.08568 -0.771084,-0.278447 -2.313253,-0.578314 -1.542169,-0.299866 -2.698795,-0.685408 -3.46988,-1.156626 z"
     id="path2"
     style="stroke-width:0.128514"
     sodipodi:nodetypes="cscssccsssscssscsccccscccsssssssssccsscscsssssscccscccccsccssccccccssccssssccsscscccccscscccsscsccscscscsssssccsssssss" />
</svg>
