<?xml version="1.0" encoding="UTF-8" standalone="no"?>
<svg
   version="1.1"
   viewBox="-10 0 128 128"
   id="svg7729"
   sodipodi:docname="tea.svg"
   width="128"
   height="128"
   inkscape:version="1.2.2 (1:1.2.2+202212051550+b0a8486541)"
   xmlns:inkscape="http://www.inkscape.org/namespaces/inkscape"
   xmlns:sodipodi="http://sodipodi.sourceforge.net/DTD/sodipodi-0.dtd"
   xmlns="http://www.w3.org/2000/svg"
   xmlns:svg="http://www.w3.org/2000/svg">
  <defs
     id="defs7733" />
  <sodipodi:namedview
     id="namedview7731"
     pagecolor="#ffffff"
     bordercolor="#666666"
     borderopacity="1.0"
     inkscape:showpageshadow="2"
     inkscape:pageopacity="0.0"
     inkscape:pagecheckerboard="0"
     inkscape:deskcolor="#d1d1d1"
     showgrid="false"
     inkscape:zoom="3.4"
     inkscape:cx="98.235294"
     inkscape:cy="97.352941"
     inkscape:window-width="1920"
     inkscape:window-height="1043"
     inkscape:window-x="1920"
     inkscape:window-y="0"
     inkscape:window-maximized="1"
     inkscape:current-layer="svg7729" />
  <path
     fill="currentColor"
     d="m 47.574297,12.722892 c 1.113789,-0.171352 3.46988,-0.21419 7.068273,-0.128514 3.598394,0.08568 5.868809,0.21419 6.811245,0.385542 3.427042,0.514057 5.269077,0.899599 5.526105,1.156627 l 0.771084,1.156626 0.642571,1.156627 -0.128514,4.497992 -0.128514,4.369478 1.542168,1.670683 c 2.141901,2.313253 3.46988,4.026773 3.983936,5.140562 0.257028,0.514056 0.64257,1.49933 1.156627,2.955823 0.514056,1.456493 0.985274,2.313254 1.413654,2.570282 0.685409,0.42838 0.813923,0.64257 0.385543,0.64257 -0.08568,0.08568 -0.171352,0.08568 -0.257029,0 -0.342704,0 -0.556894,0.128514 -0.64257,0.385542 0,0.171352 0.06426,0.278447 0.192771,0.321285 0.128514,0.04284 0.406961,0.06426 0.835342,0.06426 0.771084,0 1.799196,0.128514 3.084337,0.385543 1.285141,0.257028 1.94913,0.385542 1.991968,0.385542 0.04284,0 0.192773,0.257028 0.449799,0.771084 0.171352,0.514056 0.578313,0.813922 1.220884,0.899598 0.64257,0.08568 1.906292,10e-7 3.791165,-0.257028 0.599732,-0.08568 0.985274,0.06426 1.156626,0.4498 0.171352,0.385542 -0.04284,1.178045 -0.64257,2.37751 -1.970549,3.855421 -3.512718,7.282463 -4.626506,10.281124 -0.428381,0.942437 -0.899599,2.056225 -1.413655,3.341366 -1.370817,3.512718 -2.056225,5.825971 -2.056225,6.939759 0,1.113789 0.21419,2.570281 0.64257,4.369478 1.028113,4.712183 1.842035,8.953147 2.441767,12.722892 0.771085,5.226239 1.242303,8.01071 1.413655,8.353414 0.08568,0.08568 0.278447,0.835341 0.578313,2.248996 0.299867,1.413655 0.578314,2.655957 0.835342,3.726908 0.257028,1.070951 0.42838,2.034806 0.514056,2.891566 0.257028,1.456491 0.835341,3.791161 1.73494,7.004011 0.899598,3.21285 1.49933,4.99063 1.799197,5.33334 0.299866,0.3427 0.449799,0.64256 0.449799,0.89959 0,0.68541 -1.370817,1.07096 -4.11245,1.15663 -2.056225,0.0857 -4.283802,0.21419 -6.682731,0.38554 -2.741633,0.17135 -9.231593,0.29987 -19.46988,0.38555 -10.238287,0.0857 -17.542169,0.0857 -21.911647,0 -5.226239,-0.0857 -8.846052,-0.29987 -10.859439,-0.64257 -2.013387,-0.34271 -3.319946,-0.51406 -3.919678,-0.51406 -0.514057,0 -0.835342,-0.1071 -0.963856,-0.32129 -0.128514,-0.21419 -0.06426,-0.66398 0.192771,-1.34939 0.428381,-1.45649 0.899599,-3.98394 1.413655,-7.58233 0.171352,-1.88487 0.449799,-3.61981 0.835341,-5.20482 0.385543,-1.585007 0.813923,-4.133869 1.285141,-7.646586 0.471218,-3.512718 0.771084,-5.654619 0.899598,-6.425703 0.128514,-0.771085 0.149934,-1.199465 0.06426,-1.285141 -0.08568,-0.08568 -0.64257,-0.299866 -1.670682,-0.64257 -2.056225,-0.599733 -3.941098,-2.056225 -5.654619,-4.369478 -1.799197,-2.398929 -3.041499,-4.562249 -3.726908,-6.48996 -0.685408,-1.927711 -1.113788,-4.390898 -1.28514,-7.389559 -0.08568,-2.484605 -0.21419,-3.855422 -0.385543,-4.11245 -0.08568,-0.257028 -0.02142,-1.370816 0.192771,-3.341365 0.214191,-1.970549 0.406962,-3.427042 0.578314,-4.369478 0.342704,-0.942437 0.64257,-2.82731 0.899598,-5.654619 0.257028,-2.655957 0.535475,-4.155288 0.835342,-4.497992 0.299866,-0.342704 1.563587,-0.556894 3.791164,-0.64257 2.056225,-0.08568 3.641232,-0.04284 4.755021,0.128514 l 5.654618,0.385542 c -0.42838,-0.171352 -0.685408,-0.899598 -0.771084,-2.184739 -0.171352,-1.113789 -0.02142,-1.884873 0.449799,-2.313253 0.471218,-0.428381 1.392235,-0.771085 2.763052,-1.028113 0.685409,-0.08568 1.113789,-0.235609 1.285141,-0.449799 0.171352,-0.21419 0.385542,-0.921017 0.64257,-2.120482 0.428381,-2.056225 1.370817,-3.941098 2.82731,-5.654619 0.685408,-0.85676 1.113788,-1.435073 1.28514,-1.734939 0.171352,-0.299867 0.64257,-0.706828 1.413655,-1.220884 1.370817,-0.771085 1.884873,-1.242303 1.542169,-1.413655 -0.171353,-0.171352 -0.257029,-1.585007 -0.257029,-4.240964 0,-2.655957 0.128514,-4.198126 0.385543,-4.626506 0.342704,-0.85676 0.813922,-1.435073 1.413654,-1.73494 0.599733,-0.299866 1.842035,-0.535475 3.726908,-0.706827 z m 7.453815,1.156627 c -2.056225,-0.428381 -3.427041,-0.08568 -4.112449,1.028112 -0.514057,0.599732 -0.813923,1.263721 -0.899599,1.991968 -0.08568,0.728247 -0.192771,1.135208 -0.321285,1.220884 -0.128514,0.08568 -0.171352,0.492637 -0.128514,1.220883 0.04284,0.728247 0.149935,1.135208 0.321285,1.220884 0.171352,0.171352 1.30656,0.299866 3.405623,0.385542 2.099063,0.08568 3.834002,0.321285 5.204819,0.706827 1.370817,0.385542 2.120482,0.492637 2.248996,0.321285 0.128514,-0.171352 0.149934,-1.028112 0.06426,-2.570281 -0.08568,-1.542169 -0.149933,-2.677376 -0.192771,-3.405622 C 60.575637,15.271754 60.468542,14.843374 60.297192,14.71486 60.12584,14.586346 59.419013,14.457832 58.17671,14.329318 56.934407,14.200804 55.884876,14.050871 55.028115,13.879519 Z M 29.582329,46.393576 c -3.084338,-0.685409 -4.969211,-0.728247 -5.654619,-0.128514 -0.599732,0.599732 -1.07095,2.912985 -1.413655,6.939759 -0.342704,4.026774 -0.385542,7.710844 -0.128514,11.052209 0.342704,3.68407 0.942436,6.211513 1.799197,7.58233 0.171352,0.342704 0.535475,0.835341 1.09237,1.477911 0.556894,0.642571 1.113788,1.220884 1.670682,1.73494 0.556895,0.514057 0.856761,0.728247 0.899599,0.64257 0.04284,-0.08568 0.449801,-3.148594 1.220883,-9.188755 0.771085,-6.040161 1.242303,-9.338688 1.413655,-9.895582 0.171352,-0.556895 0.364123,-1.670683 0.578313,-3.341366 0.21419,-1.670683 0.449799,-3.084337 0.706828,-4.240964 0.257028,-1.156627 0.299866,-1.820616 0.128514,-1.991968 -0.171352,-0.171352 -0.942436,-0.385542 -2.313253,-0.64257 z"
     id="path7725"
     style="stroke-width:0.128514"
     sodipodi:nodetypes="ssccccccccsccccsssscscscccscccsscsssccscsssccssssccsccsccsccccscsccsccscsssscssscsssssssssccsccssssssssc" />
</svg>
