<?xml version="1.0" encoding="UTF-8" standalone="no"?>
<!-- Created with Inkscape (http://www.inkscape.org/) -->

<svg
   width="128.0px"
   height="128.0px"
   viewBox="0 0 128.0 128.0"
   version="1.1"
   id="SVGRoot"
   sodipodi:docname="rabbit.svg"
   inkscape:version="1.2.1 (1:1.2.1+202210291244+9c6d41e410)"
   xmlns:inkscape="http://www.inkscape.org/namespaces/inkscape"
   xmlns:sodipodi="http://sodipodi.sourceforge.net/DTD/sodipodi-0.dtd"
   xmlns="http://www.w3.org/2000/svg"
   xmlns:svg="http://www.w3.org/2000/svg">
  <sodipodi:namedview
     id="namedview167530"
     pagecolor="#ffffff"
     bordercolor="#666666"
     borderopacity="1.0"
     inkscape:showpageshadow="2"
     inkscape:pageopacity="0.0"
     inkscape:pagecheckerboard="0"
     inkscape:deskcolor="#d1d1d1"
     inkscape:document-units="px"
     showgrid="true"
     inkscape:zoom="4.2835116"
     inkscape:cx="79.140675"
     inkscape:cy="86.844635"
     inkscape:window-width="1920"
     inkscape:window-height="1043"
     inkscape:window-x="1920"
     inkscape:window-y="0"
     inkscape:window-maximized="1"
     inkscape:current-layer="layer1">
    <inkscape:grid
       type="xygrid"
       id="grid167653" />
  </sodipodi:namedview>
  <defs
     id="defs167525" />
  <g
     inkscape:label="Layer 1"
     inkscape:groupmode="layer"
     id="layer1">
    <path
       d="m 79.013537,72.745298 c -0.504688,0 -1.035662,0.04206 -1.603436,0.131429 -3.979676,0.604574 -5.325511,2.013495 -5.14151,5.38334 0.189258,3.39613 3.1175,4.920709 5.935342,4.920709 1.966181,0 3.790418,-0.741261 4.889166,-1.981952 0.977833,-1.098749 1.361606,-2.539212 1.146063,-4.284592 -0.325945,-2.644355 -2.234297,-4.168934 -5.225625,-4.168934 m -28.86185,0.0736 c -0.341716,0 -0.693946,0.02103 -1.051434,0.06309 -1.666522,0.20503 -3.864018,0.783318 -4.910194,2.37624 -0.762289,1.15132 -0.841147,2.760013 -0.247087,4.794537 0.788575,2.702184 2.907214,3.275215 4.542193,3.275215 2.749498,0 5.667226,-1.640236 6.787003,-3.816703 0.841147,-1.619208 0.625603,-3.338302 -0.641374,-5.109967 -0.294402,-0.425831 -1.913609,-1.582408 -4.479107,-1.582408 M 64.53004,112.5 C 53.390102,112.5 42.691766,107.85792 35.920534,100.07206 29.911592,93.174651 27.435466,84.479296 28.765529,74.93228 30.111364,65.269606 35.468418,59.597122 41.435303,54.297897 40.983187,52.058343 40.000096,49.26153 38.964434,46.328031 36.425222,39.115197 33.276179,30.141212 35.768076,22.912606 c 1.472007,-4.253048 5.746085,-7.102433 10.651022,-7.102433 3.685274,0 7.149748,1.640236 9.504959,4.500135 l 0.226058,0.273373 0.07886,0.346973 c 1.771665,7.79638 2.681155,16.570592 2.712698,26.09658 0.178744,0.0053 6.955233,-0.08411 8.348382,-0.08411 0.425831,0 0.846404,0.0053 1.245949,0.01051 0.641374,-3.117501 0.830632,-6.818547 1.009376,-10.409192 C 70.039554,26.703024 70.596814,15.542057 81.44235,15.5 c 3.900819,0 6.797518,1.419435 8.653298,4.216248 6.056257,9.089643 -1.487778,29.492711 -3.212129,33.85616 0.94629,1.22492 1.945152,2.418297 2.959785,3.622188 4.373964,5.204596 8.895128,10.582679 9.625874,19.41472 C 100.6573,90.85624 92.461372,101.5388 84.391619,106.79072 78.661307,110.52856 71.790189,112.5 64.53004,112.5"
       style="fill:currentColor;fill-opacity:1;fill-rule:nonzero;stroke:none;stroke-width:5.25717"
       id="path62356" />
    <g
       id="g62358"
       transform="matrix(5.4162066,0,0,-5.4162066,48.020847,82.374481)">
      <path
         d="m 0,0 c -0.471,0 -0.562,0.315 -0.593,0.419 -0.06,0.208 -0.108,0.495 0.012,0.677 0.108,0.166 0.368,0.281 0.731,0.326 0.057,0.007 0.113,0.011 0.165,0.011 0.37,0 0.597,-0.157 0.633,-0.196 C 1.113,1.003 1.146,0.781 1.039,0.572 0.873,0.251 0.417,0 0,0 M 5.651,0.028 C 5.569,0.028 4.843,0.046 4.807,0.697 4.782,1.121 4.846,1.318 5.544,1.424 5.638,1.439 5.725,1.446 5.806,1.446 6.234,1.446 6.475,1.262 6.52,0.9 6.55,0.654 6.5,0.455 6.37,0.309 6.215,0.133 5.946,0.028 5.651,0.028 M 6.279,12.901 H 6.278 6.268 C 3.937,12.893 3.817,10.528 3.723,8.629 3.693,8.043 3.663,7.443 3.578,6.92 H 3.572 C 3.306,6.92 3.019,6.916 2.747,6.912 2.579,6.909 2.417,6.906 2.27,6.905 2.247,8.63 2.072,10.224 1.749,11.648 l -0.03,0.132 -0.085,0.104 c -0.503,0.609 -1.242,0.959 -2.029,0.959 -1.052,0 -1.973,-0.619 -2.293,-1.541 -0.506,-1.47 0.112,-3.229 0.61,-4.643 0.169,-0.481 0.331,-0.941 0.423,-1.321 -1.088,-0.981 -2.118,-2.127 -2.377,-3.985 -0.264,-1.9 0.229,-3.632 1.428,-5.008 1.34,-1.541 3.456,-2.461 5.656,-2.461 1.435,0 2.796,0.391 3.933,1.133 2.044,1.33 3.192,3.629 2.995,6.001 C 9.833,2.788 8.903,3.894 8.083,4.869 7.928,5.054 7.774,5.236 7.626,5.423 c 0.443,1.145 1.7,4.785 0.524,6.551 -0.281,0.423 -0.835,0.927 -1.871,0.927 M 0,-0.567 c 1.024,0 2.21,1.005 1.4,2.146 C 1.284,1.742 0.882,2 0.315,2 0.24,2 0.162,1.995 0.081,1.985 -0.799,1.876 -1.467,1.388 -1.137,0.26 -0.966,-0.325 -0.503,-0.567 0,-0.567 m 5.651,0.028 c 0.775,0 1.555,0.508 1.431,1.51 C 7.009,1.556 6.582,2.013 5.806,2.013 5.697,2.013 5.581,2.004 5.459,1.985 4.65,1.862 4.191,1.539 4.24,0.665 4.286,-0.141 4.967,-0.539 5.651,-0.539 m 0.628,12.873 c 3.017,0 1.483,-5.131 0.7,-7 C 7.922,4.062 9.245,3.017 9.415,0.971 9.617,-1.465 8.326,-3.435 6.676,-4.508 5.586,-5.218 4.317,-5.549 3.052,-5.549 c -3.567,0 -7.106,2.63 -6.523,6.823 0.248,1.781 1.251,2.817 2.436,3.857 -0.223,1.475 -1.769,4.095 -1.116,5.986 0.254,0.735 0.988,1.159 1.756,1.159 0.573,0 1.165,-0.235 1.591,-0.753 0.351,-1.545 0.52,-3.271 0.508,-5.176 0.093,-0.008 0.228,-0.01 0.389,-0.01 0.405,0 0.978,0.017 1.479,0.017 0.166,0 0.324,-0.002 0.466,-0.007 0.572,2.216 -0.324,5.978 2.232,5.987 h 0.009"
         style="fill:#000000;fill-opacity:1;fill-rule:nonzero;stroke:none"
         id="path62360" />
    </g>
  </g>
</svg>
