<?xml version="1.0" encoding="UTF-8" standalone="no"?>
<svg
   version="1.1"
   viewBox="-10 0 128 128"
   id="svg6"
   sodipodi:docname="hammer.svg"
   width="128"
   height="128"
   inkscape:version="1.2.2 (1:1.2.2+202212051550+b0a8486541)"
   xmlns:inkscape="http://www.inkscape.org/namespaces/inkscape"
   xmlns:sodipodi="http://sodipodi.sourceforge.net/DTD/sodipodi-0.dtd"
   xmlns="http://www.w3.org/2000/svg"
   xmlns:svg="http://www.w3.org/2000/svg">
  <defs
     id="defs10" />
  <sodipodi:namedview
     id="namedview8"
     pagecolor="#ffffff"
     bordercolor="#666666"
     borderopacity="1.0"
     inkscape:showpageshadow="2"
     inkscape:pageopacity="0.0"
     inkscape:pagecheckerboard="0"
     inkscape:deskcolor="#d1d1d1"
     showgrid="false"
     inkscape:zoom="4.8083261"
     inkscape:cx="52.617063"
     inkscape:cy="68.734939"
     inkscape:window-width="1920"
     inkscape:window-height="1016"
     inkscape:window-x="0"
     inkscape:window-y="27"
     inkscape:window-maximized="1"
     inkscape:current-layer="svg6" />
  <path
     fill="currentColor"
     d="m 48.36236,20.75676 c 1.067733,-0.512513 1.68702,-0.76877 1.85786,-0.76877 0.17084,0 0.726063,0.170837 1.66567,0.51251 0.854187,0.256253 1.366697,0.51251 1.53753,0.76877 0.17084,0.256253 0.384387,1.15315 0.64064,2.69069 0.427093,2.64798 1.067737,4.228227 1.92193,4.74074 0.256253,0.08542 1.302633,-0.448447 3.13914,-1.6016 1.8365,-1.153153 3.181843,-1.85786 4.03603,-2.11412 1.3667,-0.427093 3.45946,-1.23857 6.27828,-2.43443 1.3667,-0.597933 2.37037,-0.918253 3.01101,-0.96096 0.64064,-0.04273 1.195863,-0.320343 1.66567,-0.83283 0.4698,-0.512513 0.83283,-0.747417 1.08909,-0.70471 0.256253,0.04273 1.06773,0.192217 2.43443,0.44845 1.3667,0.256253 2.349017,0.55522 2.94695,0.8969 0.597927,0.341673 1.323983,0.683347 2.17817,1.02502 0.854193,0.341673 1.494837,0.68335 1.92193,1.02503 0.427093,0.341673 1.110443,1.217213 2.05005,2.62662 0.939607,1.409413 1.708373,2.626633 2.3063,3.65166 0.427093,0.854187 0.918253,1.687017 1.47348,2.49849 0.55522,0.81148 1.046377,1.772443 1.47347,2.88289 1.53754,3.75842 2.733403,7.644973 3.58759,11.65966 0.341673,1.793793 0.42709,3.37404 0.25625,4.74074 -0.170833,2.220887 -0.811473,3.92926 -1.92192,5.12512 -0.768767,1.025027 -3.117783,2.519857 -7.04705,4.48449 -1.02502,0.512513 -2.370363,1.302637 -4.03603,2.37037 -1.665667,1.067733 -3.13914,1.943273 -4.42042,2.62662 -1.28128,0.683353 -2.178177,1.238577 -2.69069,1.66567 l -0.76877,0.64064 0.64064,1.15315 c 0.683347,1.195867 1.622953,2.47715 2.81882,3.84385 0.341673,0.427093 0.747413,1.131797 1.21722,2.11411 0.4698,0.98232 0.939603,1.857863 1.40941,2.62663 0.4698,0.768767 1.06773,1.79379 1.79379,3.07507 0.72606,1.281287 1.388053,2.284957 1.98598,3.01101 0.597933,0.72606 1.153157,1.665667 1.66567,2.81882 0.512513,1.153153 1.110443,2.114117 1.79379,2.88289 0.683353,0.768767 1.323997,1.580243 1.92193,2.43443 0.939607,1.45212 2.391723,3.203203 4.35635,5.25325 0.427093,0.427093 0.939607,1.110443 1.53754,2.05005 0.597933,0.93961 1.1318,1.58025 1.6016,1.92193 0.469807,0.34167 0.875547,0.76877 1.21722,1.28128 0.427093,0.76877 0.256257,1.45212 -0.51251,2.05005 -2.050053,1.79379 -3.374047,2.90424 -3.97198,3.33133 -0.597927,0.42709 -1.409403,0.81148 -2.43443,1.15315 -1.3667,0.51251 -2.562563,0.98232 -3.58759,1.40941 -1.19586,0.59793 -2.028693,0.70471 -2.4985,0.32032 -0.4698,-0.38439 -1.38805,-1.85786 -2.75475,-4.42042 -1.19586,-2.47714 -2.050047,-4.1001 -2.56256,-4.86887 -1.62296,-2.64798 -3.374047,-5.893893 -5.25326,-9.73774 -1.19586,-2.39172 -2.647977,-5.210537 -4.35635,-8.45645 -1.70838,-3.245913 -2.79747,-5.424093 -3.26727,-6.53454 -0.4698,-1.11044 -0.83283,-1.75108 -1.08909,-1.92192 -0.256253,-0.17084 -1.19586,0.08542 -2.81882,0.76877 -1.622953,0.683353 -2.79746,1.153157 -3.52352,1.40941 -0.72606,0.256253 -1.1318,0.51251 -1.21722,0.76877 -0.08542,0.256253 0,1.644307 0.25626,4.16416 0.256253,2.519853 0.4698,4.164167 0.64064,4.93294 0.256253,1.02502 0.640637,2.092753 1.15315,3.2032 0.683353,1.45212 0.811483,2.562563 0.38439,3.33133 -0.854193,1.28128 -2.178187,1.110443 -3.97198,-0.51251 -0.768767,-0.683353 -1.302633,-1.110447 -1.6016,-1.28128 -0.298967,-0.17084 -0.875543,-0.29897 -1.72973,-0.38439 -1.025027,-0.170833 -1.879213,-0.448443 -2.56256,-0.83283 -0.683353,-0.384387 -1.238577,-0.57658 -1.66567,-0.57658 -0.854187,0 -1.580243,-0.298963 -2.17817,-0.89689 -0.25626,-0.25626 -0.469807,-0.38439 -0.64064,-0.38439 -0.25626,0 -0.875547,0.469803 -1.85786,1.40941 -0.98232,0.939607 -1.687027,1.751083 -2.11412,2.43443 -1.19586,1.70838 -2.56256,3.502177 -4.1001,5.38139 -1.537533,1.87921 -2.519847,2.90423 -2.94694,3.07507 -0.512513,0.17084 -0.832833,0.10678 -0.96096,-0.19219 -0.128133,-0.29897 -0.23491,-1.04638 -0.32033,-2.24224 -0.256253,-3.673007 -0.811473,-7.04705 -1.66566,-10.12213 -0.512513,-1.879207 -1.00367,-3.86519 -1.47347,-5.95795 -0.469807,-2.09276 -0.79013,-3.13914 -0.96097,-3.13914 -0.170833,0 -0.61928,0.19219 -1.34534,0.57657 -0.72606,0.384387 -1.238573,0.57658 -1.53754,0.57658 -0.298967,0 -0.533867,0.106773 -0.7047,0.32032 -0.17084,0.213547 -0.512517,0.40574 -1.02503,0.57658 -0.512513,0.170833 -1.388053,0.61928 -2.62662,1.34534 -1.238573,0.72606 -2.071407,1.17451 -2.4985,1.34535 -0.939607,0.170833 -2.263597,0.854183 -3.97197,2.05005 -0.768773,0.597933 -1.687027,1.04638 -2.75476,1.34534 -1.067733,0.298967 -1.68702,0.57658 -1.85786,0.83284 -0.512513,0.597927 -1.025027,0.811473 -1.53754,0.64064 -0.597927,-0.17084 -0.469797,-0.768773 0.38439,-1.7938 0.683347,-0.854187 1.580243,-2.818817 2.69069,-5.89389 0.427093,-1.025027 0.875543,-2.028697 1.34535,-3.01101 0.4698,-0.982313 1.02502,-2.349013 1.66566,-4.1001 0.64064,-1.751087 1.217217,-3.203207 1.72973,-4.35636 0.512513,-1.153153 0.81148,-2.071403 0.8969,-2.75475 0.08542,-0.512513 0.02136,-0.939607 -0.19219,-1.28128 C 19.191863,65.64431 18.572577,65.089087 17.54755,64.32032 16.01001,63.12446 12.379713,59.579583 6.65666,53.68569 4.5211867,51.550217 2.94094,50.055387 1.91592,49.2012 0.89089333,48.347013 0.18618667,47.749083 -0.1982,47.40741 c -0.38438,-0.34168 -0.44844333,-0.640647 -0.19219,-0.8969 0.42709333,-0.427093 1.06773333,-0.68335 1.92192,-0.76877 0.8541867,-0.08542 2.60527,-0.08542 5.25325,0 3.245913,0.17084 5.63764,0.384387 7.17518,0.64064 1.53754,0.25626 2.86153,0.29897 3.97197,0.12813 l 1.7938,-0.38438 -0.12813,-0.76877 C 19.51218,44.844847 19.38405,43.2646 19.21321,40.61662 18.786117,33.185187 18.487153,28.999667 18.31632,28.06006 c -0.427093,-2.477147 -0.469803,-4.014683 -0.12813,-4.61261 0.256253,-0.34168 0.51251,-0.51252 0.76877,-0.51252 0.512513,0 1.879213,1.49483 4.1001,4.48449 1.3667,1.879213 3.587587,4.18552 6.66266,6.91892 0.683347,0.597933 1.537533,1.49483 2.56256,2.69069 1.025027,1.19586 1.90057,2.007337 2.62663,2.43443 0.72606,0.427093 1.217217,0.854187 1.47347,1.28128 0.512513,0.854193 1.622957,0.51252 3.33133,-1.02502 1.110447,-1.025027 2.242247,-1.94328 3.3954,-2.75476 1.153153,-0.811473 1.72973,-1.30263 1.72973,-1.47347 0,-0.170833 -0.661997,-0.9396 -1.98599,-2.3063 -1.323987,-1.3667 -2.15682,-2.13547 -2.4985,-2.30631 -0.597927,-0.341673 -0.89689,-0.59793 -0.89689,-0.76877 0,-0.17084 -0.192193,-0.427097 -0.57658,-0.76877 -0.384387,-0.341673 -0.53387,-0.64064 -0.44845,-0.8969 0.17084,-0.341673 0.81148,-1.19586 1.92192,-2.56256 1.110447,-1.3667 1.879217,-2.263597 2.30631,-2.69069 1.3667,-1.11044 2.562563,-1.66566 3.58759,-1.66566 0.341673,0 1.046377,-0.256257 2.11411,-0.76877 z"
     id="path2"
     style="stroke-width:0.128128"
     sodipodi:nodetypes="sscsccsccccccsssscsccccsssscccssssssccssccsccscccsssssssccccscssssscscsccsssssssccsccccssscsccsssscsccscccsccssscssscsscscss" />
</svg>
