<?xml version="1.0" encoding="UTF-8" standalone="no"?>
<svg
   version="1.1"
   viewBox="0 0 128 128"
   id="svg6"
   sodipodi:docname="cult.svg"
   width="128"
   height="128"
   inkscape:version="1.2.2 (1:1.2.2+202212051550+b0a8486541)"
   xmlns:inkscape="http://www.inkscape.org/namespaces/inkscape"
   xmlns:sodipodi="http://sodipodi.sourceforge.net/DTD/sodipodi-0.dtd"
   xmlns="http://www.w3.org/2000/svg"
   xmlns:svg="http://www.w3.org/2000/svg">
  <defs
     id="defs10" />
  <sodipodi:namedview
     id="namedview8"
     pagecolor="#ffffff"
     bordercolor="#666666"
     borderopacity="1.0"
     inkscape:showpageshadow="2"
     inkscape:pageopacity="0.0"
     inkscape:pagecheckerboard="0"
     inkscape:deskcolor="#d1d1d1"
     showgrid="false"
     inkscape:zoom="3.4"
     inkscape:cx="154.85294"
     inkscape:cy="124.55882"
     inkscape:window-width="1920"
     inkscape:window-height="1016"
     inkscape:window-x="0"
     inkscape:window-y="27"
     inkscape:window-maximized="1"
     inkscape:current-layer="svg6" />
  <path
     fill="currentColor"
     d="m 125.87602,63.41474 c 0.712,0.802334 0.62186,1.515074 -0.26651,2.132427 -0.0903,0 -0.17854,0.111826 -0.26673,0.333437 -0.0903,0.221612 -0.17854,0.333438 -0.26672,0.333438 -0.35708,0.447412 -1.02395,0.757217 -2.00268,0.935752 l -0.40014,0.133418 c 0.17638,0.266728 0.26673,0.445264 0.26673,0.533457 0.17853,0.447412 0.1334,0.847559 -0.13332,1.202476 -0.44741,0.535606 -0.86904,1.383162 -1.2692,2.538272 -0.40229,1.1594 -0.73572,1.959595 -1.00245,2.404853 -0.0903,0.266728 -0.33559,0.735625 -0.73573,1.4025 -0.40231,0.666875 -0.69266,1.180993 -0.86905,1.535919 -0.26672,0.445264 -0.66902,1.023945 -1.20247,1.735932 -0.5356,0.714141 -0.89267,1.202476 -1.06907,1.469204 -0.0882,0.178536 -0.28821,0.378555 -0.60005,0.600166 -0.31196,0.22376 -0.51197,0.378662 -0.60017,0.466855 -0.0903,0.178536 -0.49049,0.733477 -1.20248,1.669228 -0.71414,0.933603 -1.29067,1.624106 -1.73593,2.069375 -0.17853,0.09034 -1.78105,1.469204 -4.80767,4.140895 -0.0882,0.08819 -0.22161,0.245244 -0.40015,0.466856 -0.17853,0.221611 -0.35707,0.378661 -0.53345,0.466855 -0.18069,0.180684 -0.58084,0.490488 -1.20248,0.935752 -0.6238,0.445264 -1.06906,0.757217 -1.3358,0.933603 -0.62379,0.533458 -1.15725,1.069063 -1.60252,1.602524 -0.98087,1.157255 -2.31665,2.183346 -4.007377,3.071728 -0.08819,0.09034 -0.800185,0.623799 -2.13598,1.602524 -0.08819,0.09034 -0.178535,0.133311 -0.266728,0.133311 -0.447412,0.266728 -1.023945,0.690507 -1.735932,1.269191 -0.714141,0.580832 -1.1594,0.959382 -1.335796,1.135772 -0.625947,0.44741 -1.335796,0.84756 -2.138125,1.20248 -1.959595,0.98086 -3.471765,1.73808 -4.540833,2.27154 -0.35707,0.0882 -0.823818,0.24524 -1.4025,0.46685 -0.580829,0.22162 -1.002461,0.37867 -1.269191,0.46686 -0.35707,0.17854 -0.823818,0.40015 -1.4025,0.66688 -0.580829,0.26887 -0.959385,0.49048 -1.135772,0.66902 -0.35707,0.0903 -0.757217,0.17853 -1.202476,0.26673 -0.35707,0.0882 -0.823818,0.31195 -1.4025,0.66687 -0.580829,0.35707 -1.002461,0.58083 -1.269191,0.66902 -0.09034,0 -0.402295,0.0452 -0.935752,0.13342 -0.09034,0.0903 -0.178536,0.13331 -0.266728,0.13331 h -0.266728 c -1.1594,0.71414 -3.11685,1.29068 -5.876618,1.73593 -0.445264,0 -1.023945,0.11183 -1.735932,0.33344 -0.714141,0.22376 -1.1594,0.33344 -1.335796,0.33344 -0.714141,0.17854 -1.202476,0.26673 -1.469204,0.26673 h -5.743419 c -1.19603,-0.0603 -2.480269,-0.16779 -3.852684,-0.32055 -1.049727,-0.11612 -2.088713,-0.27962 -3.127696,-0.4689 -1.084102,-0.19572 -2.628615,-0.46674 -4.637721,-0.81092 -1.871397,-0.35278 -3.252414,-0.62165 -4.140796,-0.80019 -0.35707,-0.086 -1.116434,-0.26673 -2.271544,-0.53346 -1.1594,-0.26672 -2.049927,-0.44311 -2.671581,-0.53345 -0.445264,-0.0882 -1.090547,-0.1549 -1.935956,-0.20013 -0.847559,-0.043 -1.4025,-0.0666 -1.669228,-0.0666 -0.447412,-0.0882 -1.292819,-0.22161 -2.538272,-0.40015 -2.493051,-0.44311 -3.962255,-0.70984 -4.407524,-0.80018 -3.652561,-0.88838 -5.655221,-1.37888 -6.010147,-1.46921 -2.13598,-0.71199 -3.250269,-1.11214 -3.338456,-1.20247 -0.802335,-0.44527 -1.292819,-0.84541 -1.469204,-1.20248 0,-0.17639 -0.133418,-0.35492 -0.400147,-0.53346 -0.533457,-0.35492 -0.623799,-0.66902 -0.266728,-0.93575 v -0.13342 C 16.75849,99.920012 16.579954,99.429519 16.491761,99.072459 l -0.266728,-0.133418 c 0.08819,0.447412 -0.02148,0.780849 -0.333438,1.002461 -0.314101,0.223758 -0.690507,0.290468 -1.135772,0.200128 -0.445263,-0.0882 -1.066914,-0.154903 -1.869252,-0.200128 -0.802334,-0.04297 -1.247598,-0.0666 -1.335796,-0.0666 -0.802334,0 -1.269081,-0.04297 -1.4025,-0.13331 C 10.012709,99.655545 9.7459799,99.541571 9.345834,99.408152 8.9435387,99.274734 8.6315864,99.141317 8.4099749,99.007899 8.1883634,98.874481 7.9861955,98.674461 7.8098094,98.407733 7.2763523,97.607548 7.0096243,96.985895 7.0096243,96.538481 c 0,-0.178535 0.2194632,-1.023945 0.666875,-2.538272 0.1763872,-0.621651 0.266728,-0.97872 0.266728,-1.069062 0.266728,-0.621651 0.5334571,-1.112144 0.8001851,-1.469204 0.3549216,-0.621651 0.8023345,-1.288529 1.3357956,-2.002671 0,-0.08819 0.309806,-0.48834 0.933603,-1.202476 C 10.5654,87.72119 10.253446,87.366269 10.077059,87.187733 7.941079,87.011346 6.738603,86.921005 6.471875,86.921005 5.581348,86.83496 4.914473,86.6112 4.469204,86.25413 3.578677,85.718525 3.088187,85.006532 3,84.116005 c 0,-1.421838 0.042969,-2.31451 0.1333101,-2.669436 0,-0.178535 0.1763872,-0.935752 0.5334571,-2.271544 0,-0.178535 0.088194,-0.445263 0.266728,-0.802334 0.8001851,-2.404853 1.869252,-4.362292 3.205037,-5.876618 0.3549216,-0.535606 0.8883787,-0.890527 1.602524,-1.069063 0.3549216,-0.08819 0.623799,-0.445263 0.8023345,-1.069062 V 70.09122 l 0.1334179,-0.935753 c 0,-0.08819 -0.3141017,-0.221611 -0.9357524,-0.400147 -0.3570699,0 -0.5334571,-0.176387 -0.5334571,-0.533457 0,-0.08604 -0.1785355,-0.266728 -0.5334571,-0.533457 -0.090342,0 -0.4474118,-0.176387 -1.0690625,-0.533457 C 5.9812805,66.800027 5.536017,66.485926 5.2692835,66.219197 4.7358264,65.864275 4.1549945,65.373786 3.5333515,64.749993 3.354816,64.571457 3.2666235,64.304729 3.2666235,63.947658 c 0.088194,-0.535605 0.5356054,-1.247598 1.335796,-2.138125 1.957439,-2.404853 3.071728,-3.783725 3.338456,-4.140796 0.5356054,-0.533457 1.290674,-1.112144 2.2715435,-1.735932 0.621651,-0.354922 1.6456,-0.933603 3.071729,-1.735932 0.08605,0 0.309805,-0.04297 0.666874,-0.13331 0.354922,-0.08819 0.578682,-0.221504 0.669024,-0.400039 0.443115,-0.445264 0.666875,-0.845411 0.666875,-1.202476 -0.09034,-0.08819 -0.09034,-0.221612 0,-0.400147 0.08819,-0.176387 0.133418,-0.309805 0.133418,-0.400147 0.08819,-1.690711 0.08819,-2.671581 0,-2.938309 V 48.322298 C 14.975075,47.612455 14.708346,45.91959 14.620154,43.248009 v -0.935753 c 0.08819,-0.888378 0.62165,-2.002671 1.602524,-3.338456 0.62165,-1.069062 1.82413,-1.647745 3.605184,-1.735932 0.178535,0 1.557402,0.08819 4.140796,0.266728 l 0.271025,0.13127 c 1.15511,0 1.735932,0.490488 1.735932,1.469204 0.266728,-0.08819 0.48834,-0.176387 0.666875,-0.266728 0.176387,-0.08604 0.354922,-0.243096 0.533457,-0.466855 0.176388,-0.219464 0.309805,-0.376514 0.400147,-0.466856 v -0.124717 c -0.266728,-0.62165 0.133418,-1.202476 1.202476,-1.735932 1.335796,-0.711992 3.024351,-1.469204 5.074289,-2.271544 0.178536,-0.08819 0.48834,-0.176387 0.935753,-0.266728 0.445263,-0.08819 0.757217,-0.176387 0.935752,-0.266728 0.08605,0 0.20002,-0.06671 0.333438,-0.200127 0.133418,-0.133418 0.243095,-0.200128 0.333437,-0.200128 0.445264,-0.176387 0.802335,-0.266728 1.069063,-0.266728 0.445263,0 1.157255,0.04523 2.138125,0.133418 1.869252,0.178536 3.516997,0.35707 4.94098,0.533457 0.268877,0 0.645283,0.04512 1.135772,0.133311 0.490487,0.09034 0.778701,0.13331 0.869043,0.13331 0.08819,0 0.176387,-0.04297 0.266728,-0.13331 0.352773,-0.266728 1.021796,-0.178536 2.002671,0.266728 0.354921,0.178535 1.82413,0.800185 4.407623,1.869252 1.602524,0.71414 2.447929,1.114289 2.538272,1.202476 0.266728,0.09034 0.669023,0.290361 1.202476,0.602314 0.535605,0.311954 0.97872,0.533458 1.335796,0.666875 0.354921,0.133418 0.82167,0.290469 1.4025,0.466856 0.578681,0.178535 1.00246,0.311953 1.269191,0.400147 0.800185,0.266728 1.421838,0.533457 1.869252,0.800185 0.535605,0.35707 1.314302,0.669023 2.338248,0.935752 1.021796,0.266728 1.712304,0.490488 2.069375,0.666875 0.443115,0.180684 1.112144,0.490488 2.002671,0.935753 0.888378,0.447412 1.555257,0.759365 2.002671,0.935752 0.62165,0.266728 1.557402,0.690508 2.805,1.269191 1.247598,0.58083 2.138125,0.959385 2.671581,1.135772 0.266728,0.08819 0.688359,0.288213 1.269191,0.600166 0.578681,0.311953 1.00246,0.511973 1.269191,0.600165 0.802334,0.354922 1.647745,0.623799 2.538272,0.800185 1.871397,0.533457 3.11685,0.757217 3.740649,0.666875 0.08819,0 0.402295,0.178536 0.935752,0.533457 0.08604,0 0.266728,0.133418 0.533457,0.400147 0.08819,0 1.602524,0.221612 4.540932,0.666875 0.266728,0.08819 0.533457,0.178536 0.800185,0.266728 0.533457,0.180684 1.557402,0.133418 3.071728,-0.13331 2.138125,-0.443115 3.516997,-0.576425 4.140796,-0.400039 0.44526,0.09034 1.91447,0.533457 4.40752,1.335796 l 1.73594,0.666875 0.13342,-0.133418 -0.13331,-1.069062 c -0.18069,-0.533457 -0.11397,-1.069063 0.20012,-1.602524 0.31196,-0.533457 0.73573,-0.755069 1.26919,-0.666875 0.712,0 1.69071,0.400147 2.93831,1.202476 1.06907,0.533457 2.58124,1.735932 4.54083,3.605184 0.17639,0.178535 0.41949,0.378555 0.73359,0.600165 0.3097,0.22376 0.50972,0.378662 0.60006,0.466856 2.49101,2.047782 3.91715,3.250269 4.2742,3.605184 0.26672,0.266728 1.46706,1.514326 3.60518,3.738493 0.0861,0.09034 0.37641,0.402295 0.8669,0.935752 0.48823,0.535605 0.86893,0.935752 1.13566,1.202476 z"
     id="path2" />
</svg>
