<?xml version="1.0" encoding="UTF-8" standalone="no"?>
<svg
   version="1.1"
   viewBox="0 0 128 128"
   id="svg6"
   sodipodi:docname="eyrie.svg"
   width="128"
   height="128"
   inkscape:version="1.2.2 (1:1.2.2+202212051550+b0a8486541)"
   xmlns:inkscape="http://www.inkscape.org/namespaces/inkscape"
   xmlns:sodipodi="http://sodipodi.sourceforge.net/DTD/sodipodi-0.dtd"
   xmlns="http://www.w3.org/2000/svg"
   xmlns:svg="http://www.w3.org/2000/svg">
  <defs
     id="defs10" />
  <sodipodi:namedview
     id="namedview8"
     pagecolor="#ffffff"
     bordercolor="#666666"
     borderopacity="1.0"
     inkscape:showpageshadow="2"
     inkscape:pageopacity="0.0"
     inkscape:pagecheckerboard="0"
     inkscape:deskcolor="#d1d1d1"
     showgrid="false"
     inkscape:zoom="0.85"
     inkscape:cx="304.11765"
     inkscape:cy="501.76471"
     inkscape:window-width="1920"
     inkscape:window-height="1016"
     inkscape:window-x="0"
     inkscape:window-y="27"
     inkscape:window-maximized="1"
     inkscape:current-layer="svg6" />
  <path
     fill="currentColor"
     d="m 120.12759,101.11746 c 0.21118,0.42469 0.26238,0.85289 0.14508,1.27524 -0.10793,0.53273 -0.69223,1.53949 -1.75055,3.02496 -0.7439,1.06301 -1.75301,2.01575 -3.02484,2.86524 -0.10793,0.10793 -0.3191,0.21352 -0.6382,0.3191 -0.31676,0.10793 -0.53028,0.15961 -0.63586,0.15961 -2.65407,1.37976 -5.04059,2.06965 -7.16191,2.06965 -1.38212,-0.10558 -3.02474,0.37313 -4.93488,1.43145 -0.8495,0.3191 -1.48781,0.37312 -1.91016,0.15961 -0.319105,-0.10325 -0.743792,-0.0516 -1.274187,0.15961 -2.123676,1.16859 -4.191096,1.96406 -6.206832,2.3864 -0.532734,0.10559 -2.388864,0.3191 -5.570856,0.63586 -2.759652,0.21352 -5.2002,0.42469 -7.321524,0.63586 -0.213516,0 -0.581954,-0.10559 -1.112344,-0.3191 -0.955078,-0.3191 -3.130428,-0.52793 -6.526056,-0.63586 -0.213516,0 -2.015748,-0.15961 -5.411364,-0.47871 -0.105586,-0.10559 -0.373126,-0.15961 -0.795469,-0.15961 -0.424687,0 -0.795469,-0.0517 -1.114571,-0.15961 -2.970816,-0.31676 -5.092152,-0.52793 -6.366324,-0.63586 -1.804572,-0.21117 -2.919252,-0.3191 -3.341604,-0.3191 -0.532734,0.10558 -1.806912,0.26519 -3.820308,0.47636 -1.060664,0.10793 -1.804572,0.10793 -2.226912,0 -0.849492,-0.3191 -1.698984,-0.37078 -2.546136,-0.15961 -0.424687,0.10793 -1.008984,0.10793 -1.750548,0 -0.743906,-0.10558 -1.220268,-0.1596 -1.431444,-0.1596 -0.316758,-0.10559 -0.823594,-0.15961 -1.511136,-0.15961 -0.689882,0 -1.192031,-0.0517 -1.511136,-0.15961 -0.213516,0 -0.689882,0.0281 -1.431444,0.0798 -0.741563,0.054 -1.168594,0.0282 -1.271832,-0.0797 -0.424687,0 -1.063008,-0.0798 -1.91016,-0.23941 -0.851836,-0.15961 -1.431444,-0.23942 -1.750548,-0.23942 -2.229252,-0.31675 -3.766284,-0.47636 -4.615776,-0.47636 -1.591056,0 -2.733864,0.15726 -3.421404,0.47636 -0.689882,0.31676 -1.56516,1.11223 -2.625816,2.38641 -0.849492,0.84949 -2.226912,2.54613 -4.137072,5.09226 -0.319102,0.42234 -0.743789,1.00664 -1.274184,1.75055 -0.532734,0.74156 -0.903516,1.27195 -1.114687,1.59105 -0.107929,0.10324 -0.424687,0.31676 -0.955078,0.63586 l -0.159609,0.15961 c -0.213516,0.10559 -0.316758,0.21117 -0.316758,0.3191 -0.10793,0.42235 -0.373126,0.57961 -0.79547,0.47637 -0.635976,-0.10559 -0.955077,-0.37312 -0.955077,-0.79547 -0.105586,-1.16859 -0.316758,-2.38652 -0.63586,-3.66071 -0.105585,-0.53273 -0.293321,-1.24851 -0.556172,-2.14957 -0.265195,-0.90105 -0.450586,-1.51113 -0.556173,-1.83024 -0.211172,-0.95508 -0.37078,-1.69664 -0.476367,-2.22937 0,-0.42234 -0.02813,-1.05832 -0.07981,-1.91016 -0.05637,-0.84715 -0.133827,-1.48547 -0.239414,-1.91016 0,-0.52805 -0.10793,-1.27195 -0.319102,-2.22703 -0.213516,-0.95508 -0.319101,-1.59106 -0.319101,-1.91016 -0.10793,-0.63598 -0.15961,-1.21793 -0.15961,-1.75067 0.105586,-1.37976 0.211172,-3.02473 0.319102,-4.93488 0,-0.103243 0.05168,-0.262852 0.159609,-0.476368 0.105586,-0.208827 0.15961,-0.368437 0.15961,-0.476367 0,-0.211173 0.0798,-0.558516 0.239414,-1.034883 0.15961,-0.478711 0.290976,-0.929296 0.398907,-1.353984 0.105586,-0.422343 0.213516,-0.795469 0.319101,-1.11457 0.319102,-0.741563 0.741445,-1.696644 1.274184,-2.86524 0.422344,-0.955078 0.741445,-1.64496 0.954961,-2.069652 0.211173,-0.316758 0.795469,-1.114571 1.750548,-2.386404 1.802232,-2.3325 2.916912,-3.763944 3.341604,-4.296684 0.422344,-0.530391 1.006641,-1.114688 1.750548,-1.750668 2.759652,-2.229252 4.775388,-3.871872 6.049572,-4.93488 0.847149,-0.635976 1.750548,-1.058321 2.705628,-1.271832 0.952734,-0.316758 1.694292,-1.16625 2.227032,-2.546016 0,-0.211173 0.581953,-1.114571 1.750548,-2.705628 0.103242,0 0.262852,-0.262852 0.476368,-0.795586 l 0.159609,-0.15961 c 0,-0.103242 0.15961,-0.290976 0.476368,-0.556172 0.316758,-0.262852 0.527929,-0.502266 0.63586,-0.715781 0.319101,-0.319101 0.769687,-0.898711 1.353984,-1.750548 0.579609,-0.847148 1.032538,-1.485468 1.351644,-1.91016 0.211172,-0.319101 0.847148,-0.955077 1.91016,-1.91016 0.739219,-0.847148 1.483128,-1.591056 2.227032,-2.227032 1.168593,-1.16625 2.229252,-2.173008 3.184332,-3.02484 2.968476,-2.7573 4.826952,-4.66746 5.570856,-5.728128 0.211172,-0.319101 0.659414,-1.034882 1.351644,-2.149572 0.687538,-1.114687 1.246056,-1.933716 1.670748,-2.466444 0.422343,-0.739219 1.00664,-1.830348 1.750548,-3.261792 0.739219,-1.433784 1.217928,-2.4123 1.431444,-2.94504 0.319101,-0.422343 0.718008,-1.034766 1.194374,-1.83024 0.478711,-0.795469 0.821368,-1.405548 1.034882,-1.83024 0.211173,-0.319101 0.396563,-0.715664 0.556173,-1.194374 0.159609,-0.476368 0.290976,-0.769687 0.398906,-0.875274 0.103242,-0.319102 0.370781,-0.847149 0.795469,-1.591056 1.060665,-1.696644 1.750548,-2.86524 2.069652,-3.501216 1.696644,-2.7573 2.705748,-4.39992 3.02484,-4.93266 1.16625,-1.696644 2.386524,-3.2877 3.660708,-4.775508 0.955078,-1.16625 2.06742,-2.280936 3.341604,-3.341604 0.319102,-0.319102 0.661758,-0.610078 1.034883,-0.875274 0.370781,-0.262852 0.795469,-0.581953 1.274184,-0.955078 0.476367,-0.370781 0.875274,-0.607734 1.194374,-0.715664 0.208828,-0.211173 0.316758,-0.368437 0.316758,-0.476368 0.213516,-0.741563 0.689883,-1.006758 1.433784,-0.795585 0.741563,0.213516 1.217928,0.584296 1.431444,1.114687 0.638321,1.274184 0.795586,2.813556 0.478828,4.615776 0,0.107929 -0.05402,0.478711 -0.15961,1.114687 0.105586,0 0.15961,0.02812 0.15961,0.07981 0,0.05637 0.05168,0.0798 0.159609,0.0798 1.802232,-1.591054 2.7573,-2.440548 2.86524,-2.546136 1.485468,-1.271832 2.386524,-2.0673 2.705628,-2.386404 1.485468,-0.955077 2.705748,-1.696644 3.660816,-2.229372 1.060665,-0.635976 1.91016,-0.69 2.546136,-0.159608 0.211173,0.107929 0.530274,0.187733 0.954962,0.239414 0.422343,0.05402 0.687538,0.133828 0.795469,0.239415 2.015748,1.168593 3.02484,2.705628 3.02484,4.615776 0,0.849492 -0.15961,2.33496 -0.476368,4.456284 -0.316758,2.759652 -0.584297,4.829412 -0.795469,6.206832 -0.105586,0.424687 -0.211172,0.929179 -0.316758,1.511136 -0.107929,0.584297 -0.239297,1.194374 -0.398906,1.830348 -0.15961,0.635973 -0.239415,1.168711 -0.239415,1.591056 -0.105585,0 -0.157266,0.213516 -0.157266,0.635859 1.591056,-0.847148 2.438208,-1.323517 2.546136,-1.431445 0.847149,-0.422343 1.750548,-0.849492 2.705633,-1.274184 0.42234,-0.211172 0.84937,-0.103242 1.27406,0.319102 1.05833,0.741564 1.80224,1.856256 2.22692,3.341725 0.42234,1.487808 0.42234,3.024839 0,4.615896 -0.10793,0.319102 -0.9034,2.86524 -2.38653,7.640628 l 0.63598,-0.15961 c 1.37742,-0.847148 2.80886,-1.37754 4.29668,-1.591056 h 1.27183 c 0.63833,0 1.16872,0.265196 1.5934,0.795586 0.63598,0.851836 0.90117,1.858596 0.79559,3.02484 0,1.060664 -0.15961,2.229252 -0.47872,3.501096 -0.10558,0.427031 -0.21351,0.851719 -0.31675,1.274064 -0.10793,0.424687 -0.2393,0.901055 -0.39891,1.431444 -0.15961,0.530389 -0.23941,0.952734 -0.23941,1.271832 -0.10559,0.213516 -0.21352,0.558516 -0.31676,1.034882 -0.10793,0.478712 -0.15961,0.823712 -0.15961,1.034883 -0.10793,0.213516 -0.2393,0.532617 -0.39891,0.954961 -0.15961,0.424687 -0.29332,0.743789 -0.39656,0.954961 -0.10793,0.213516 -0.37313,1.114571 -0.79547,2.705628 0.84715,-0.105587 1.91016,-0.265195 3.18199,-0.478711 0.53039,0 1.05844,0.265195 1.59118,0.795586 1.06066,1.37976 1.43378,3.501096 1.11469,6.366324 0,0.107929 -0.054,0.851835 -0.15961,2.229252 1.16625,-0.316758 1.91016,-0.52793 2.22925,-0.63586 h 0.3191 c 1.16625,0.316758 1.80223,0.476368 1.91016,0.476368 0.52805,0.319101 0.68766,1.011327 0.47648,2.069652 -0.21351,1.274184 -0.47636,2.337192 -0.79547,3.184332 0,0.107929 -0.58429,1.328208 -1.75054,3.660708 -0.63598,1.271832 -1.00911,2.0673 -1.11469,2.386404 -0.21352,0.213516 -0.45281,0.532617 -0.71567,0.954961 -0.26753,0.424687 -0.45292,0.795469 -0.55851,1.114571 l -1.27183,2.386524 h 4.45628 c 1.27418,0.105585 2.28094,0.265195 3.02484,0.476367 1.06066,0.316758 1.64262,1.140469 1.75055,2.466324 0.10324,1.328208 -0.26754,2.628276 -1.11469,3.90012 -0.21351,0.319102 -0.47637,0.743789 -0.79547,1.274184 -0.3191,0.532734 -0.58429,0.955078 -0.79547,1.274184 0,0.107929 -0.63597,0.851836 -1.91016,2.229249 0,0.10559 -0.0798,0.23695 -0.23941,0.39656 -0.15961,0.15961 -0.29332,0.29567 -0.39656,0.39891 0.10324,0 0.15726,0.0564 0.15726,0.15961 1.06067,-0.10559 1.64496,-0.15961 1.75289,-0.15961 1.37742,-0.21117 2.2527,-0.3191 2.62582,-0.3191 0.37078,0 0.66175,0.21351 0.87527,0.63586 z"
     id="path2" />
</svg>
