<?xml version="1.0" encoding="UTF-8" standalone="no"?>
<!-- Created with Inkscape (http://www.inkscape.org/) -->

<svg
   width="128.0px"
   height="128.0px"
   viewBox="0 0 128.0 128.0"
   version="1.1"
   id="SVGRoot"
   sodipodi:docname="ferry.svg"
   inkscape:version="1.2.2 (1:1.2.2+202212051550+b0a8486541)"
   xmlns:inkscape="http://www.inkscape.org/namespaces/inkscape"
   xmlns:sodipodi="http://sodipodi.sourceforge.net/DTD/sodipodi-0.dtd"
   xmlns="http://www.w3.org/2000/svg"
   xmlns:svg="http://www.w3.org/2000/svg">
  <sodipodi:namedview
     id="namedview137"
     pagecolor="#ffffff"
     bordercolor="#666666"
     borderopacity="1.0"
     inkscape:showpageshadow="2"
     inkscape:pageopacity="0.0"
     inkscape:pagecheckerboard="0"
     inkscape:deskcolor="#d1d1d1"
     inkscape:document-units="px"
     showgrid="true"
     inkscape:zoom="6.9083389"
     inkscape:cx="74.258082"
     inkscape:cy="64.342529"
     inkscape:window-width="1920"
     inkscape:window-height="1016"
     inkscape:window-x="0"
     inkscape:window-y="27"
     inkscape:window-maximized="1"
     inkscape:current-layer="layer1">
    <inkscape:grid
       type="xygrid"
       id="grid260" />
  </sodipodi:namedview>
  <g
     inkscape:label="Layer 1"
     inkscape:groupmode="layer"
     id="layer1">
    <g
       id="g7275"
       transform="matrix(3.3333333,0,0,-3.3333332,-1243.7967,969.30596)">
      <g
         id="g6212"
         transform="translate(409.0345,276.3938)">
        <path
           d="m 0,0 v 3.279 h -0.389 c -0.32,0 -0.595,0.294 -0.593,0.64 0.004,0.745 0.034,1.49 0.036,2.234 0.002,0.454 0.001,0.909 -0.023,1.363 -0.004,0.065 -0.011,0.131 -0.018,0.198 H -8.808 -22.146 -33.391 V 5.191 c 0.331,-0.126 0.572,-0.367 0.746,-0.944 0.409,-1.36 0.303,-2.918 0.237,-4.323 -0.016,-0.341 -0.261,-0.647 -0.594,-0.64 -0.104,0.002 -0.245,0.014 -0.389,0.02 V -2.35 -4.591 -5.704 c 0.158,-0.382 0.329,-0.76 0.508,-1.135 -0.072,-0.704 -0.184,-1.405 -0.286,-2.105 -0.039,-0.264 -0.114,-0.488 -0.222,-0.66 v -3.279 h 0.389 c 0.32,0 0.596,-0.295 0.594,-0.64 -0.005,-0.746 -0.034,-1.49 -0.037,-2.235 -0.002,-0.453 0,-0.909 0.024,-1.362 0.003,-0.065 0.011,-0.131 0.018,-0.198 h 7.821 13.337 H 0 v 2.522 c -0.331,0.126 -0.572,0.367 -0.746,0.945 -0.409,1.36 -0.302,2.917 -0.236,4.323 0.016,0.341 0.26,0.647 0.593,0.64 0.105,-0.002 0.245,-0.014 0.389,-0.02 v 1.654 2.241 1.113 c -0.157,0.382 -0.329,0.76 -0.507,1.135 0.071,0.704 0.183,1.404 0.286,2.105 C -0.182,-0.396 -0.107,-0.172 0,0"
           style="fill:currentColor;fill-opacity:1;fill-rule:nonzero;stroke:none"
           id="path6214" />
      </g>
      <g
         id="g6216"
         transform="translate(409.0345,276.3938)">
        <path
           d="m 0,0 v 3.279 h -0.389 c -0.32,0 -0.595,0.294 -0.593,0.64 0.004,0.745 0.034,1.49 0.036,2.234 0.002,0.454 0.001,0.909 -0.023,1.363 -0.004,0.065 -0.011,0.131 -0.018,0.198 H -8.808 -22.146 -33.391 V 5.191 c 0.331,-0.126 0.572,-0.367 0.746,-0.944 0.409,-1.36 0.303,-2.918 0.237,-4.323 -0.016,-0.341 -0.261,-0.647 -0.594,-0.64 -0.104,0.002 -0.245,0.014 -0.389,0.02 V -2.35 -4.591 -5.704 c 0.158,-0.382 0.329,-0.76 0.508,-1.135 -0.072,-0.704 -0.184,-1.405 -0.286,-2.105 -0.039,-0.264 -0.114,-0.488 -0.222,-0.66 v -3.279 h 0.389 c 0.32,0 0.596,-0.295 0.594,-0.64 -0.005,-0.746 -0.034,-1.49 -0.037,-2.235 -0.002,-0.453 0,-0.909 0.024,-1.362 0.003,-0.065 0.011,-0.131 0.018,-0.198 h 7.821 13.337 H 0 v 2.522 c -0.331,0.126 -0.572,0.367 -0.746,0.945 -0.409,1.36 -0.302,2.917 -0.236,4.323 0.016,0.341 0.26,0.647 0.593,0.64 0.105,-0.002 0.245,-0.014 0.389,-0.02 v 1.654 2.241 1.113 c -0.157,0.382 -0.329,0.76 -0.507,1.135 0.071,0.704 0.183,1.404 0.286,2.105 C -0.182,-0.396 -0.107,-0.172 0,0 Z"
           style="fill:none;stroke:#ffffff;stroke-width:1;stroke-linecap:butt;stroke-linejoin:miter;stroke-miterlimit:10;stroke-dasharray:none;stroke-opacity:1"
           id="path6218" />
      </g>
      <g
         id="g6220"
         transform="translate(401.1777,277.3328)">
        <path
           d="m 0,0 c -0.019,-0.295 -0.029,-0.591 -0.04,-0.887 -0.014,-0.4 -0.025,-0.8 -0.037,-1.2 -0.012,-0.385 -0.021,-0.77 -0.036,-1.155 -0.026,-0.641 -0.061,-1.281 -0.081,-1.923 -0.012,-0.372 0.007,-0.746 -0.001,-1.119 -0.013,-0.606 -0.035,-1.212 -0.059,-1.818 -0.003,-0.079 -0.027,-0.161 -0.057,-0.232 -0.062,-0.149 -0.091,-0.28 0.026,-0.422 0.038,-0.046 0.032,-0.155 0.027,-0.234 -0.016,-0.263 -0.046,-0.526 -0.058,-0.79 -0.004,-0.08 0.054,-0.164 0.049,-0.243 -0.03,-0.468 -0.087,-0.934 -0.103,-1.401 -0.011,-0.344 0.026,-0.69 0.041,-1.034 0.002,-0.042 0.004,-0.083 0.004,-0.124 -0.005,-0.229 -0.006,-0.458 -0.017,-0.687 -0.003,-0.041 -0.047,-0.112 -0.075,-0.114 -0.185,-0.012 -0.373,-0.029 -0.536,0.123 -0.051,0.048 -0.128,0.061 -0.193,0.09 0.008,-0.08 0.016,-0.16 0.024,-0.24 0.002,-0.02 0.004,-0.039 0.01,-0.087 -0.166,0 -0.327,-0.014 -0.485,0.009 -0.042,0.007 -0.102,0.124 -0.103,0.192 -0.012,0.438 -0.007,0.876 -0.013,1.315 -0.004,0.286 -0.019,0.571 -0.025,0.857 -0.002,0.126 0.022,0.222 0.144,0.286 0.074,0.038 0.147,0.16 0.161,0.257 0.018,0.123 -0.071,0.208 -0.183,0.226 -0.118,0.018 -0.157,0.096 -0.148,0.225 0.032,0.437 0.067,0.874 0.091,1.311 0.02,0.374 0.028,0.748 0.036,1.122 0.006,0.327 0,0.655 0.006,0.982 0.004,0.162 0.03,0.324 0.034,0.487 0.013,0.565 0.022,1.129 0.029,1.694 0.001,0.108 0.016,0.183 0.112,0.244 0.081,0.05 0.151,0.15 0.196,0.247 0.022,0.047 -0.01,0.186 -0.043,0.2 -0.263,0.111 -0.193,0.37 -0.196,0.584 -0.006,0.441 0.001,0.882 0.012,1.323 0.003,0.13 0.037,0.217 0.186,0.259 0.113,0.032 0.194,0.218 0.285,0.34 0.004,0.006 -0.037,0.06 -0.06,0.088 -0.007,0.008 -0.023,0.002 -0.034,0.007 -0.109,0.047 -0.218,0.094 -0.348,0.151 0.03,1.207 0.062,2.416 0.094,3.669 C -0.844,2.507 -0.349,2.439 0.164,2.37 0.138,1.952 0.114,1.525 0.084,1.1 0.059,0.733 0.024,0.367 0,0 m -0.601,-16.028 c -0.319,0.01 -0.65,0.074 -0.945,-0.15 -0.024,-0.019 -0.067,-0.003 -0.117,-0.003 -0.024,0.421 -0.046,0.838 -0.072,1.309 0.457,0 0.872,-10e-4 1.286,10e-4 0.136,0 0.181,-0.107 0.199,-0.232 0.02,-0.147 0.017,-0.3 0.039,-0.447 0.041,-0.286 -0.135,-0.487 -0.39,-0.478 m -1.178,15.013 c -0.001,-0.14 -0.142,-0.229 -0.317,-0.218 -0.421,0.027 -0.842,0.045 -1.262,0.075 -0.337,0.024 -0.674,0.071 -1.012,0.087 -0.283,0.014 -0.568,-0.009 -0.853,-0.004 -0.393,0.007 -0.787,0.018 -1.18,0.039 -0.239,0.014 -0.477,0.055 -0.716,0.075 -0.57,0.046 -1.141,0.104 -1.713,0.126 -0.565,0.022 -1.132,0.004 -1.699,0.005 -0.514,0 -1.029,-0.003 -1.543,0.003 -0.485,0.007 -0.97,0.028 -1.455,0.037 -0.159,0.003 -0.242,0.074 -0.227,0.272 0.008,0.116 0.002,0.233 0.002,0.349 h -0.033 c 0,0.412 -0.027,0.828 0.009,1.236 0.032,0.368 0.007,0.727 -0.005,1.092 -0.008,0.232 0.226,0.396 0.512,0.384 0.322,-0.013 0.646,-0.032 0.968,-0.029 0.587,0.004 1.175,-0.005 1.758,0.045 0.361,0.03 0.712,0.012 1.069,-0.039 0.183,-0.026 0.373,0.025 0.56,0.023 0.403,-0.004 0.806,-0.026 1.208,-0.03 0.257,-0.003 0.514,0.019 0.771,0.021 0.175,0.001 0.351,-0.021 0.526,-0.018 0.314,0.006 0.627,0.028 0.941,0.035 0.287,0.006 0.574,-0.009 0.86,10e-4 0.557,0.017 1.114,0.049 1.672,0.066 0.18,0.005 0.361,-0.027 0.541,-0.027 0.134,10e-4 0.267,0.026 0.401,0.039 0.237,0.023 0.303,-0.052 0.298,-0.326 C -1.704,1.958 -1.697,1.613 -1.709,1.268 -1.721,0.915 -1.76,0.563 -1.771,0.21 -1.782,-0.198 -1.775,-0.606 -1.779,-1.015 m -0.045,-2.589 c 0.005,-0.171 -0.094,-0.204 -0.215,-0.219 -0.371,-0.048 -0.738,0.005 -1.108,0.033 -0.304,0.024 -0.612,-0.023 -0.918,-0.029 -0.473,-0.009 -0.946,-0.014 -1.419,-0.012 -0.273,10e-4 -0.546,0.029 -0.819,0.032 -0.192,10e-4 -0.384,-0.031 -0.577,-0.029 -0.291,0.002 -0.582,0.029 -0.873,0.028 -0.32,-0.001 -0.64,-0.04 -0.959,-0.028 -0.468,0.018 -0.936,0.071 -1.404,0.103 -0.334,0.023 -0.668,0.04 -1.003,0.052 -0.431,0.016 -0.863,0.034 -1.296,0.035 -0.346,10e-4 -0.693,-0.015 -1.039,-0.038 -0.079,-0.005 -0.155,-0.067 -0.283,-0.127 v 2.686 c 0.354,0 0.709,-0.001 1.064,0 1.241,0.004 2.483,0.02 3.724,0.009 0.46,-0.004 0.919,-0.097 1.379,-0.104 0.726,-0.011 1.427,-0.309 2.159,-0.238 0.156,0.015 0.315,0.009 0.472,-0.001 0.356,-0.022 0.711,-0.052 1.067,-0.079 0.345,-0.027 0.69,-0.051 1.035,-0.08 0.338,-0.029 0.676,-0.062 1.054,-0.098 -0.018,-0.274 -0.037,-0.548 -0.054,-0.822 -0.002,-0.026 -0.006,-0.056 0.003,-0.077 0.135,-0.331 0,-0.664 0.01,-0.997 m -0.081,-3.597 c -0.49,-0.061 -0.956,-0.153 -1.423,-0.166 -0.405,-0.011 -0.812,0.072 -1.219,0.1 -0.094,0.006 -0.191,-0.065 -0.286,-0.066 -1.092,-0.005 -2.185,-0.003 -3.277,-0.003 -0.378,0 -0.756,-0.008 -1.134,0.003 -0.245,0.007 -0.489,0.05 -0.734,0.063 -0.459,0.026 -0.918,0.039 -1.377,0.064 -0.427,0.023 -0.853,0.061 -1.278,0.082 -0.232,0.011 -0.466,0.016 -0.696,-0.007 -0.202,-0.021 -0.3,0.051 -0.283,0.283 0.053,0.735 -0.035,1.462 -0.075,2.192 -0.011,0.211 -0.026,0.421 -0.04,0.621 0.322,0 0.61,0.006 0.898,-10e-4 1.104,-0.026 2.208,-0.058 3.312,-0.082 0.196,-0.005 0.392,0.028 0.589,0.027 0.198,-10e-4 0.397,-0.028 0.595,-0.033 0.646,-0.016 1.291,-0.028 1.936,-0.041 0.74,-0.014 1.481,-0.025 2.222,-0.041 0.52,-0.011 1.04,-0.023 1.56,-0.044 0.242,-0.01 0.484,-0.043 0.71,-0.065 z M -1.96,-8.004 c -0.027,-0.076 -0.089,-0.177 -0.147,-0.188 -0.139,-0.026 -0.284,0 -0.426,-0.007 -0.086,-0.004 -0.172,-0.042 -0.257,-0.04 -0.198,0.003 -0.397,0.027 -0.595,0.033 -0.208,0.007 -0.418,-0.004 -0.626,0.006 -0.292,0.015 -0.584,0.045 -0.876,0.064 -0.515,0.033 -1.03,0.07 -1.546,0.094 -0.685,0.034 -1.37,0.06 -2.055,0.086 -0.185,0.007 -0.372,-0.005 -0.557,0.003 -0.387,0.018 -0.773,0.056 -1.16,0.063 -0.387,0.008 -0.774,-0.024 -1.162,-0.016 -0.343,0.007 -0.686,0.049 -1.029,0.066 -0.115,0.006 -0.232,-0.031 -0.348,-0.029 -0.162,0.003 -0.325,0.026 -0.487,0.035 -0.109,0.006 -0.217,10e-4 -0.351,10e-4 v 0.371 c 0.314,0.004 0.618,0.009 0.92,0.013 0.03,0 0.059,-0.007 0.088,-0.009 0.866,-0.054 1.731,-0.113 2.596,-0.16 0.304,-0.016 0.609,0.001 0.913,-0.007 0.877,-0.023 1.755,-0.054 2.633,-0.076 0.352,-0.009 0.705,-0.001 1.057,-0.002 0.499,-10e-4 0.997,-10e-4 1.496,-0.006 0.104,-0.001 0.208,-0.035 0.312,-0.036 0.406,-0.004 0.813,-0.001 1.22,0 h 0.392 c 0,-0.101 0.02,-0.191 -0.005,-0.259 m -0.064,-2.095 c 0.003,-0.241 -0.031,-0.286 -0.233,-0.285 -0.592,0.003 -1.183,-10e-4 -1.775,-10e-4 -0.559,0 -1.118,-0.004 -1.677,0.003 -0.551,0.007 -1.102,0.03 -1.652,0.04 -0.433,0.008 -0.867,0.002 -1.299,0.009 -0.457,0.007 -0.914,0.02 -1.37,0.034 -0.364,0.011 -0.727,0.04 -1.091,0.035 -0.465,-0.006 -0.93,-0.044 -1.395,-0.057 -0.334,-0.01 -0.668,-0.002 -1.047,-0.002 v 1.978 c 0.473,-0.096 0.937,0.037 1.405,0.088 0.041,0.004 0.081,0.023 0.121,0.022 0.466,-0.01 0.932,-0.025 1.397,-0.031 0.207,-0.002 0.415,0.025 0.622,0.022 0.387,-0.006 0.773,-0.028 1.16,-0.036 0.353,-0.007 0.706,0.008 1.058,-0.01 0.267,-0.013 0.532,-0.066 0.799,-0.095 0.068,-0.008 0.14,0.002 0.208,0.019 0.269,0.07 0.532,0 0.797,-0.04 0.22,-0.034 0.441,-0.067 0.663,-0.08 0.607,-0.035 1.216,-0.055 1.823,-0.09 0.502,-0.029 1.003,-0.072 1.485,-0.107 0,-0.487 -0.005,-0.951 10e-4,-1.416 m -0.131,-3.345 c -0.036,0.011 -0.093,0.004 -0.118,-0.023 -0.165,-0.175 -0.386,-0.135 -0.55,-0.105 -0.309,0.058 -0.6,0.011 -0.901,-0.02 -0.32,-0.033 -0.643,-0.045 -0.965,-0.058 -0.357,-0.014 -0.715,-0.033 -1.072,-0.024 -0.655,0.016 -1.309,0.061 -1.963,0.075 -0.346,0.008 -0.692,-0.036 -1.037,-0.034 -0.864,0.006 -1.729,0.022 -2.593,0.039 -0.648,0.012 -1.295,0.026 -1.942,0.061 -0.062,0.004 -0.136,0.159 -0.17,0.26 -0.028,0.082 -0.006,0.187 -0.006,0.281 -0.004,-10e-4 -0.008,-10e-4 -0.013,-10e-4 -0.032,0.664 -0.067,1.327 -0.095,1.992 -0.011,0.272 -0.005,0.281 0.225,0.289 0.978,0.03 1.957,0.061 2.936,0.08 0.356,0.007 0.712,-0.016 1.068,-0.034 0.517,-0.024 1.034,-0.072 1.551,-0.08 0.551,-0.007 1.104,0.042 1.655,0.028 0.486,-0.011 0.97,-0.092 1.455,-0.113 0.458,-0.02 0.916,0.003 1.375,-0.002 0.283,-0.004 0.567,-0.027 0.851,-0.034 0.105,-0.002 0.211,0.034 0.314,0.021 0.044,-0.006 0.113,-0.092 0.115,-0.143 0.013,-0.467 0.012,-0.933 0.016,-1.4 0.003,-0.301 0.012,-0.602 0.013,-0.903 10e-4,-0.11 -0.029,-0.187 -0.149,-0.152 m -12.144,-2.538 c -0.331,0.025 -0.662,0.053 -0.993,0.075 -0.188,0.012 -0.275,0.146 -0.262,0.377 0.014,0.228 0.002,0.458 0.012,0.686 0.003,0.074 0.042,0.147 0.064,0.222 0.599,-0.191 1.202,-0.177 1.813,-0.15 0.044,-0.431 0.086,-0.83 0.131,-1.268 -0.268,0.02 -0.517,0.039 -0.765,0.058 m 0.399,2.157 h -0.455 c -10e-4,0.012 -0.002,0.023 -0.002,0.035 h 0.456 z m -1.709,0.716 c 0,0.251 0.013,0.512 -0.003,0.771 -0.024,0.395 -0.07,0.789 -0.104,1.183 -0.012,0.125 -0.024,0.237 0.091,0.334 0.073,0.06 0.095,0.2 0.146,0.318 -0.071,0.057 -0.139,0.105 -0.2,0.164 -0.026,0.025 -0.05,0.072 -0.05,0.11 -0.012,0.49 -0.012,0.981 -0.03,1.472 -0.005,0.132 -0.011,0.243 0.071,0.349 0.021,0.027 0.016,0.12 -0.008,0.146 -0.111,0.124 -0.093,0.268 -0.08,0.422 0.009,0.126 -0.023,0.257 -0.009,0.381 0.007,0.06 0.097,0.163 0.119,0.153 0.145,-0.064 0.227,-0.015 0.276,0.149 0.011,0.033 0.049,0.056 0.073,0.082 -0.07,0.301 -0.07,0.295 -0.329,0.282 -0.05,-0.002 -0.141,0.055 -0.147,0.099 -0.025,0.162 -0.023,0.33 -0.031,0.495 -0.002,0.032 -0.004,0.066 -0.01,0.097 -0.124,0.564 -0.077,1.139 -0.084,1.711 0,0.047 0.041,0.133 0.07,0.137 0.18,0.027 0.226,0.189 0.201,0.337 -0.015,0.086 -0.148,0.145 -0.228,0.216 -0.013,-0.013 -0.026,-0.027 -0.039,-0.04 -0.021,0.274 -0.046,0.549 -0.062,0.824 -0.018,0.314 -0.033,0.629 -0.036,0.944 -0.001,0.189 -0.011,0.392 0.19,0.486 0.109,0.051 0.174,0.166 0.121,0.293 -0.03,0.072 -0.124,0.137 -0.196,0.15 -0.109,0.019 -0.115,0.088 -0.122,0.183 -0.02,0.304 -0.047,0.608 -0.064,0.912 -0.019,0.345 -0.029,0.691 -0.042,1.037 -0.001,0.039 0.003,0.08 0.004,0.098 0.459,0.098 0.902,0.218 1.352,0.277 0.198,0.026 0.411,-0.067 0.612,-0.125 0.035,-0.01 0.07,-0.119 0.071,-0.182 0.008,-0.833 0.011,-1.665 0.014,-2.497 0.002,-0.574 -0.011,-1.148 0.006,-1.721 0.018,-0.593 0.07,-1.184 0.096,-1.777 0.026,-0.59 0.038,-1.181 0.053,-1.772 0.009,-0.345 0.017,-0.69 0.017,-1.035 0,-0.227 -0.017,-0.455 -0.02,-0.682 0,-0.093 0.024,-0.187 0.025,-0.28 0.003,-0.445 0.006,-0.891 -0.001,-1.336 -0.002,-0.124 -0.04,-0.248 -0.059,-0.373 -0.006,-0.039 -0.011,-0.081 -0.007,-0.121 0.018,-0.176 0.051,-0.352 0.056,-0.528 0.012,-0.52 -0.025,-1.043 0.075,-1.558 0.028,-0.145 0.035,-0.299 0.032,-0.448 -0.002,-0.128 -0.043,-0.235 -0.185,-0.236 -0.335,-10e-4 -0.67,-0.023 -1.004,-0.011 -0.19,0.007 -0.38,0.065 -0.621,0.11 m 1.516,15.383 C -14.104,2.263 -14.115,2.252 -14.125,2.241 V 1.909 c -0.011,-0.002 -0.022,-0.004 -0.033,-0.007 -0.044,0.085 -0.089,0.169 -0.106,0.201 0.052,0.051 0.096,0.095 0.139,0.138 v 0.098 c 0.01,-0.022 0.021,-0.043 0.032,-0.065 m -2.031,1.47 c 0.009,0.318 0.025,0.638 0.05,0.956 0.004,0.042 0.078,0.106 0.124,0.111 0.39,0.041 0.783,0.071 1.174,0.105 0,-0.007 10e-4,-0.014 10e-4,-0.02 0.141,0 0.282,-0.001 0.423,0 0.102,0.001 0.14,-0.047 0.145,-0.173 0.026,-0.556 0.065,-1.111 0.089,-1.666 0.002,-0.058 -0.056,-0.159 -0.102,-0.173 -0.38,-0.117 -0.764,-0.221 -1.148,-0.322 -0.06,-0.016 -0.127,0.004 -0.19,0.003 -0.151,-0.004 -0.304,-0.004 -0.455,-0.018 -0.09,-0.009 -0.138,-0.015 -0.131,0.13 0.018,0.354 0.01,0.711 0.02,1.067 M -1.293,5.428 C -1.265,5.487 -1.12,5.493 -1.029,5.485 -0.749,5.463 -0.47,5.425 -0.191,5.39 -0.093,5.378 0.005,5.364 0.103,5.343 0.259,5.309 0.334,5.17 0.312,4.98 0.275,4.683 0.241,4.385 0.209,4.087 0.202,4.02 0.208,3.952 0.208,3.842 c -0.314,0.026 -0.623,0.044 -0.93,0.08 -0.154,0.018 -0.305,0.076 -0.459,0.105 -0.101,0.018 -0.148,0.076 -0.135,0.191 0.023,0.216 0.052,0.43 0.071,0.646 0.006,0.069 0.011,0.174 -0.023,0.204 -0.128,0.117 -0.07,0.266 -0.025,0.36 M 6.859,-8.127 c -0.271,0.033 -0.546,0.032 -0.818,0.05 -0.485,0.033 -0.969,0.072 -1.454,0.105 -0.362,0.026 -0.726,0.037 -1.087,0.071 -0.454,0.042 -0.906,0.099 -1.359,0.153 -0.299,0.036 -0.597,0.086 -0.896,0.114 -0.294,0.028 -0.59,0.032 -0.886,0.053 -0.106,0.008 -0.244,-0.012 -0.26,0.166 -0.017,0.189 -0.018,0.381 -0.011,0.571 0.023,0.615 0.055,1.23 0.079,1.845 0.006,0.142 -0.016,0.285 -0.006,0.426 0.033,0.474 0.088,0.947 0.109,1.422 0.019,0.427 0.014,0.856 0.002,1.283 -0.005,0.199 0.085,0.253 0.217,0.253 0.583,0.003 1.167,0.009 1.75,-0.011 0.373,-0.013 0.745,-0.068 1.117,-0.109 0.28,-0.03 0.56,-0.059 0.838,-0.104 0.324,-0.052 0.643,-0.149 0.968,-0.176 0.422,-0.035 0.846,-0.035 1.269,-0.044 0.006,0.128 0.013,0.256 0.027,0.383 10e-4,0.032 0,0.065 0,0.097 C 6.315,-1.583 6.172,-1.585 6.03,-1.581 5.513,-1.567 4.996,-1.55 4.479,-1.525 4.266,-1.515 4.053,-1.484 3.839,-1.459 3.438,-1.414 3.038,-1.359 2.637,-1.321 2.379,-1.296 2.12,-1.293 1.861,-1.284 1.48,-1.269 1.099,-1.252 0.718,-1.243 0.297,-1.233 0.281,-1.216 0.313,-0.728 0.373,0.193 0.428,1.115 0.492,2.036 0.514,2.365 0.559,2.691 0.585,3.021 0.599,3.192 0.667,3.168 0.759,3.116 0.713,2.817 0.792,2.704 1.051,2.717 1.361,2.732 1.669,2.787 1.978,2.791 2.461,2.795 2.945,2.757 3.428,2.764 3.919,2.771 4.41,2.816 4.901,2.836 5.161,2.846 5.422,2.83 5.682,2.842 5.729,2.844 5.776,2.849 5.823,2.852 5.767,3.007 5.71,3.163 5.663,3.322 5.561,3.312 5.458,3.299 5.355,3.29 5.06,3.263 4.763,3.264 4.467,3.249 4.221,3.236 3.975,3.206 3.729,3.206 3.345,3.206 2.961,3.234 2.577,3.234 2.332,3.234 2.086,3.202 1.84,3.19 1.573,3.178 1.306,3.165 1.04,3.169 0.996,3.17 0.939,3.254 0.914,3.314 0.868,3.421 0.869,3.572 0.802,3.645 0.658,3.802 0.59,3.965 0.626,4.193 0.677,4.504 0.722,4.817 0.765,5.13 0.775,5.204 0.786,5.29 0.763,5.354 0.706,5.518 0.762,5.771 0.517,5.797 0.302,5.821 0.088,5.856 -0.127,5.88 -0.488,5.92 -0.852,5.935 -1.21,5.999 -1.392,6.032 -1.558,6.084 -1.699,5.91 -1.748,5.849 -1.815,5.716 -1.797,5.691 -1.653,5.487 -1.743,5.262 -1.74,5.049 -1.738,4.963 -1.775,4.867 -1.816,4.792 -1.896,4.649 -1.893,4.499 -1.771,4.407 -1.639,4.309 -1.67,4.217 -1.732,4.086 -1.774,3.996 -1.788,3.877 -1.787,3.771 -1.785,3.661 -1.74,3.551 -1.734,3.44 -1.732,3.406 -1.794,3.342 -1.832,3.336 -1.971,3.315 -2.112,3.313 -2.266,3.302 -2.244,3.106 -2.314,3.045 -2.44,3.04 -2.719,3.029 -2.999,3.01 -3.278,3.001 -3.504,2.993 -3.73,3.001 -3.955,2.991 -4.383,2.971 -4.81,2.938 -5.238,2.919 -5.525,2.907 -5.812,2.91 -6.1,2.905 -6.41,2.899 -6.72,2.886 -7.029,2.886 -7.266,2.887 -7.502,2.915 -7.738,2.91 -8.2,2.899 -8.662,2.862 -9.125,2.861 -9.506,2.86 -9.888,2.905 -10.27,2.913 -10.56,2.918 -10.851,2.89 -11.142,2.89 c -0.379,0 -0.759,0.02 -1.139,0.017 -0.399,-0.002 -0.799,-0.024 -1.198,-0.03 -0.081,-10e-4 -0.166,0.013 -0.239,0.049 -0.038,0.019 -0.073,0.099 -0.075,0.153 -0.009,0.215 -0.001,0.432 -0.004,0.649 -0.005,0.398 -0.009,0.796 -0.021,1.195 -0.003,0.088 -0.038,0.176 -0.058,0.264 -0.018,-0.005 -0.035,-0.01 -0.051,-0.014 0.004,0.328 -0.074,0.27 -0.294,0.232 -0.121,-0.021 -0.242,-0.049 -0.363,-0.057 -0.303,-0.019 -0.606,-0.018 -0.907,-0.047 -0.193,-0.019 -0.375,-0.055 -0.568,0.036 -0.169,0.08 -0.295,-0.077 -0.416,-0.196 -0.11,-0.11 0,-0.189 0.032,-0.281 0.013,-0.036 0.01,-0.081 0.01,-0.122 0.001,-0.191 -0.003,-0.383 0.001,-0.574 0.008,-0.368 0.012,-0.737 0.031,-1.104 0.009,-0.166 -0.052,-0.239 -0.177,-0.27 -0.074,-0.018 -0.149,-0.039 -0.224,-0.049 -0.314,-0.041 -0.629,-0.084 -0.944,-0.117 -0.542,-0.057 -1.083,-0.109 -1.625,-0.16 -0.372,-0.034 -0.744,-0.066 -1.117,-0.091 -0.601,-0.042 -1.202,-0.082 -1.804,-0.116 -0.295,-0.017 -0.591,-0.025 -0.887,-0.036 -0.013,-0.136 -0.03,-0.272 -0.05,-0.409 0.062,0 0.125,0 0.187,0.007 0.237,0.029 0.472,0.08 0.709,0.111 0.174,0.022 0.35,0.032 0.525,0.035 0.245,0.006 0.491,-0.013 0.735,0.002 0.285,0.017 0.57,0.057 0.855,0.09 0.178,0.021 0.356,0.046 0.534,0.07 0.417,0.057 0.834,0.129 1.253,0.169 0.475,0.044 0.953,0.058 1.43,0.089 0.122,0.008 0.247,0.048 0.366,0.031 0.057,-0.008 0.116,-0.104 0.153,-0.176 0.023,-0.047 0.012,-0.123 0.003,-0.184 -0.022,-0.162 -0.053,-0.323 -0.083,-0.501 0.098,-0.057 0.16,-0.17 0.161,-0.365 0.001,-0.338 0.041,-0.677 0.062,-1.016 0.025,-0.407 0.046,-0.815 0.07,-1.233 -0.083,-0.01 -0.117,-0.017 -0.151,-0.018 -0.618,-0.014 -1.236,-0.031 -1.854,-0.04 -0.486,-0.006 -0.972,-0.016 -1.455,0.007 -0.156,0.007 -0.41,-0.143 -0.442,0.23 -0.002,0.016 -0.038,0.028 -0.058,0.044 -0.159,0.129 -0.315,0.263 -0.477,0.387 -0.155,0.119 -0.324,0.187 -0.515,0.141 -0.133,-0.032 -0.135,-0.136 -0.127,-0.264 0.009,-0.13 0.056,-0.167 0.166,-0.177 0.125,-0.012 0.251,-0.058 0.369,-0.111 0.162,-0.074 0.317,-0.167 0.452,-0.239 -0.226,-0.031 -0.478,-0.084 -0.732,-0.098 -0.673,-0.036 -1.346,-0.056 -2.02,-0.081 -0.219,-0.008 -0.438,-0.014 -0.657,-0.02 -0.022,-0.109 -0.04,-0.217 -0.065,-0.327 0.177,0.02 0.354,0.04 0.531,0.053 0.51,0.037 1.02,0.06 1.531,0.086 0.162,0.008 0.325,-0.002 0.486,0.01 0.222,0.016 0.442,0.061 0.663,0.065 0.509,0.01 1.019,0.001 1.529,0.002 0.332,0.001 0.664,0.003 0.997,0.01 0.184,0.003 0.369,0.033 0.553,0.024 0.189,-0.011 0.377,-0.055 0.618,-0.093 -0.153,-0.08 -0.256,-0.135 -0.371,-0.196 0.139,-0.223 0.276,-0.053 0.396,-0.012 0.061,0.021 0.101,0.125 0.172,0.218 0.125,-0.041 0.293,-0.095 0.501,-0.164 v -2.223 c -0.027,-0.005 -0.088,-0.026 -0.15,-0.029 -0.336,-0.013 -0.672,-0.02 -1.008,-0.035 -0.21,-0.009 -0.42,-0.037 -0.631,-0.044 -0.304,-0.011 -0.61,-0.002 -0.915,-0.016 -0.847,-0.037 -1.695,-0.093 -2.543,-0.119 -0.55,-0.017 -1.101,0.025 -1.651,0.002 -0.303,-0.013 -0.611,0.063 -0.913,-0.01 -0.003,-0.08 -0.009,-0.16 -0.014,-0.241 0.012,-0.044 0.031,-0.085 0.061,-0.118 0.082,0.018 0.164,0.035 0.246,0.042 0.379,0.033 0.761,0.037 1.141,0.039 0.337,0.002 0.675,-0.032 1.012,-0.02 0.665,0.023 1.329,0.068 1.993,0.102 0.321,0.016 0.643,0.027 0.964,0.04 0.378,0.015 0.757,0.042 1.136,0.041 0.384,0 0.769,-0.032 1.153,-0.041 0.128,-0.004 0.159,-0.06 0.147,-0.204 -0.016,-0.191 -0.02,-0.387 -0.008,-0.579 0.035,-0.557 0.081,-1.112 0.119,-1.669 0.008,-0.119 -0.034,-0.181 -0.154,-0.182 -0.76,-0.008 -1.519,-0.028 -2.279,-0.038 -1.08,-0.015 -2.16,-0.019 -3.239,-0.042 -0.469,-0.01 -0.938,-0.048 -1.405,-0.085 -0.183,-0.015 -0.362,-0.065 -0.558,-0.102 0.054,-0.199 0.14,-0.278 0.282,-0.266 0.344,0.028 0.688,0.063 1.032,0.088 0.59,0.043 1.18,0.097 1.77,0.114 0.482,0.014 0.965,-0.02 1.448,-0.032 0.339,-0.009 0.677,-0.024 1.016,-0.023 0.644,0.001 1.288,0.015 1.932,0.013 0.054,0 0.149,-0.082 0.154,-0.134 0.018,-0.211 0.015,-0.426 0.003,-0.639 -0.003,-0.045 -0.075,-0.119 -0.118,-0.122 -0.296,-0.026 -0.593,-0.044 -0.89,-0.051 -0.718,-0.016 -1.436,-0.024 -2.154,-0.037 -0.658,-0.012 -1.317,-0.029 -1.975,-0.041 -0.734,-0.015 -1.468,-0.024 -2.202,-0.044 -0.244,-0.007 -0.489,-0.038 -0.732,-0.073 -0.012,-0.002 -0.026,-0.009 -0.039,-0.018 0.02,-0.114 0.04,-0.228 0.062,-0.341 0.081,-0.052 0.166,-0.094 0.271,-0.027 0.05,0.031 0.111,0.045 0.168,0.051 0.348,0.032 0.696,0.066 1.044,0.088 0.373,0.024 0.746,0.038 1.119,0.051 0.146,0.006 0.292,-0.008 0.438,-0.004 0.384,0.012 0.767,0.032 1.15,0.041 0.411,0.01 0.822,0.005 1.232,0.017 0.3,0.008 0.599,0.05 0.898,0.045 0.355,-0.006 0.709,-0.053 1.063,-0.071 0.217,-0.012 0.435,-0.002 0.659,-0.002 0.015,-0.167 0.037,-0.326 0.041,-0.485 0.011,-0.38 0,-0.761 0.026,-1.139 0.011,-0.179 -0.061,-0.251 -0.174,-0.266 -0.398,-0.053 -0.796,-0.105 -1.195,-0.124 -0.417,-0.02 -0.835,0.006 -1.252,-0.001 -0.517,-0.008 -1.033,-0.024 -1.549,-0.048 -0.398,-0.018 -0.796,-0.06 -1.194,-0.08 -0.398,-0.02 -0.795,-0.032 -1.193,-0.038 -0.37,-0.006 -0.742,-0.021 -1.11,0.009 -0.05,0.004 -0.097,0.006 -0.143,0.007 0.005,-0.151 0.005,-0.302 -0.004,-0.453 0.021,-0.002 0.04,-0.01 0.062,-0.008 0.571,0.04 1.143,0.077 1.715,0.11 0.409,0.023 0.819,0.037 1.228,0.054 0.566,0.024 1.132,0.063 1.698,0.066 0.38,0.002 0.76,-0.07 1.139,-0.067 0.508,0.005 1.015,0.05 1.522,0.079 0.081,0.005 0.162,0.03 0.243,0.036 0.151,0.011 0.234,-0.061 0.225,-0.252 -0.008,-0.154 -0.016,-0.308 -0.008,-0.461 0.024,-0.445 0.052,-0.89 0.087,-1.334 0.011,-0.129 -0.041,-0.142 -0.122,-0.13 -0.266,0.041 -0.369,-0.02 -0.506,-0.316 -0.158,0.068 -0.306,0.06 -0.433,-0.111 -0.033,-0.045 -0.133,-0.025 -0.202,-0.029 -0.261,-0.015 -0.521,-0.025 -0.781,-0.043 -0.131,-0.01 -0.261,-0.035 -0.349,-0.047 -0.046,0.124 -0.059,0.234 -0.112,0.287 -0.221,0.219 -0.449,0.431 -0.686,0.626 -0.146,0.121 -0.305,0.231 -0.472,0.295 -0.069,0.027 -0.197,-0.057 -0.255,-0.134 -0.027,-0.035 0.029,-0.22 0.087,-0.264 0.322,-0.242 0.656,-0.461 0.985,-0.69 0.04,-0.029 0.074,-0.069 0.151,-0.141 -0.378,-0.034 -0.701,-0.077 -1.024,-0.087 -0.29,-0.009 -0.582,0.033 -0.872,0.023 -0.446,-0.015 -0.89,-0.057 -1.335,-0.084 -0.216,-0.014 -0.434,-0.004 -0.647,-0.034 -0.242,-0.034 -0.482,-0.055 -0.724,-0.061 v -0.366 c 0.107,0.022 0.214,0.044 0.321,0.058 0.298,0.036 0.596,0.053 0.895,0.076 0.286,0.022 0.572,0.055 0.858,0.059 0.468,0.007 0.937,-0.018 1.405,-0.008 0.356,0.008 0.713,0.056 1.07,0.074 0.262,0.012 0.525,0.006 0.788,0.007 0.259,0.001 0.518,-0.005 0.777,0.001 0.16,0.004 0.321,0.014 0.478,0.04 0.146,0.024 0.288,0.072 0.439,0.112 -0.033,-0.514 -0.033,-0.514 0.312,-0.69 0.009,-0.146 0.028,-0.289 0.024,-0.432 -0.011,-0.379 -0.036,-0.758 -0.043,-1.137 -0.002,-0.1 0.017,-0.23 0.072,-0.294 0.049,-0.057 0.16,-0.054 0.244,-0.054 0.061,0.001 0.124,0.063 0.183,0.058 0.284,-0.027 0.568,-0.071 0.852,-0.101 0.225,-0.025 0.452,-0.035 0.677,-0.059 0.147,-0.016 0.326,0.072 0.43,-0.226 0.103,0.131 0.228,0.22 0.253,0.339 0.034,0.156 -10e-4,0.337 -0.022,0.504 -0.022,0.174 -0.06,0.345 -0.095,0.517 -0.021,0.104 -0.062,0.204 -0.072,0.309 -0.016,0.178 -0.014,0.358 -0.02,0.536 -0.008,0.203 -0.016,0.406 -0.023,0.602 0.503,0.046 0.997,0.102 1.491,0.13 0.11,0.006 0.283,0.052 0.309,-0.197 0.006,-0.048 0.122,-0.106 0.189,-0.111 0.046,-0.004 0.1,0.072 0.146,0.117 0.044,0.043 0.08,0.128 0.124,0.134 0.136,0.016 0.274,0.008 0.412,0 0.273,-0.015 0.545,-0.044 0.817,-0.054 0.146,-0.006 0.293,0.028 0.438,0.023 0.185,-0.007 0.37,-0.058 0.554,-0.049 0.385,0.018 0.77,0.097 1.155,0.088 0.527,-0.013 1.053,-0.091 1.58,-0.128 0.225,-0.016 0.452,0.003 0.678,10e-4 0.351,-0.005 0.701,-0.026 1.052,-0.018 0.256,0.006 0.515,0.091 0.766,0.064 0.333,-0.035 0.662,-0.057 0.994,-0.018 0.146,0.018 0.237,-0.04 0.24,-0.234 0,-0.048 0.048,-0.095 0.074,-0.143 0.017,-0.033 0.051,-0.068 0.05,-0.1 -0.017,-0.243 0.083,-0.337 0.29,-0.299 0.017,-0.24 0.047,-0.468 0.046,-0.696 -10e-4,-0.305 -0.036,-0.61 -0.038,-0.915 0,-0.14 0.046,-0.281 0.071,-0.422 h 0.318 c 0.209,0.083 0.414,0.195 0.629,0.238 0.19,0.037 0.394,-0.026 0.588,-0.002 0.181,0.022 0.363,0.082 0.533,0.16 0.096,0.044 0.189,0.138 0.156,0.306 -0.058,0.298 -0.119,0.597 -0.155,0.9 -0.019,0.155 -0.026,0.347 0.036,0.471 0.063,0.126 0.023,0.175 -0.018,0.264 -0.039,0.084 -0.06,0.178 -0.085,0.255 0.538,0 1.036,0.023 1.531,-0.006 0.607,-0.036 1.213,-0.107 1.818,-0.181 0.295,-0.037 0.584,-0.129 0.878,-0.176 0.545,-0.085 1.09,-0.162 1.635,-0.24 -0.01,0.16 -0.021,0.32 -0.029,0.48 -0.555,0.036 -1.104,0.15 -1.657,0.214 -0.224,0.027 -0.445,0.089 -0.67,0.108 -0.607,0.054 -1.215,0.094 -1.823,0.136 -0.406,0.028 -0.812,0.046 -1.218,0.08 -0.132,0.011 -0.263,0.055 -0.391,0.096 -0.026,0.009 -0.054,0.071 -0.056,0.109 -0.016,0.351 -0.032,0.702 -0.038,1.053 -0.007,0.372 -0.007,0.743 0.002,1.114 0.001,0.044 0.073,0.123 0.112,0.123 0.45,-10e-4 0.9,-0.008 1.35,-0.024 0.608,-0.022 1.215,-0.057 1.823,-0.081 0.801,-0.03 1.604,-0.051 2.405,-0.086 0.015,-10e-4 0.03,-0.002 0.045,-0.002 0.017,0.142 0.046,0.281 0.09,0.418 0.003,0.008 0.006,0.014 0.008,0.021 -0.054,0.005 -0.108,0.012 -0.163,0.014 -0.699,0.024 -1.4,-0.004 -2.1,0.017 -0.617,0.018 -1.233,0.07 -1.85,0.111 -0.274,0.019 -0.548,0.056 -0.823,0.075 -0.27,0.019 -0.541,0.026 -0.823,0.038 0,0.02 -0.001,0.072 0,0.123 0.003,0.314 0.009,0.627 0.008,0.941 -0.001,0.251 -0.024,0.504 -0.01,0.754 0.008,0.138 0.052,0.245 0.238,0.227 0.701,-0.069 1.397,-0.227 2.107,-0.188 0.137,0.007 0.276,-0.047 0.416,-0.059 0.271,-0.023 0.544,-0.027 0.814,-0.057 0.57,-0.062 1.139,-0.135 1.708,-0.208 0.325,-0.042 0.65,-0.092 0.974,-0.144 0.095,-0.015 0.301,0.1 0.292,0.206 -0.006,0.071 -0.099,0.14 -0.164,0.194 -0.034,0.028 -0.089,0.027 -0.134,0.029 -0.223,0.013 -0.446,0.016 -0.668,0.035 -0.646,0.054 -1.293,0.101 -1.938,0.176 -0.688,0.08 -1.373,0.196 -2.061,0.283 -0.449,0.056 -0.901,0.086 -1.351,0.134 -0.055,0.005 -0.109,0.044 -0.151,0.061 0.074,0.113 0.135,0.206 0.192,0.294 0.113,0.017 0.223,0.052 0.332,0.046 0.325,-0.017 0.649,-0.047 0.972,-0.078 0.419,-0.041 0.838,-0.086 1.257,-0.132 0.47,-0.05 0.941,-0.1 1.411,-0.157 0.442,-0.053 0.882,-0.124 1.324,-0.169 0.393,-0.039 0.789,-0.068 1.183,-0.066 0.079,10e-4 0.157,0.164 0.235,0.252 -0.066,0.062 -0.128,0.171 -0.199,0.18"
           style="fill:#000000;fill-opacity:1;fill-rule:nonzero;stroke:none"
           id="path6222" />
      </g>
      <g
         id="g6224"
         transform="translate(407.1772,273.3894)">
        <path
           d="m 0,0 c -0.105,-0.031 -0.214,-0.057 -0.322,-0.059 -0.31,-0.006 -0.62,-0.004 -0.93,0.003 -0.267,0.007 -0.533,0.017 -0.798,0.041 -0.209,0.018 -0.415,0.07 -0.624,0.085 -0.2,0.015 -0.403,-0.019 -0.602,0.004 -0.691,0.08 -1.382,0.079 -2.075,0.029 -0.138,-0.01 -0.208,-0.089 -0.165,-0.23 0.025,-0.085 0.12,-0.198 0.186,-0.201 0.237,-0.011 0.474,0.025 0.711,0.034 0.454,0.018 0.909,0.053 1.361,0.037 0.466,-0.016 0.931,-0.099 1.398,-0.127 0.498,-0.029 0.998,-0.025 1.496,-0.043 0.127,-0.005 0.252,-0.053 0.378,-0.056 0.068,-0.002 0.143,0.036 0.202,0.08 0.052,0.039 0.086,0.11 0.136,0.177 C 0.251,-0.039 0.121,0.036 0,0"
           style="fill:#000000;fill-opacity:1;fill-rule:nonzero;stroke:none"
           id="path6226" />
      </g>
      <g
         id="g6228"
         transform="translate(405.4164,270.5315)">
        <path
           d="m 0,0 c -0.125,0.073 -0.215,-0.021 -0.251,-0.13 -0.021,-0.062 0.03,-0.191 0.083,-0.244 0.111,-0.112 0.241,-0.202 0.37,-0.287 0.385,-0.256 0.444,-0.212 0.616,0.054 C 0.654,-0.473 0.497,-0.338 0.334,-0.215 0.228,-0.134 0.114,-0.067 0,0"
           style="fill:#000000;fill-opacity:1;fill-rule:nonzero;stroke:none"
           id="path6230" />
      </g>
      <g
         id="g6232"
         transform="translate(381.3495,277.508)">
        <path
           d="M 0,0 C 0.128,-0.063 0.246,-0.155 0.371,-0.229 0.535,-0.326 0.606,-0.294 0.673,-0.142 0.537,0.034 0.434,0.193 0.307,0.322 0.231,0.398 0.121,0.443 0.021,0.464 -0.013,0.472 -0.091,0.369 -0.104,0.305 -0.125,0.19 -0.133,0.065 0,0"
           style="fill:#000000;fill-opacity:1;fill-rule:nonzero;stroke:none"
           id="path6234" />
      </g>
      <g
         id="g6236"
         transform="translate(406.4048,271.2756)">
        <path
           d="m 0,0 c -0.076,-0.069 -0.124,-0.165 -0.05,-0.259 0.089,-0.113 0.193,-0.212 0.3,-0.299 0.091,-0.074 0.18,-0.009 0.185,0.17 C 0.391,-0.272 0.347,-0.103 0.265,0.038 0.179,0.188 0.082,0.074 0,0"
           style="fill:#000000;fill-opacity:1;fill-rule:nonzero;stroke:none"
           id="path6238" />
      </g>
      <g
         id="g6240"
         transform="translate(383.1982,264.5622)">
        <path
           d="M 0,0 C 0.162,-0.001 0.237,0.108 0.198,0.288 0.161,0.458 -0.047,0.629 -0.191,0.567 -0.273,0.532 -0.387,0.398 -0.38,0.322 -0.363,0.122 -0.189,0.001 0,0"
           style="fill:#000000;fill-opacity:1;fill-rule:nonzero;stroke:none"
           id="path6242" />
      </g>
      <g
         id="g6244"
         transform="translate(391.0869,277.4475)">
        <path
           d="m 0,0 c -0.196,0.117 -0.385,0.249 -0.583,0.361 -0.154,0.087 -0.321,0.024 -0.356,-0.113 -0.056,-0.215 -0.003,-0.295 0.207,-0.37 0.17,-0.062 0.334,-0.149 0.502,-0.218 0.119,-0.05 0.241,-0.089 0.361,-0.134 0.002,0.009 0.004,0.017 0.006,0.025 0.035,0 0.082,-0.017 0.104,0.003 0.063,0.059 0.115,0.132 0.173,0.199 -0.052,0.042 -0.1,0.093 -0.156,0.124 C 0.175,-0.075 0.083,-0.049 0,0"
           style="fill:#000000;fill-opacity:1;fill-rule:nonzero;stroke:none"
           id="path6246" />
      </g>
      <g
         id="g6248"
         transform="translate(392.1122,278.2493)">
        <path
           d="M 0,0 C -0.073,0.133 -0.183,0.157 -0.281,0.058 -0.37,-0.03 -0.45,-0.17 -0.33,-0.288 c 0.123,-0.12 0.275,-0.198 0.463,-0.329 0.031,0.106 0.076,0.181 0.06,0.224 C 0.142,-0.255 0.07,-0.127 0,0"
           style="fill:#000000;fill-opacity:1;fill-rule:nonzero;stroke:none"
           id="path6250" />
      </g>
      <g
         id="g6252"
         transform="translate(394.0078,270.4123)">
        <path
           d="m 0,0 c -0.182,0.142 -0.38,0.255 -0.573,0.378 -0.153,0.097 -0.282,0.023 -0.282,-0.22 0.018,-0.031 0.047,-0.136 0.107,-0.174 0.198,-0.121 0.407,-0.216 0.611,-0.324 0.106,-0.055 0.216,-0.044 0.244,0.086 C 0.124,-0.182 0.061,-0.047 0,0"
           style="fill:#000000;fill-opacity:1;fill-rule:nonzero;stroke:none"
           id="path6254" />
      </g>
      <g
         id="g6256"
         transform="translate(394.3134,271.3288)">
        <path
           d="M 0,0 C -0.042,-0.121 -0.01,-0.213 0.106,-0.271 0.239,-0.337 0.366,-0.423 0.49,-0.509 0.731,-0.677 0.853,-0.618 0.904,-0.281 0.681,-0.142 0.469,-0.006 0.253,0.123 0.134,0.193 0.045,0.129 0,0"
           style="fill:#000000;fill-opacity:1;fill-rule:nonzero;stroke:none"
           id="path6258" />
      </g>
      <g
         id="g6260"
         transform="translate(402.6473,267.7239)">
        <path
           d="M 0,0 C 0.022,0.016 0.07,0.024 0.09,0.011 0.239,-0.086 0.219,-0.327 0.057,-0.403 0.013,-0.424 -0.037,-0.434 -0.089,-0.451 -0.149,-0.322 -0.098,-0.07 0,0 m -1.758,-2.303 c 0.165,-0.014 0.331,-10e-4 0.497,-0.008 0.038,-0.002 0.078,-0.035 0.113,-0.06 0.059,-0.043 0.114,-0.129 0.171,-0.129 0.119,10e-4 0.176,-0.069 0.236,-0.142 0.057,-0.07 0.103,-0.151 0.153,-0.228 0.047,-0.073 0.087,-0.153 0.144,-0.218 0.027,-0.031 0.111,-0.058 0.128,-0.042 0.064,0.06 0.142,0.131 0.16,0.21 0.05,0.222 0.072,0.45 0.107,0.675 0.012,0.078 0.058,0.113 0.14,0.107 0.038,-0.003 0.083,0.005 0.116,0.025 0.227,0.137 0.441,0.299 0.716,0.338 0.019,0.003 0.04,0.014 0.055,0.028 0.137,0.13 0.268,0.268 0.41,0.392 0.21,0.182 0.293,0.435 0.387,0.679 0.058,0.148 0.097,0.306 0.126,0.463 0.027,0.139 0.033,0.283 0.04,0.426 C 1.945,0.313 1.932,0.415 1.932,0.515 1.933,0.623 1.841,0.629 1.776,0.649 1.741,0.661 1.686,0.634 1.648,0.611 1.479,0.507 1.313,0.397 1.146,0.29 1.131,0.297 1.116,0.304 1.102,0.31 1.116,0.408 1.125,0.507 1.146,0.604 1.22,0.952 1.302,1.298 1.372,1.647 1.421,1.891 1.188,1.989 1.01,1.927 0.766,1.842 0.538,1.708 0.31,1.582 0.116,1.475 -0.05,1.334 -0.177,1.146 -0.293,0.975 -0.444,0.825 -0.551,0.649 -0.718,0.375 -0.857,0.083 -1.015,-0.197 -1.178,-0.487 -1.226,-0.816 -1.335,-1.125 -1.354,-1.177 -1.385,-1.226 -1.41,-1.276 -1.442,-1.323 -1.45,-1.4 -1.488,-1.42 -1.622,-1.49 -1.764,-1.55 -1.909,-1.596 -2.143,-1.67 -2.381,-1.731 -2.531,-1.952 v -0.076 c 0.111,-0.067 0.215,-0.154 0.334,-0.195 0.139,-0.048 0.291,-0.069 0.439,-0.08"
           style="fill:#000000;fill-opacity:1;fill-rule:nonzero;stroke:none"
           id="path6262" />
      </g>
      <g
         id="g6264"
         transform="translate(382.1581,269.6677)">
        <path
           d="m 0,0 c -0.159,-0.004 -0.198,-0.043 -0.19,-0.183 0.002,-0.027 -0.01,-0.063 -0.028,-0.081 -0.208,-0.204 -0.189,-0.459 -0.18,-0.72 0.004,-0.109 -0.051,-0.223 -0.089,-0.33 -0.052,-0.147 -0.128,-0.288 -0.163,-0.438 -0.014,-0.058 0.044,-0.18 0.093,-0.194 0.208,-0.062 0.425,-0.102 0.641,-0.137 0.165,-0.027 0.282,0.083 0.314,0.248 0.027,0.14 0.075,0.275 0.12,0.434 0.157,-0.07 0.269,-0.117 0.378,-0.168 0.344,-0.161 0.69,-0.317 1.03,-0.488 0.387,-0.194 0.764,-0.41 1.153,-0.602 0.534,-0.262 1.076,-0.507 1.612,-0.765 0.183,-0.088 0.357,-0.196 0.537,-0.29 0.413,-0.217 0.827,-0.433 1.241,-0.646 0.27,-0.139 0.539,-0.279 0.814,-0.406 0.361,-0.167 0.743,-0.277 1.096,-0.474 0.441,-0.248 0.92,-0.427 1.338,-0.723 0.156,-0.111 0.336,-0.188 0.494,-0.296 0.049,-0.033 0.099,-0.123 0.088,-0.175 -0.055,-0.265 -0.069,-0.532 -0.009,-0.793 0.024,-0.106 0.11,-0.221 0.202,-0.284 0.115,-0.078 0.262,-0.113 0.4,-0.155 0.241,-0.074 0.484,-0.124 0.697,-0.287 0.2,-0.151 0.416,-0.283 0.66,-0.376 0.298,-0.113 0.574,-0.287 0.862,-0.428 0.16,-0.077 0.326,-0.143 0.49,-0.211 0.078,-0.032 0.164,-0.049 0.237,-0.09 0.173,-0.096 0.425,-0.099 0.504,0.004 0.2,0.258 0.381,0.519 0.485,0.841 0.102,0.312 0.117,0.624 0.117,0.939 0,0.272 -0.077,0.546 -0.058,0.816 0.015,0.204 -0.08,0.306 -0.208,0.405 -0.287,0.221 -0.635,0.319 -0.965,0.45 -0.385,0.152 -0.788,0.257 -1.151,0.468 -0.244,0.141 -0.514,0.238 -0.772,0.352 -0.291,0.129 -0.586,0.089 -0.85,-0.046 -0.254,-0.13 -0.479,-0.319 -0.72,-0.486 C 9.911,-5.162 9.597,-5.002 9.279,-4.85 8.905,-4.67 8.526,-4.503 8.153,-4.321 7.984,-4.239 7.828,-4.132 7.662,-4.043 7.523,-3.97 7.379,-3.908 7.239,-3.839 6.846,-3.644 6.456,-3.443 6.061,-3.253 5.733,-3.096 5.399,-2.951 5.067,-2.802 4.792,-2.678 4.52,-2.543 4.237,-2.437 3.855,-2.291 3.458,-2.184 3.08,-2.029 2.708,-1.875 2.353,-1.677 1.986,-1.508 1.597,-1.329 1.205,-1.156 0.81,-0.992 0.68,-0.938 0.65,-0.86 0.703,-0.75 0.784,-0.578 0.871,-0.409 0.968,-0.247 1.037,-0.131 1.061,0.107 0.982,0.121 0.827,0.148 0.663,0.171 0.509,0.148 0.335,0.122 0.17,0.004 0,0"
           style="fill:#000000;fill-opacity:1;fill-rule:nonzero;stroke:none"
           id="path6266" />
      </g>
      <g
         id="g6268"
         transform="translate(388.7748,279.9138)">
        <path
           d="M 0,0 C -0.119,0.114 -0.124,0.174 -0.027,0.283 -0.009,0.304 0.005,0.341 0.003,0.369 -0.024,0.683 0.154,0.879 0.33,1.088 0.403,1.176 0.434,1.307 0.474,1.423 0.529,1.58 0.562,1.749 0.631,1.897 0.658,1.954 0.781,2.015 0.827,1.993 1.027,1.899 1.218,1.781 1.406,1.66 1.549,1.568 1.569,1.396 1.486,1.237 1.417,1.104 1.367,0.958 1.299,0.796 1.463,0.745 1.579,0.706 1.696,0.672 2.063,0.566 2.429,0.455 2.798,0.359 3.219,0.25 3.647,0.167 4.068,0.055 4.645,-0.1 5.217,-0.275 5.793,-0.434 5.99,-0.489 6.192,-0.521 6.391,-0.567 c 0.456,-0.108 0.911,-0.218 1.366,-0.33 0.295,-0.073 0.592,-0.144 0.884,-0.23 0.383,-0.113 0.746,-0.288 1.144,-0.37 0.497,-0.103 0.979,-0.288 1.489,-0.333 0.191,-0.017 0.378,-0.079 0.568,-0.1 0.059,-0.007 0.156,0.034 0.18,0.084 0.129,0.257 0.29,0.487 0.503,0.659 0.088,0.071 0.228,0.107 0.338,0.095 0.139,-0.015 0.274,-0.089 0.406,-0.15 0.232,-0.107 0.451,-0.235 0.718,-0.248 0.25,-0.013 0.501,-0.054 0.747,-0.148 0.302,-0.113 0.624,-0.162 0.935,-0.246 0.173,-0.047 0.341,-0.108 0.511,-0.165 0.081,-0.028 0.157,-0.074 0.239,-0.091 0.195,-0.041 0.389,-0.214 0.384,-0.354 -0.014,-0.351 -0.044,-0.692 -0.171,-1.03 -0.124,-0.328 -0.313,-0.596 -0.515,-0.856 -0.176,-0.224 -0.412,-0.397 -0.57,-0.633 -0.12,-0.179 -0.259,-0.197 -0.421,-0.189 -0.362,0.016 -0.69,0.177 -1.028,0.299 -0.392,0.142 -0.768,0.335 -1.182,0.413 -0.277,0.053 -0.546,0.161 -0.817,0.246 -0.306,0.096 -0.506,0.333 -0.62,0.628 -0.111,0.284 -0.161,0.596 -0.238,0.902 -0.335,0.088 -0.678,0.174 -1.02,0.269 -0.401,0.112 -0.799,0.237 -1.201,0.346 -0.182,0.05 -0.371,0.07 -0.556,0.113 -0.152,0.035 -0.302,0.084 -0.454,0.124 -0.426,0.112 -0.854,0.217 -1.279,0.336 -0.352,0.098 -0.7,0.21 -1.05,0.318 C 5.39,-1.119 5.096,-1.041 4.811,-0.934 4.424,-0.788 4.052,-0.6 3.663,-0.466 3.279,-0.333 2.88,-0.251 2.491,-0.135 2.078,-0.013 1.666,0.117 1.258,0.256 1.124,0.302 1.051,0.258 1.02,0.13 0.972,-0.067 0.93,-0.268 0.899,-0.469 0.877,-0.612 0.742,-0.825 0.673,-0.782 0.537,-0.697 0.396,-0.601 0.293,-0.476 0.178,-0.333 0.127,-0.122 0,0"
           style="fill:#000000;fill-opacity:1;fill-rule:nonzero;stroke:none"
           id="path6270" />
      </g>
    </g>
  </g>
</svg>
