<?xml version="1.0" encoding="UTF-8" standalone="no"?>
<!-- Created with Inkscape (http://www.inkscape.org/) -->

<svg
   width="128.0px"
   height="128.0px"
   viewBox="0 0 128.0 128.0"
   version="1.1"
   id="SVGRoot"
   sodipodi:docname="lost-city.svg"
   inkscape:version="1.2.2 (1:1.2.2+202212051550+b0a8486541)"
   xmlns:inkscape="http://www.inkscape.org/namespaces/inkscape"
   xmlns:sodipodi="http://sodipodi.sourceforge.net/DTD/sodipodi-0.dtd"
   xmlns="http://www.w3.org/2000/svg"
   xmlns:svg="http://www.w3.org/2000/svg">
  <sodipodi:namedview
     id="namedview1425"
     pagecolor="#ffffff"
     bordercolor="#666666"
     borderopacity="1.0"
     inkscape:showpageshadow="2"
     inkscape:pageopacity="0.0"
     inkscape:pagecheckerboard="0"
     inkscape:deskcolor="#d1d1d1"
     inkscape:document-units="px"
     showgrid="true"
     inkscape:zoom="6.0578002"
     inkscape:cx="54.145067"
     inkscape:cy="85.096897"
     inkscape:window-width="1920"
     inkscape:window-height="1016"
     inkscape:window-x="0"
     inkscape:window-y="27"
     inkscape:window-maximized="1"
     inkscape:current-layer="layer1">
    <inkscape:grid
       type="xygrid"
       id="grid1548" />
  </sodipodi:namedview>
  <defs
     id="defs1420">
    <linearGradient
       x1="0"
       y1="0"
       x2="1"
       y2="0"
       gradientUnits="userSpaceOnUse"
       gradientTransform="matrix(68.5035,94.441701,-94.441701,68.5035,47.596935,-10.35822)"
       spreadMethod="pad"
       id="linearGradient146">
      <stop
         style="stop-opacity:1;stop-color:#f6e135"
         offset="0"
         id="stop136" />
      <stop
         style="stop-opacity:1;stop-color:#351f17"
         offset="0.228946"
         id="stop138" />
      <stop
         style="stop-opacity:1;stop-color:#ae8f25"
         offset="0.513882"
         id="stop140" />
      <stop
         style="stop-opacity:1;stop-color:#ffffff"
         offset="0.807372"
         id="stop142" />
      <stop
         style="stop-opacity:1;stop-color:#ac8d26"
         offset="1"
         id="stop144" />
    </linearGradient>
    <linearGradient
       x1="0"
       y1="0"
       x2="1"
       y2="0"
       gradientUnits="userSpaceOnUse"
       gradientTransform="matrix(68.5035,94.441701,-94.441701,68.5035,-23.342232,41.097678)"
       spreadMethod="pad"
       id="linearGradient172">
      <stop
         style="stop-opacity:1;stop-color:#f6e135"
         offset="0"
         id="stop162" />
      <stop
         style="stop-opacity:1;stop-color:#351f17"
         offset="0.228946"
         id="stop164" />
      <stop
         style="stop-opacity:1;stop-color:#ae8f25"
         offset="0.513882"
         id="stop166" />
      <stop
         style="stop-opacity:1;stop-color:#ffffff"
         offset="0.807372"
         id="stop168" />
      <stop
         style="stop-opacity:1;stop-color:#ac8d26"
         offset="1"
         id="stop170" />
    </linearGradient>
    <linearGradient
       x1="0"
       y1="0"
       x2="1"
       y2="0"
       gradientUnits="userSpaceOnUse"
       gradientTransform="matrix(68.5035,94.441701,-94.441701,68.5035,50.248765,-12.28171)"
       spreadMethod="pad"
       id="linearGradient198">
      <stop
         style="stop-opacity:1;stop-color:#f6e135"
         offset="0"
         id="stop188" />
      <stop
         style="stop-opacity:1;stop-color:#351f17"
         offset="0.228946"
         id="stop190" />
      <stop
         style="stop-opacity:1;stop-color:#ae8f25"
         offset="0.513882"
         id="stop192" />
      <stop
         style="stop-opacity:1;stop-color:#ffffff"
         offset="0.807372"
         id="stop194" />
      <stop
         style="stop-opacity:1;stop-color:#ac8d26"
         offset="1"
         id="stop196" />
    </linearGradient>
    <linearGradient
       x1="0"
       y1="0"
       x2="1"
       y2="0"
       gradientUnits="userSpaceOnUse"
       gradientTransform="matrix(68.5035,94.441701,-94.441701,68.5035,-26.938852,43.706478)"
       spreadMethod="pad"
       id="linearGradient224">
      <stop
         style="stop-opacity:1;stop-color:#f6e135"
         offset="0"
         id="stop214" />
      <stop
         style="stop-opacity:1;stop-color:#351f17"
         offset="0.228946"
         id="stop216" />
      <stop
         style="stop-opacity:1;stop-color:#ae8f25"
         offset="0.513882"
         id="stop218" />
      <stop
         style="stop-opacity:1;stop-color:#ffffff"
         offset="0.807372"
         id="stop220" />
      <stop
         style="stop-opacity:1;stop-color:#ac8d26"
         offset="1"
         id="stop222" />
    </linearGradient>
    <linearGradient
       x1="0"
       y1="0"
       x2="1"
       y2="0"
       gradientUnits="userSpaceOnUse"
       gradientTransform="matrix(68.5035,94.441701,-94.441701,68.5035,7.2533467,18.905079)"
       spreadMethod="pad"
       id="linearGradient250">
      <stop
         style="stop-opacity:1;stop-color:#f6e135"
         offset="0"
         id="stop240" />
      <stop
         style="stop-opacity:1;stop-color:#351f17"
         offset="0.228946"
         id="stop242" />
      <stop
         style="stop-opacity:1;stop-color:#ae8f25"
         offset="0.513882"
         id="stop244" />
      <stop
         style="stop-opacity:1;stop-color:#ffffff"
         offset="0.807372"
         id="stop246" />
      <stop
         style="stop-opacity:1;stop-color:#ac8d26"
         offset="1"
         id="stop248" />
    </linearGradient>
    <linearGradient
       x1="0"
       y1="0"
       x2="1"
       y2="0"
       gradientUnits="userSpaceOnUse"
       gradientTransform="matrix(68.5035,94.441701,-94.441701,68.5035,39.098746,-4.1940407)"
       spreadMethod="pad"
       id="linearGradient276">
      <stop
         style="stop-opacity:1;stop-color:#f6e135"
         offset="0"
         id="stop266" />
      <stop
         style="stop-opacity:1;stop-color:#351f17"
         offset="0.228946"
         id="stop268" />
      <stop
         style="stop-opacity:1;stop-color:#ae8f25"
         offset="0.513882"
         id="stop270" />
      <stop
         style="stop-opacity:1;stop-color:#ffffff"
         offset="0.807372"
         id="stop272" />
      <stop
         style="stop-opacity:1;stop-color:#ac8d26"
         offset="1"
         id="stop274" />
    </linearGradient>
    <linearGradient
       x1="0"
       y1="0"
       x2="1"
       y2="0"
       gradientUnits="userSpaceOnUse"
       gradientTransform="matrix(68.5035,94.441701,-94.441701,68.5035,60.298355,-19.57123)"
       spreadMethod="pad"
       id="linearGradient302">
      <stop
         style="stop-opacity:1;stop-color:#f6e135"
         offset="0"
         id="stop292" />
      <stop
         style="stop-opacity:1;stop-color:#351f17"
         offset="0.228946"
         id="stop294" />
      <stop
         style="stop-opacity:1;stop-color:#ae8f25"
         offset="0.513882"
         id="stop296" />
      <stop
         style="stop-opacity:1;stop-color:#ffffff"
         offset="0.807372"
         id="stop298" />
      <stop
         style="stop-opacity:1;stop-color:#ac8d26"
         offset="1"
         id="stop300" />
    </linearGradient>
    <linearGradient
       x1="0"
       y1="0"
       x2="1"
       y2="0"
       gradientUnits="userSpaceOnUse"
       gradientTransform="matrix(68.5035,94.441701,-94.441701,68.5035,13.009846,14.729579)"
       spreadMethod="pad"
       id="linearGradient328">
      <stop
         style="stop-opacity:1;stop-color:#f6e135"
         offset="0"
         id="stop318" />
      <stop
         style="stop-opacity:1;stop-color:#351f17"
         offset="0.228946"
         id="stop320" />
      <stop
         style="stop-opacity:1;stop-color:#ae8f25"
         offset="0.513882"
         id="stop322" />
      <stop
         style="stop-opacity:1;stop-color:#ffffff"
         offset="0.807372"
         id="stop324" />
      <stop
         style="stop-opacity:1;stop-color:#ac8d26"
         offset="1"
         id="stop326" />
    </linearGradient>
    <linearGradient
       x1="0"
       y1="0"
       x2="1"
       y2="0"
       gradientUnits="userSpaceOnUse"
       gradientTransform="matrix(68.5035,94.441701,-94.441701,68.5035,38.487836,-3.7508607)"
       spreadMethod="pad"
       id="linearGradient354">
      <stop
         style="stop-opacity:1;stop-color:#f6e135"
         offset="0"
         id="stop344" />
      <stop
         style="stop-opacity:1;stop-color:#351f17"
         offset="0.228946"
         id="stop346" />
      <stop
         style="stop-opacity:1;stop-color:#ae8f25"
         offset="0.513882"
         id="stop348" />
      <stop
         style="stop-opacity:1;stop-color:#ffffff"
         offset="0.807372"
         id="stop350" />
      <stop
         style="stop-opacity:1;stop-color:#ac8d26"
         offset="1"
         id="stop352" />
    </linearGradient>
  </defs>
  <g
     inkscape:label="Layer 1"
     inkscape:groupmode="layer"
     id="layer1">
    <path
       d="m 106.841,45.712502 -10.142997,8.960999 v -10.744 L 87.584,41.126502 77.199001,37.933502 64,26.272502 l -4.929999,-4.355001 -18.654,16.480001 v 2.729 21.598996 l -9.114,-8.051997 L 21.160002,45.712502 0.9140027,63.598499 v 9.265 33.219001 H 127.086 v -33.219001 -9.265 z"
       style="fill:currentColor;fill-opacity:1;fill-rule:nonzero;stroke:none;stroke-width:0.999997"
       id="path122" />
    <path
       d="m 67.773905,82.987007 v 8.710999 c -0.528,-0.876 -0.476,-0.909 -1.38,-0.562 v 0 c -0.029,0.011 -0.046,0.054 -0.083,0.099 v 0 c 0.088,0.29 0.109,0.641 0.282,0.884 v 0 c 0.368,0.519 0.788,1.001 1.181,1.502 v 0 1.678 c -0.693,0.18 -1.189,-0.13 -1.577,-0.663 v 0 c -0.596,-0.82 -1.223,-1.629 -1.708,-2.513 v 0 c -0.335,-0.611 -0.686,-0.477 -1.148,-0.306 v 0 c -1.332,0.491 -2.657,1.004 -4.008,1.437 v 0 c -0.396,0.128 -0.844,0.287 -1.308,-0.089 v 0 c -0.554,-0.451 -1.179,-0.9 -1.848,-1.103 v 0 c -0.684,-0.207 -1.014,-0.973 -1.776,-0.97 v 0 c -0.058,0.001 -0.11,-0.1 -0.172,-0.143 v 0 c -0.904,-0.626 -1.792,-1.273999 -2.717,-1.866999 v 0 c -0.763,-0.49 -1.571,-0.911 -2.356,-1.366 v 0 c -0.292,-0.169 -0.571,-0.36 -0.868,-0.516 v 0 c -0.173,-0.091 -0.382,-0.208 -0.555,-0.183 v 0 c -0.361,0.054 -0.602,0.31 -0.587,0.69 v 0 c 0.007,0.176 0.101,0.412 0.235,0.507 v 0 c 0.536,0.379 1.098,0.722 1.66,1.062 v 0 c 1.103,0.668 2.223,1.306999 3.314,1.993999 v 0 c 0.72,0.452 1.383,0.994 2.103,1.447 v 0 c 0.645,0.406 1.334,0.744 2.069,1.148 v 0 c -0.598,0.303 -1.597,0.16 -1.986,-0.175 v 0 c -0.425,-0.367 -0.838,-0.765 -1.315,-1.051 v 0 c -0.901,-0.54 -1.863,-0.978 -2.766,-1.514 v 0 c -1.218,-0.724 -2.402,-1.501999 -3.603,-2.253999 v 0 c -0.16,-0.101 -0.334,-0.18 -0.497,-0.278 v 0 c -0.332,-0.201 -0.643,-0.446 -0.995999,-0.598 v 0 c -0.268,-0.116 -0.654,-0.248 -0.87,-0.139 v 0 c -0.662,0.335 -1.217,0.967 -2.071,0.517 v 0 c -0.031,-0.016 -0.094,0.031 -0.141,0.049 v 0 c 0.044,0.024 0.087,0.048 0.131,0.072 v 0 c -0.057,0.175 -0.064,0.457 -0.176,0.509 v 0 c -0.602,0.274 -1.214,0.53 -1.821,0.796 v 0 -3.275 h -4.234 v 5.032999 c -0.014,0.006 -0.03,0.011 -0.045,0.018 v 0 c -0.678,0.288 -1.336,0.623 -2.009,0.927 v 0 c -0.531,0.238 -1.076,0.444 -1.602,0.691 v 0 c -1.946,0.908 -3.876,1.849 -5.833,2.731 v 0 c -0.746,0.336 -1.598,0.453 -2.314,0.834 v 0 c -0.982,0.522 -1.977,0.415 -2.863,0.047 v 0 c -1.332,-0.552 -2.568,-1.341 -3.841,-2.034 v 0 c -0.854,-0.464 -1.699,-0.941 -2.553,-1.404 v 0 c -0.98,-0.531 -1.438,-0.398 -1.586,0.503 v 0 c -0.044,0.258 0.12,0.551 0.163,0.722 v 0 c 0.358,0.038 0.605,0.015 0.812,0.096 v 0 c 0.546,0.214 1.088,0.446 1.605,0.723 v 0 c 0.643,0.343 1.241,0.77 1.887,1.105 v 0 c 0.856,0.443 1.74,0.832 2.612,1.244 v 0 c -0.027,0.071 -0.054,0.141 -0.08,0.21 v 0 c -0.384,-0.072 -0.78,-0.108 -1.151,-0.224 v 0 c -0.854,-0.269 -1.697,-0.576 -2.544,-0.87 v 0 c -0.769,-0.268 -1.538,-0.538 -2.305,-0.809 v 0 c -0.316,-0.111 -0.647,-0.197 -0.942,-0.35 v 0 c -0.441,-0.228 -0.838,-0.548 -1.289,-0.752 v 0 c -0.810999,-0.368 -1.638999,-0.707 -2.4819994,-0.998 v 0 c -0.268,-0.093 -0.642,-0.08 -0.895,0.04 v 0 c -0.299,0.14 -0.439,0.429 -0.276,0.838 v 0 c 0.229,0.573 0.366,1.182 0.518,1.782 v 0 c 0.08,0.319 0.104,0.651 0.161,0.975 v 0 c 0.179,1.015 0.361,2.03 0.55,3.092004 v 0 c 0.4090004,0.06 0.1740004,0.547 0.2880004,0.855 v 0 c 0.056,0.152 0.078,0.437 0.145,0.446 v 0 c 0.514,0.072 1.038,0.147 1.552,0.113 v 0 c 0.825999,-0.054 1.674999,-0.367 2.465999,-0.249 v 0 c 0.759,0.113 1.51,0.094 2.26,0.074 v 0 c 0.476,-0.013 0.95,-0.025 1.427,-0.005 v 0 c 0.572,0.026 1.147,0.018 1.72,0.008 v 0 c 0.173,-0.003 0.344,-0.065 0.442,-0.086 v 0 c 0.236,0.059 0.444,0.121 0.655,0.158 v 0 c 0.156,0.027 0.318,0.021 0.476,0.035 v 0 c 0.789,0.071 1.576,0.172 2.366,0.207 v 0 c 0.438,0.019 0.877,0.016 1.316,0.013 v 0 c 0.458,-0.003 0.916,-0.005 1.372,0.015 v 0 c 0.713,0.035 1.42,0.182 2.133,0.219 v 0 c 0.485,0.025 0.973,0.019 1.461,0.013 v 0 c 0.272,-0.004 0.545,-0.007 0.819,-0.006 v 0 c 1.139,0.009 2.279,-0.009 3.416,0.055 v 0 c 0.19,0.011 0.379,-0.001 0.569,-0.012 v 0 c 0.319,-0.02 0.64,-0.041 0.976,0.046 v 0 c 0.521,0.134 1.102,0.032 1.657,0.031 v 0 c 0.076,0 0.187,0.009 0.222,-0.034 v 0 c 0.325,-0.399 0.733,-0.766 0.936,-1.223 v 0 c 0.587,-1.323 1.523,-2.223004 2.917,-2.595004 v 0 c 0.723,-0.193 1.411,0.006 1.963,0.514 v 0 c 0.623,0.571 0.617,1.397004 0.619,2.126004 v 0 c 10e-4,0.603 -0.027,0.788 0.65,0.961 v 0 c 0.06,-0.104 0.12,-0.302 0.187,-0.304 v 0 c 0.748999,-0.021 1.031999,-0.673 1.475999,-1.086 v 0 c 0.734,-0.683 1.395,-0.832 2.27,-0.443 v 0 c 0.583,0.259 0.701,0.838 0.987,1.31 v 0 c 0.104,0.172 0.443,0.395 0.545,0.343 v 0 c 0.7,-0.358 1.431,-0.294 2.164,-0.263 v 0 c 0.705,0.03 1.408,0.095 2.113,0.109 v 0 c 0.318,0.006 0.636,-0.1 0.955,-0.104 v 0 c 0.36,-0.005 0.721,0 1.081,0.003 v 0 c 0.564,0.007 1.128,0.015 1.69,-0.016 v 0 c 0.677,-0.036 1.325,-0.151 2.007,0.099 v 0 c 0.45,0.166 0.986,0.151 1.479,0.131 v 0 c 1.14,-0.045 2.279,-0.144 3.418,-0.218 v 0 c 0.646,-0.043 1.292,-0.098 1.939,-0.112 v 0 c 0.966,-0.018 1.932,-0.005 2.898,-0.004 v 0 c 0.229,0 0.46,-0.004 0.688,0.017 v 0 c 0.659,0.061 1.318,0.195 1.976,0.187 v 0 c 0.857,-0.011 1.712,-0.174 2.571,-0.193 v 0 c 0.835,-0.017 1.673,0.093 2.51,0.095 v 0 c 0.335,0.002 0.67,-0.022 1.005,-0.046 v 0 c 0.422999,-0.03 0.845999,-0.06 1.267999,-0.04 v 0 c 0.935,0.044 1.862,0.143 2.797,-0.012 v 0 c 0.177,-0.03 0.37,0.053 0.558,0.065 v 0 c 0.911,0.054 1.826,0.158 2.736,0.133 v 0 c 0.695,-0.02 1.385,-0.299 2.077,-0.301 v 0 c 1.105,-0.001 2.211,0.136 3.317,0.206 v 0 c 0.458,0.029 0.918,0.059 1.376,0.046 v 0 c 0.833,-0.022 1.677,-0.185 2.495,-0.093 v 0 c 1.334,0.149 2.652,0.405 4.001,0.171 v 0 c 0.124,-0.022 0.263,0.018 0.39,0.05 v 0 c 0.514996,0.128 1.393996,-0.475 1.503996,-0.989 v 0 c 0.169,-0.786 0.315,-1.588004 0.594,-2.337004 v 0 c 0.244,-0.655 0.741,-1.16 1.461,-1.479 v 0 c 0.333,0.522 0.699,0.969 0.925,1.479 v 0 c 0.29,0.654 0.553,1.343004 0.668,2.043004 v 0 c 0.12,0.729 0.326,0.946 0.984,0.683 v 0 c 0.086,-0.033 0.189,-0.028 0.284,-0.032 v 0 c 1.166,-0.039 2.331,-0.082 3.497,-0.111 v 0 c 0.521,-0.013 1.045,-0.031 1.563,0.012 v 0 c 1.094,0.09 2.187,0.209 3.278,0.333 v 0 c 0.944,0.108 1.884,0.239 2.88,0.366 v 0 c 0.19,-0.249 0.423,-0.555 0.648,-0.852 v 0 c -0.179,-0.31 -0.756,-0.492 -0.313,-0.826 v 0 c -0.092,-0.288 -0.262,-0.645004 -0.211,-0.680004 v 0 c 0.463,-0.313 0.062,-0.475 -0.1,-0.646 v 0 c -0.178,-0.19 -0.404,-0.335 -0.603,-0.506 v 0 c -0.338,-0.294 -0.386,-1.202 -0.145,-1.593 v 0 c 0.454,-0.735 0.783,-1.521 0.459,-2.4 v 0 c -0.184,-0.496 -0.446,-0.963 -0.674,-1.443 v 0 c -0.467,-0.982 -0.606,-2.056 -0.849,-3.099999 v 0 c -0.27,-1.163 -0.507,-2.333 -0.782,-3.494 v 0 c -0.064,-0.27 -0.276,-0.507 -0.321,-0.777 v 0 c -0.044,-0.268 -0.015,-0.595 -0.352,-0.581 v 0 c -0.239,0.011 -0.542,0.176 -0.687,0.369 v 0 c -0.428,0.575 -0.782,1.204 -1.184,1.799 v 0 c -0.55,0.814 -1.184,1.578 -1.662,2.43 v 0 c -0.571,1.016999 -1.36,1.684999 -2.487,1.921999 v 0 c -0.822,0.174 -1.558,0.62 -2.416,0.686 v 0 c -0.357,0.028 -0.694,0.253 -1.051,0.348 v 0 c -1.073,0.282 -2.147,0.567 -3.231,0.809 v 0 c -0.884,0.197 -1.787996,0.306 -2.670996,0.51 v 0 c -0.474,0.11 -0.739,-0.028 -0.973,-0.428 v 0 c -0.289,-0.495 -0.652,-0.947 -0.946,-1.438 v 0 c -0.388,-0.646 -0.781,-1.294 -1.091,-1.977999 v 0 c -0.155,-0.344 -0.395,-0.578 -0.651,-0.394 v 0 c -0.257,0.185 -0.539,0.644999 -0.474,0.900999 v 0 c 0.123,0.49 0.459,0.936 0.753,1.37 v 0 c 0.466,0.687 0.969,1.35 1.476,2.05 v 0 c -0.927,0.323 -1.594,0.172 -2.097,-0.579 v 0 c -0.445,-0.666 -0.922,-1.312 -1.388,-1.964 v 0 c -0.51,-0.715 -1.104,-1.385999 -1.503,-2.157999 v 0 c -0.234,-0.452 -0.527,-0.429 -0.82,-0.351 v 0 c -0.721,0.191 -1.416,0.483 -2.132,0.694 v 0 c -0.821,0.243 -1.647,0.472 -2.483,0.654999 v 0 c -1.195,0.261 -2.407,0.442 -3.598,0.716 v 0 c -1.504,0.345 -2.996,0.749 -4.491999,1.13 v 0 c -0.284,0.072 -0.567,0.149 -0.847,0.236 v 0 c -0.515,0.161 -1.039,0.3 -1.535,0.506 v 0 c -0.797,0.332 -1.575,0.713 -2.363,1.067 v 0 -11.093999 z"
       style="fill:url(#linearGradient146);stroke:none"
       id="path148" />
    <path
       d="m 5.1749067,86.182007 c 0.071,1.528 -0.714,2.819 -1.193,4.187999 v 0 c -0.1389999,0.4 -0.055,0.626 0.236,0.735 v 0 c 0.405,0.152 0.881,0.122 1.28,0.285 v 0 c 1.061,0.432 2.0899999,0.939 3.1459999,1.384 v 0 c 0.298,0.126 0.663,0.25 0.868,-0.207 v 0 c 0.037,-0.084 0.184,-0.164 0.283,-0.167 v 0 c 0.9340004,-0.018 -0.107,-0.916 0.4860004,-1.077 v 0 c -0.082,-0.163 -0.121,-0.396 -0.254,-0.478 v 0 c -0.7490004,-0.464 -1.2610004,-1.155999 -1.8460004,-1.782999 v 0 c -0.147,-0.158 0.231,-0.427 -0.226,-0.528 v 0 c -0.238,-0.052 -0.365,-0.607 -0.542,-0.935 v 0 c 0.026,-0.008 0.052,-0.016 0.077,-0.024 v 0 c -0.009,-0.082 0.012,-0.191 -0.033,-0.242 v 0 c -0.4879999,-0.55 -0.8879999,-1.147 -1.1039999,-1.858 v 0 c -0.016,-0.054 -0.15,-0.091 -0.232,-0.102 v 0 c -0.008,-0.001 -0.016,-0.002 -0.024,-0.002 v 0 c -0.275,0 -0.935,0.559 -0.922,0.811"
       style="fill:url(#linearGradient172);stroke:none"
       id="path174" />
    <path
       d="m 117.2799,86.525007 c -0.782,0.014 -1.116,0.582 -0.855,1.322 v 0 c 0.338,0.954 0.554,1.942 0.497,2.966999 v 0 c -0.031,0.564 0.278,1.193 0.62,1.222 v 0 c 0.455,0.038 1.197,-0.663 1.248,-1.127 v 0 c 0.019,-0.174 0.17,-0.333 0.262,-0.497 v 0 c 0.137,-0.245999 0.296,-0.481999 0.411,-0.736999 v 0 c 0.165,-0.366 0.348,-0.736 0.434,-1.124 v 0 c 0.086,-0.394 0.189,-0.863 0.05,-1.204 v 0 c -0.122,-0.302 -0.536,-0.561 -0.877,-0.677 v 0 c -0.414,-0.142 -0.885,-0.112 -1.224,-0.145 v 0 c -0.175,0 -0.301,-0.001 -0.41,-0.001 v 0 c -0.055,0 -0.105,0 -0.156,0.001"
       style="fill:url(#linearGradient198);stroke:none"
       id="path200" />
    <path
       d="m 4.1399067,94.018006 c -0.2239999,0.155 -0.3539999,0.445 -0.5879999,0.762 v 0 c 0.134,0.126 0.361,0.325 0.5699999,0.541 v 0 c 0.333,0.341 0.729,0.651 0.967,1.052 v 0 c 0.574,0.968 1.072,1.981 1.607,2.986 v 0 c 1.1249999,-0.737 1.2349999,-1.168 0.8369999,-2.302 v 0 c -0.113,-0.323 -0.096,-0.741 -10e-4,-1.077 v 0 c 0.185,-0.661 0.159,-1.125 -0.221,-1.289 v 0 c -0.7689999,-0.332 -1.5349999,-0.686 -2.3309999,-0.941 v 0 c -0.038,-0.012 -0.078,-0.017 -0.122,-0.017 v 0 c -0.227,0 -0.52,0.147 -0.718,0.285"
       style="fill:url(#linearGradient224);stroke:none"
       id="path226" />
    <path
       d="m 31.136906,59.141007 v 0 c 0,0 -3.922,3.486 -5.375,8.425 v 0 h -0.291 -1.451 -10e-4 -0.29 c -1.453,-4.939 -5.376,-8.425 -5.376,-8.425 v 0 c -6.665999,6.231 -5.093,12.173 -5.085,12.201 v 0 c -1.162999,-2.469 -4.0669994,-3.485 -4.0669994,-3.485 v 0 h -10e-4 c 0.291,4.5 3.0470004,7.694 3.0510004,7.7 v 0 c -2.6140004,-1.744 -6.2460003,-2.034 -6.2460003,-2.034 v 0 h -0.001 c 5.4280003,7.811 16.6429993,16.945999 18.5899993,18.504999 v 0 c 0.058,0.045 0.111,0.088 0.151,0.12 v 0 c 0.041,-0.032 0.094,-0.075 0.151,-0.12 v 0 c 1.948,-1.559 13.162,-10.693999 18.59,-18.504999 v 0 c 0,0 -3.632,0.29 -6.246,2.034 v 0 c 0.004,-0.006 2.76,-3.2 3.05,-7.7 v 0 c 0,0 -2.904,1.016 -4.067,3.485 v 0 c 0.007,-0.028 1.581,-5.97 -5.085,-12.201 v 0 z m -0.787,16.516 c 0.658,0.045 1.461,0.278 2.449,0.771 v 0 l -4.643,4.642 c -0.17,-1.317 -0.438,-5.163 2.194,-5.413 m -13.658,0.771 c 0.987,-0.493 1.791,-0.726 2.448,-0.771 v 0 c 2.633,0.25 2.364,4.096 2.194,5.413 v 0 z"
       style="fill:url(#linearGradient250);stroke:none"
       id="path252" />
    <path
       d="m 52.467905,43.027008 c -2.131,2.078 0.611,9.913 1.51,12.289 v 0 c -2.897,2.047999 -4.773,5.259999 -4.773,8.882999 v 0 c 0,6.187 5.443,11.202 12.157,11.202 v 0 c 6.714,0 12.157,-5.015 12.157,-11.202 v 0 c 0,-3.623 -1.876,-6.835 -4.773,-8.882999 v 0 c 0.899,-2.376 3.642,-10.211 1.511,-12.289 v 0 c -0.989,-0.964 -1.84,-1.298 -2.573,-1.298 v 0 c -1.136,0 -1.984,0.8 -2.615,1.298 v 0 c -0.859,0.678 -1.21,6.212 -1.305,10.192 v 0 c -0.777,-0.143 -1.58,-0.22 -2.402,-0.22 v 0 c -0.822,0 -1.625,0.077 -2.401,0.22 v 0 c -0.096,-3.98 -0.447,-9.514 -1.306,-10.192 v 0 c -0.63,-0.498 -1.48,-1.298 -2.614,-1.298 v 0 c -0.733,0 -1.585,0.333 -2.573,1.298 m 11.309,20.557999 c 0,-1.395 1.228,-2.527 2.743,-2.527 v 0 c 1.515,0 2.744,1.132 2.744,2.527 v 0 c 0,1.396 -1.229,2.527 -2.744,2.527 v 0 c -1.515,0 -2.743,-1.131 -2.743,-2.527 m -10.316,0 c 0,-1.395 1.228,-2.527 2.743,-2.527 v 0 c 1.515,0 2.743,1.132 2.743,2.527 v 0 c 0,1.396 -1.228,2.527 -2.743,2.527 v 0 c -1.515,0 -2.743,-1.131 -2.743,-2.527"
       style="fill:url(#linearGradient276);stroke:none"
       id="path278" />
    <path
       d="m 100.0449,62.152007 c 0,0.1 0.004,0.199 0.008,0.299 v 0 c -0.831996,-0.194 -1.697996,-0.299 -2.588996,-0.299 v 0 c -0.009,0 -0.019,0.001 -0.028,0.001 v 0 c -0.01,0 -0.019,-0.001 -0.029,-0.001 v 0 c -0.891,0 -1.756,0.105 -2.589,0.299 v 0 c 0.005,-0.1 0.008,-0.199 0.008,-0.299 v 0 c 0,-3.925 -3.181,-7.105999 -7.106,-7.105999 v 0 c -3.925,0 -7.107,3.180999 -7.107,7.105999 v 0 c 0,3.634 2.729,6.629 6.25,7.053 v 0 c -0.554,1.341 -0.862,2.811 -0.862,4.354 v 0 c 0,2.075 0.557,4.019 1.526,5.696 v 0 l -2.74,1.635 1.008,1.69 2.861,-1.707 c 0.308,0.367 0.638,0.714 0.989,1.04 v 0 l -2.337,2.392 1.407,1.376 2.491,-2.551 c 1.786,1.159 3.915,1.835 6.201,1.835 v 0 c 0.01,0 0.019,-0.001 0.029,-0.001 v 0 c 0.009,0 0.019,0.001 0.028,0.001 v 0 c 2.386,0 4.598996,-0.733 6.430996,-1.985 v 0 l 2.638,2.701 1.407,-1.376 -2.518,-2.578 c 0.325,-0.317 0.631,-0.652 0.917,-1.005 v 0 l 3.115,1.858 1.008,-1.69 -3.021,-1.802 c 0.91,-1.639 1.43,-3.523 1.43,-5.529 v 0 c 0,-1.543 -0.308,-3.013 -0.862,-4.354 v 0 c 3.52,-0.424 6.249,-3.419 6.249,-7.053 v 0 c 0,-3.925 -3.181,-7.105999 -7.106,-7.105999 v 0 c -3.925,0 -7.107,3.180999 -7.107,7.105999 m 0.19,12.223 c 0,-1.451 1.177,-2.627 2.627,-2.627 v 0 c 0.003,0 0.007,0.001 0.01,0.001 v 0 c 1.447,0.005 2.617,1.179 2.617,2.626 v 0 c 0,1.448 -1.17,2.622 -2.617,2.626 v 0 c -0.003,0.001 -0.007,0.001 -0.01,0.001 v 0 c -1.45,0 -2.627,-1.176 -2.627,-2.627 m -10.872996,0 c 0,-1.451 1.177,-2.627 2.627,-2.627 v 0 c 0.004,0 0.008,0.001 0.01,0.001 v 0 c 1.447,0.005 2.618,1.179 2.618,2.626 v 0 c 0,1.448 -1.171,2.622 -2.618,2.627 v 0 c -0.002,0 -0.006,0 -0.01,0 v 0 c -1.45,0 -2.627,-1.176 -2.627,-2.627"
       style="fill:url(#linearGradient302);stroke:none"
       id="path304" />
    <path
       d="m 50.814905,83.075007 h 5.389 v -5.39 h -5.389 z"
       style="fill:url(#linearGradient328);stroke:none"
       id="path330" />
    <path
       d="m 56.203905,33.989008 h 4.166 v -4.166 h -4.166 z"
       style="fill:url(#linearGradient354);stroke:none"
       id="path356" />
  </g>
</svg>
