<?xml version="1.0" encoding="UTF-8" standalone="no"?>
<!-- Created with Inkscape (http://www.inkscape.org/) -->

<svg
   width="128.0px"
   height="128.0px"
   viewBox="0 0 128.0 128.0"
   version="1.1"
   id="SVGRoot"
   sodipodi:docname="rabbit-outline.svg"
   inkscape:version="1.2.1 (1:1.2.1+202210291244+9c6d41e410)"
   xmlns:inkscape="http://www.inkscape.org/namespaces/inkscape"
   xmlns:sodipodi="http://sodipodi.sourceforge.net/DTD/sodipodi-0.dtd"
   xmlns="http://www.w3.org/2000/svg"
   xmlns:svg="http://www.w3.org/2000/svg">
  <sodipodi:namedview
     id="namedview167530"
     pagecolor="#ffffff"
     bordercolor="#666666"
     borderopacity="1.0"
     inkscape:showpageshadow="2"
     inkscape:pageopacity="0.0"
     inkscape:pagecheckerboard="0"
     inkscape:deskcolor="#d1d1d1"
     inkscape:document-units="px"
     showgrid="true"
     inkscape:zoom="4.2835116"
     inkscape:cx="98.750754"
     inkscape:cy="86.961361"
     inkscape:window-width="1920"
     inkscape:window-height="1016"
     inkscape:window-x="0"
     inkscape:window-y="27"
     inkscape:window-maximized="1"
     inkscape:current-layer="layer1">
    <inkscape:grid
       type="xygrid"
       id="grid167653" />
  </sodipodi:namedview>
  <defs
     id="defs167525" />
  <g
     inkscape:label="Layer 1"
     inkscape:groupmode="layer"
     id="layer1">
    <g
       id="g62358"
       transform="matrix(5.4162066,0,0,-5.4162066,48.020847,82.374481)">
      <path
         d="m 0,0 c -0.471,0 -0.562,0.315 -0.593,0.419 -0.06,0.208 -0.108,0.495 0.012,0.677 0.108,0.166 0.368,0.281 0.731,0.326 0.057,0.007 0.113,0.011 0.165,0.011 0.37,0 0.597,-0.157 0.633,-0.196 C 1.113,1.003 1.146,0.781 1.039,0.572 0.873,0.251 0.417,0 0,0 M 5.651,0.028 C 5.569,0.028 4.843,0.046 4.807,0.697 4.782,1.121 4.846,1.318 5.544,1.424 5.638,1.439 5.725,1.446 5.806,1.446 6.234,1.446 6.475,1.262 6.52,0.9 6.55,0.654 6.5,0.455 6.37,0.309 6.215,0.133 5.946,0.028 5.651,0.028 M 6.279,12.901 H 6.278 6.268 C 3.937,12.893 3.817,10.528 3.723,8.629 3.693,8.043 3.663,7.443 3.578,6.92 H 3.572 C 3.306,6.92 3.019,6.916 2.747,6.912 2.579,6.909 2.417,6.906 2.27,6.905 2.247,8.63 2.072,10.224 1.749,11.648 l -0.03,0.132 -0.085,0.104 c -0.503,0.609 -1.242,0.959 -2.029,0.959 -1.052,0 -1.973,-0.619 -2.293,-1.541 -0.506,-1.47 0.112,-3.229 0.61,-4.643 0.169,-0.481 0.331,-0.941 0.423,-1.321 -1.088,-0.981 -2.118,-2.127 -2.377,-3.985 -0.264,-1.9 0.229,-3.632 1.428,-5.008 1.34,-1.541 3.456,-2.461 5.656,-2.461 1.435,0 2.796,0.391 3.933,1.133 2.044,1.33 3.192,3.629 2.995,6.001 C 9.833,2.788 8.903,3.894 8.083,4.869 7.928,5.054 7.774,5.236 7.626,5.423 c 0.443,1.145 1.7,4.785 0.524,6.551 -0.281,0.423 -0.835,0.927 -1.871,0.927 M 0,-0.567 c 1.024,0 2.21,1.005 1.4,2.146 C 1.284,1.742 0.882,2 0.315,2 0.24,2 0.162,1.995 0.081,1.985 -0.799,1.876 -1.467,1.388 -1.137,0.26 -0.966,-0.325 -0.503,-0.567 0,-0.567 m 5.651,0.028 c 0.775,0 1.555,0.508 1.431,1.51 C 7.009,1.556 6.582,2.013 5.806,2.013 5.697,2.013 5.581,2.004 5.459,1.985 4.65,1.862 4.191,1.539 4.24,0.665 4.286,-0.141 4.967,-0.539 5.651,-0.539 m 0.628,12.873 c 3.017,0 1.483,-5.131 0.7,-7 C 7.922,4.062 9.245,3.017 9.415,0.971 9.617,-1.465 8.326,-3.435 6.676,-4.508 5.586,-5.218 4.317,-5.549 3.052,-5.549 c -3.567,0 -7.106,2.63 -6.523,6.823 0.248,1.781 1.251,2.817 2.436,3.857 -0.223,1.475 -1.769,4.095 -1.116,5.986 0.254,0.735 0.988,1.159 1.756,1.159 0.573,0 1.165,-0.235 1.591,-0.753 0.351,-1.545 0.52,-3.271 0.508,-5.176 0.093,-0.008 0.228,-0.01 0.389,-0.01 0.405,0 0.978,0.017 1.479,0.017 0.166,0 0.324,-0.002 0.466,-0.007 0.572,2.216 -0.324,5.978 2.232,5.987 h 0.009"
         style="fill:#000000;fill-opacity:1;fill-rule:nonzero;stroke:none"
         id="path62360" />
    </g>
  </g>
</svg>
