<?xml version="1.0" encoding="UTF-8" standalone="no"?>
<svg
   version="1.1"
   viewBox="0 0 128 128"
   id="svg6"
   sodipodi:docname="vagabond1.svg"
   width="128"
   height="128"
   inkscape:version="1.2.2 (1:1.2.2+202212051550+b0a8486541)"
   xmlns:inkscape="http://www.inkscape.org/namespaces/inkscape"
   xmlns:sodipodi="http://sodipodi.sourceforge.net/DTD/sodipodi-0.dtd"
   xmlns="http://www.w3.org/2000/svg"
   xmlns:svg="http://www.w3.org/2000/svg">
  <defs
     id="defs10" />
  <sodipodi:namedview
     id="namedview8"
     pagecolor="#ffffff"
     bordercolor="#666666"
     borderopacity="1.0"
     inkscape:showpageshadow="2"
     inkscape:pageopacity="0.0"
     inkscape:pagecheckerboard="0"
     inkscape:deskcolor="#d1d1d1"
     showgrid="false"
     inkscape:zoom="1.7"
     inkscape:cx="171.47059"
     inkscape:cy="159.70588"
     inkscape:window-width="1920"
     inkscape:window-height="1016"
     inkscape:window-x="0"
     inkscape:window-y="27"
     inkscape:window-maximized="1"
     inkscape:current-layer="svg6" />
  <path
     fill="currentColor"
     d="m 117.72855,89.87494 c 0.18774,0.842461 0.0471,1.639692 -0.42457,2.369532 -0.46933,0.748594 -1.12406,1.217928 -1.96652,1.403316 -2.34187,0.657071 -3.7452,1.032539 -4.21219,1.124063 -1.4972,0.281601 -3.18212,0.657071 -5.05242,1.124063 -1.875,0.469335 -3.60446,0.750937 -5.19551,0.842461 -0.0939,0 -0.39891,0.07043 -0.912776,0.211172 -0.516211,0.140742 -0.962109,0.164179 -1.33524,0.07031 -0.560859,0.190078 -1.403316,0.305039 -2.52738,0.351914 -1.124062,0.04934 -1.964184,0.119766 -2.52738,0.211289 -0.187734,0.09387 -0.537422,0.140742 -1.051288,0.140742 h -1.194375 c -0.373125,0.09387 -1.100625,0.190078 -2.175348,0.281602 -1.077071,0.09621 -1.896096,0.234609 -2.456952,0.422343 -0.09621,0.09387 -0.281601,0.09387 -0.563203,0 -0.375469,-0.09152 -0.91289,-0.09152 -1.614492,0 -0.701602,0.09387 -1.217808,0.119649 -1.543944,0.07031 -0.328476,-0.04687 -0.490429,0.117421 -0.490429,0.490547 0,0.471679 -0.09387,1.147496 -0.281602,2.036826 -0.190077,0.88934 -0.281601,1.42675 -0.281601,1.61449 -0.09621,0.37547 -0.14086,0.91289 -0.14086,1.6145 v 1.47363 c -0.09621,0.5632 -0.281602,1.1686 -0.563203,1.82567 -0.171328,0.42703 -0.537423,1.82801 -1.095937,4.20281 -0.105586,0.45527 -0.23461,0.93398 -0.373008,1.38223 l -0.915118,2.97774 c -0.375469,1.21559 -0.701602,2.24578 -0.983203,3.08825 -0.654726,1.87266 -1.309452,3.32285 -1.964184,4.35305 -0.09387,0.18539 -0.211173,0.46699 -0.352031,0.84246 -0.14086,0.37312 -0.258164,0.65472 -0.349687,0.84246 -0.750937,1.03019 -1.26246,1.63793 -1.544064,1.82567 -0.654726,0.37312 -1.26246,0.32613 -1.823316,-0.14086 -0.56086,-0.46934 -1.077071,-0.70161 -1.544064,-0.70161 -0.09387,0 -0.232266,-0.0493 -0.42,-0.14085 -0.281602,-0.18774 -0.701602,-0.51622 -1.2648,-0.98321 -0.56086,-0.46933 -0.98086,-0.79547 -1.26246,-0.9832 -1.499532,-1.0302 -2.621256,-2.0134 -3.36984,-2.94738 -0.448242,-0.5209 -0.828399,-0.96211 -1.142813,-1.32118 -0.687539,-0.78609 -1.314144,-1.62386 -1.87734,-2.50382 -0.373126,-0.5843 -0.819024,-1.27419 -1.332888,-2.06965 -0.09387,-0.0939 -0.208828,-0.21118 -0.349571,-0.35192 -0.140743,-0.14074 -0.211172,-0.26039 -0.211172,-0.35191 -0.190078,-0.27926 -0.633633,-0.91055 -1.33524,-1.89375 -0.701608,-0.98319 -1.241364,-1.75524 -1.614492,-2.31609 0,-0.18774 -0.208828,-0.7016 -0.631173,-1.54407 -0.42,-0.84246 -0.818906,-1.49953 -1.19203,-1.96652 -0.281602,-0.37313 -0.680508,-1.0302 -1.194375,-1.96652 -0.513866,-0.93633 -0.959766,-1.59106 -1.332888,-1.96653 -0.563203,-0.74859 -0.842461,-1.35632 -0.842461,-1.82567 0.09152,-0.2816 -0.09621,-0.51386 -0.563203,-0.7016 -0.05637,-0.0211 -0.112734,-0.0398 -0.169102,-0.0609 -2.323128,-0.842453 -4.768356,-1.321168 -7.237032,-1.241356 -0.229922,0.007 -0.427031,0.01875 -0.596016,0.0375 -1.311792,0.187734 -2.71746,0.14086 -4.2123,-0.140742 h -0.842461 c -0.375469,0.09387 -1.006758,0.119649 -1.896096,0.07031 -0.891679,-0.04699 -1.499412,-0.07043 -1.825548,-0.07043 -0.328476,0 -0.818906,-0.04688 -1.473636,-0.140742 -0.654726,-0.09152 -1.077071,-0.14086 -1.26246,-0.14086 H 27.11825 c -0.523242,0 -1.072382,-0.01406 -1.595628,-0.05391 -2.585976,-0.192422 -4.51488,-0.499805 -5.789064,-0.926836 -0.375469,-0.09387 -0.936328,-0.211172 -1.68492,-0.351914 -0.750937,-0.138398 -1.311792,-0.302695 -1.68492,-0.490429 -0.187734,0 -0.469336,-0.09387 -0.842461,-0.281602 -0.375469,-0.18539 -0.654726,-0.326132 -0.842461,-0.42 -0.190078,0 -0.281602,-0.18539 -0.281602,-0.560859 -0.187734,-1.309452 -0.373126,-2.571912 -0.56086,-3.78984 -0.09387,-0.09152 -0.07043,-0.232266 0.07031,-0.42 0.140742,-0.187734 0.161836,-0.328476 0.07031,-0.422344 v -1.332888 c 0,-0.607734 -0.04934,-1.051289 -0.14086,-1.332888 v -0.281602 -0.281601 c 0.09387,-1.403316 0.466992,-3.132768 1.124063,-5.193168 0.185391,-0.56086 0.466992,-1.825668 0.842461,-3.78984 0.466992,-1.966524 1.027852,-3.36984 1.68492,-4.2123 0.09152,-0.09152 0.185391,-0.279258 0.279258,-0.56086 0.09152,-0.279258 0.14086,-0.466992 0.14086,-0.560859 0.09387,-0.373126 0.258164,-0.842462 0.492774,-1.403316 0.232266,-0.563204 0.396563,-0.936328 0.490429,-1.124063 0.09152,-0.279258 0.09152,-0.466992 0,-0.56086 C 18.609258,70.07125 18.562266,69.698125 18.75,69.228788 c 0.281601,-0.563203 0.281601,-0.936327 0,-1.124062 -0.09387,-0.09387 -0.04699,-0.187734 0.140742,-0.281602 0.560859,-0.18539 0.842461,-0.60539 0.842461,-1.26246 0.281601,-0.279258 0.42,-0.466992 0.42,-0.56086 0.281601,-0.652382 0.234726,-1.121719 -0.138399,-1.403316 -0.09387,-0.09152 -0.140742,-0.560859 -0.140742,-1.403316 0.09152,-1.213248 -0.140742,-2.196444 -0.701601,-2.94738 -0.281602,-0.373125 -0.471679,-1.215588 -0.563203,-2.52738 -0.09387,-0.563203 -0.140742,-0.936327 -0.140742,-1.124062 -0.279258,-0.466992 -0.187734,-0.886992 0.281601,-1.26246 0.187734,-0.185391 0.232266,-0.373126 0.140742,-0.56086 -0.375469,-2.055588 -0.610077,-3.273516 -0.701601,-3.648984 -0.09387,-0.18539 -0.119649,-0.396563 -0.07031,-0.631172 0.04687,-0.232266 0.02109,-0.443438 -0.07043,-0.631173 -0.281601,-2.337192 -0.328593,-4.162848 -0.140859,-5.474652 0.09152,-0.466992 0.140859,-1.168593 0.140859,-2.10492 v -2.245776 c 0.187734,-2.058048 0.466992,-4.024572 0.842462,-5.897232 0.560859,-2.3373 0.889335,-3.649104 0.983203,-3.930708 0.09152,-0.370781 0.466992,-1.588716 1.121719,-3.649104 0.842461,-2.52726 1.731792,-4.632192 2.668128,-6.317112 0.09387,-0.279258 0.281602,-0.722813 0.563203,-1.332888 0.279258,-0.607734 0.466992,-1.098164 0.56086,-1.473636 0.09152,-0.09387 0.281601,-0.396563 0.560859,-0.912774 0.281602,-0.511524 0.513868,-0.910429 0.701602,-1.192031 0.281602,-0.466992 0.563203,-0.701601 0.842461,-0.701601 0.187734,0 0.328476,-0.04688 0.422344,-0.140742 0.281601,-0.748594 1.030195,-1.027852 2.245776,-0.842461 0.09152,0 0.302695,-0.02109 0.631172,-0.07031 0.326133,-0.04687 0.584297,-0.07031 0.772031,-0.07031 h 1.544064 c 0,0 1.356324,0.04922 1.544064,0.140742 1.964184,0.657071 3.17976,1.170937 3.649104,1.544064 1.030195,0.563203 2.761992,1.403316 5.195388,2.52738 0.281602,0.09387 0.983203,0.56086 2.10726,1.403316 0.842461,0.750937 1.870308,1.544064 3.088248,2.386524 0.842461,0.563203 1.917192,1.45254 3.228984,2.668128 0.187734,0.187734 0.56086,0.490429 1.124063,0.912774 0.560859,0.422344 0.933984,0.772031 1.121719,1.053632 0.469336,0.37547 1.637928,1.499532 3.510588,3.36984 0.09387,0 0.492774,0.352031 1.194374,1.053633 0.701601,0.701601 1.239024,1.241364 1.614492,1.614492 0.187734,0.281601 0.537423,0.633632 1.053633,1.053632 0.511524,0.422344 0.863555,0.725039 1.051289,0.912774 0.187734,0.187735 0.422343,0.490429 0.701601,0.912774 0.281602,0.422344 0.469336,0.727383 0.563203,0.912774 0.373126,0.281602 0.701602,0.281602 0.983204,0 0.652382,-0.560859 1.074726,-0.889335 1.26246,-0.983203 1.030195,-0.748594 1.731792,-0.513868 2.10726,0.701719 0.373125,1.032539 0.560859,1.68492 0.560859,1.966524 0,0.281604 0.140742,0.328594 0.42,0.14086 0.279258,-0.185391 0.513868,-0.42 0.701602,-0.701602 0.279258,-0.370781 0.678164,-0.537422 1.192031,-0.490547 0.513867,0.04699 0.865898,0.305157 1.053632,0.772149 0.281602,0.469335 0.466992,0.701601 0.56086,0.701601 0.187734,0 0.281601,-0.140742 0.281601,-0.422343 0.09152,-0.09387 0.140742,-0.187734 0.140742,-0.281602 0.279258,-0.373125 0.631289,-1.027851 1.051289,-1.964184 0.422344,-0.933984 0.774374,-1.635588 1.053632,-2.10492 0.187734,-0.187734 1.124063,-1.591056 2.808984,-4.212192 0.09152,-0.18539 0.302696,-0.60539 0.631173,-1.26246 0.328476,-0.652382 0.631172,-1.121719 0.912774,-1.403316 0.373125,-0.466992 0.959766,-1.26246 1.75524,-2.386524 0.795474,-1.124064 1.426752,-1.940748 1.896096,-2.456952 0.466992,-0.511524 1.192148,-1.192031 2.175348,-2.034492 0.983199,-0.842461 1.661364,-1.4502 2.036832,-1.825668 1.027851,-1.027851 2.618904,-2.196444 4.773168,-3.508248 0.748593,-0.466992 1.846872,-1.004414 3.299412,-1.614492 1.4502,-0.607734 2.503824,-1.098164 3.158556,-1.473636 0.187734,-0.09152 0.513867,-0.161953 0.983203,-0.211172 0.466992,-0.04699 0.795469,-0.117421 0.98321,-0.211289 l 0.27925,-0.140742 c 0.65473,-0.5632032 1.2648,-0.7039452 1.82567,-0.422344 0.65473,0.281602 1.2648,0.89168 1.82567,1.825668 0.0915,0.279258 0.32613,0.725157 0.7016,1.332888 0.37313,0.610078 0.65473,1.051289 0.84246,1.332888 1.21793,2.154252 1.96653,3.55758 2.24813,4.2123 0.18539,0.37547 0.74625,1.45254 1.68258,3.228984 0.93398,1.87266 1.4502,2.902848 1.54406,3.088248 0.0915,0.09387 0.23239,0.258165 0.42012,0.49043 0.18774,0.234609 0.3286,0.443437 0.42246,0.631172 0.18539,0.469336 0.44356,1.217928 0.77203,2.245776 0.32614,1.032539 0.53731,1.640268 0.63118,1.825668 0.0915,0.373126 0.25582,1.030195 0.49043,1.964184 0.2346,0.936328 0.44578,1.637928 0.63351,2.10492 l 0.56086,2.245668 c 0.37313,1.311792 0.56086,2.10492 0.56086,2.386524 0,0.281604 0.0469,0.821368 0.14074,1.614492 0.0939,0.795469 0.18774,1.382112 0.2816,1.75524 0,1.964184 0.0469,3.228984 0.14075,3.78984 0.0915,0.938672 0.0445,2.10726 -0.14086,3.510588 -0.0962,0.469336 -0.28161,1.170937 -0.56321,2.10492 -0.27925,0.936328 -0.42,1.637928 -0.42,2.10492 -0.2816,1.499532 -0.65707,2.902848 -1.12406,4.2123 -0.65707,1.499532 -0.9832,2.435856 -0.9832,2.808984 -0.0939,0.09387 -0.23227,0.258164 -0.42,0.490429 -0.19008,0.23461 -0.2816,0.490429 -0.2816,0.772031 -0.0939,0.373126 -0.51387,1.26246 -1.26246,2.665776 -0.28161,0.469336 -0.32848,0.889336 -0.14075,1.26246 0.467,0.842461 1.12407,2.154252 1.96653,3.930708 0.0915,0.187734 0.23226,0.607734 0.42,1.26246 0.18539,0.375469 0.39656,0.983203 0.63117,1.825668 0.23461,0.842465 0.39891,1.45254 0.49277,1.825668 0.0915,0.281602 0.16196,0.633632 0.21129,1.053632 0.0445,0.422344 0.11496,0.772031 0.20883,1.053633 0.65473,2.245776 1.0302,3.508248 1.12406,3.78984 0.0915,0 0.51153,1.731792 1.26246,5.193048 0.0939,0.375469 0.21118,1.006758 0.35203,1.896096 0.14086,0.891679 0.25817,1.522968 0.35203,1.896096 z"
     id="path2" />
</svg>
