<svg width="87" height="87" viewBox="0 0 87 87" fill="none" xmlns="http://www.w3.org/2000/svg">
<circle cx="43.5" cy="43.5" r="43.5" fill="#F6F6F6"/>
<path fill-rule="evenodd" clip-rule="evenodd" d="M37 50L43 44.12C42.22 44.04 41.64 44 41 44C35.66 44 25 46.68 25 52V56H43L37 50ZM41 40C45.42 40 49 36.42 49 32C49 27.58 45.42 24 41 24C36.58 24 33 27.58 33 32C33 36.42 36.58 40 41 40Z" fill="#942E51"/>
<path fill-rule="evenodd" clip-rule="evenodd" d="M49.94 55L44 49L45.8 47.18L49.94 51.34L60.2 41L62 42.82L49.94 55Z" fill="#942E51"/>
</svg>
