####  VOLTAGE1OFFSET  START ####

VOLTAGE1OFFSET  ::: FWD VAL :      2493 REV VAL :       -2494  ****************>  -1
**************************************************
***** :: OFFSET finish value :  273
**************************************************

####  VOLTAGE1GAIN  START ####

VOLTAGE1GAIN  ::: ESC VAL :      2499 JIG VAL :       2491  ******************       8
VOLTAGE1GAIN :: 0th, OLD DIFF = 0, CUR DIFF = 8,  NEW VALUE : 94 :: 8

VOLTAGE1GAIN  ::: ESC VAL :      2499 JIG VAL :       2496  ******************       3
VOLTAGE1GAIN :: 1th, OLD DIFF = 8, CUR DIFF = 3,  NEW VALUE : 91 :: 3

VOLTAGE1GAIN  ::: ESC VAL :      2499 JIG VAL :       2497  ******************       2
VOLTAGE1GAIN :: 2th, OLD DIFF = 3, CUR DIFF = 2,  NEW VALUE : 89 :: 2

VOLTAGE1GAIN  ::: ESC VAL :      2499 JIG VAL :       2498  ******************       1
**************************************************
***** :: :: GAIN finish value :  89
**************************************************

####  VOLTAGE2OFFSET  START ####

VOLTAGE2OFFSET  ::: FWD VAL :      -2508 REV VAL :       2501  ****************>  7
VOLTAGE2OFFSET :: 0th, OLD DIFF = 0, CUR DIFF = 7,  NEW VALUE : -18 :: 7

VOLTAGE2OFFSET  ::: FWD VAL :      -2510 REV VAL :       2499  ****************>  11
DIR CHANGE MINUS  11 7
VOLTAGE2OFFSET :: 1th, OLD DIFF = 7, CUR DIFF = 11,  NEW VALUE : -23 :: 11

VOLTAGE2OFFSET  ::: FWD VAL :      -2508 REV VAL :       2500  ****************>  8
VOLTAGE2OFFSET :: 2th, OLD DIFF = 11, CUR DIFF = 8,  NEW VALUE : -31 :: 8

VOLTAGE2OFFSET  ::: FWD VAL :      -2506 REV VAL :       2501  ****************>  5
VOLTAGE2OFFSET :: 3th, OLD DIFF = 8, CUR DIFF = 5,  NEW VALUE : -36 :: 5

VOLTAGE2OFFSET  ::: FWD VAL :      -2504 REV VAL :       2502  ****************>  2
VOLTAGE2OFFSET :: 4th, OLD DIFF = 5, CUR DIFF = 2,  NEW VALUE : -38 :: 2

VOLTAGE2OFFSET  ::: FWD VAL :      -2504 REV VAL :       2502  ****************>  2
VOLTAGE2OFFSET :: 5th, OLD DIFF = 2, CUR DIFF = 2,  NEW VALUE : -39 :: 2

VOLTAGE2OFFSET  ::: FWD VAL :      -2503 REV VAL :       2502  ****************>  1
**************************************************
***** :: OFFSET finish value :  -39
**************************************************

####  VOLTAGE2GAIN  START ####

VOLTAGE2GAIN  ::: ESC VAL :      -2500 JIG VAL :       -2503  ******************       -3
VOLTAGE2GAIN :: 0th, OLD DIFF = 0, CUR DIFF = 3,  NEW VALUE : 32 :: 3

VOLTAGE2GAIN  ::: ESC VAL :      -2500 JIG VAL :       -2501  ******************       -1
**************************************************
***** :: :: GAIN finish value :  32
**************************************************

####  CURRENT1OFFSET  START ####

CURRENT1OFFSET  ::: FWD VAL :      2000 REV VAL :       1953  ****************>  47
CURRENT1OFFSET :: 0th, OLD DIFF = 0, CUR DIFF = 47,  NEW VALUE : -36 :: 23

CURRENT1OFFSET  ::: FWD VAL :      1978 REV VAL :       1975  ****************>  3
CURRENT1OFFSET :: 1th, OLD DIFF = 47, CUR DIFF = 3,  NEW VALUE : -37 :: 3

CURRENT1OFFSET  ::: FWD VAL :      1977 REV VAL :       1976  ****************>  1
**************************************************
***** :: OFFSET finish value :  -37
**************************************************

####  CURRENT1GAIN  START ####

CURRENT1GAIN  ::: ESC VAL :      1977 JIG VAL :       1988  ******************       -11
CURRENT1GAIN :: 0th, OLD DIFF = 0, CUR DIFF = 11,  NEW VALUE : 128 :: 5

CURRENT1GAIN  ::: ESC VAL :      1979 JIG VAL :       1988  ******************       -9
CURRENT1GAIN :: 1th, OLD DIFF = 11, CUR DIFF = 9,  NEW VALUE : 137 :: 9

CURRENT1GAIN  ::: ESC VAL :      1981 JIG VAL :       1988  ******************       -7
CURRENT1GAIN :: 2th, OLD DIFF = 9, CUR DIFF = 7,  NEW VALUE : 144 :: 7

CURRENT1GAIN  ::: ESC VAL :      1983 JIG VAL :       1988  ******************       -5
CURRENT1GAIN :: 3th, OLD DIFF = 7, CUR DIFF = 5,  NEW VALUE : 149 :: 5

CURRENT1GAIN  ::: ESC VAL :      1984 JIG VAL :       1988  ******************       -4
CURRENT1GAIN :: 4th, OLD DIFF = 5, CUR DIFF = 4,  NEW VALUE : 153 :: 4

CURRENT1GAIN  ::: ESC VAL :      1985 JIG VAL :       1988  ******************       -3
CURRENT1GAIN :: 5th, OLD DIFF = 4, CUR DIFF = 3,  NEW VALUE : 154 :: 3

CURRENT1GAIN  ::: ESC VAL :      1986 JIG VAL :       1988  ******************       -2
CURRENT1GAIN :: 6th, OLD DIFF = 3, CUR DIFF = 2,  NEW VALUE : 155 :: 2

CURRENT1GAIN  ::: ESC VAL :      1985 JIG VAL :       1988  ******************       -3
CURRENT1GAIN :: 7th, OLD DIFF = 2, CUR DIFF = 3,  NEW VALUE : 156 :: 3

CURRENT1GAIN  ::: ESC VAL :      1986 JIG VAL :       1988  ******************       -2
CURRENT1GAIN :: 8th, OLD DIFF = 3, CUR DIFF = 2,  NEW VALUE : 157 :: 2

CURRENT1GAIN  ::: ESC VAL :      1986 JIG VAL :       1988  ******************       -2
CURRENT1GAIN :: 9th, OLD DIFF = 2, CUR DIFF = 2,  NEW VALUE : 158 :: 2

CURRENT1GAIN  ::: ESC VAL :      1986 JIG VAL :       1988  ******************       -2
CURRENT1GAIN :: 10th, OLD DIFF = 2, CUR DIFF = 2,  NEW VALUE : 159 :: 2

CURRENT1GAIN  ::: ESC VAL :      1986 JIG VAL :       1989  ******************       -3
DIR CHANGE MINUS  3 2
CURRENT1GAIN :: 11th, OLD DIFF = 2, CUR DIFF = 3,  NEW VALUE : 158 :: 3

CURRENT1GAIN  ::: ESC VAL :      1986 JIG VAL :       1988  ******************       -2
CURRENT1GAIN :: 12th, OLD DIFF = 3, CUR DIFF = 2,  NEW VALUE : 157 :: 2

CURRENT1GAIN  ::: ESC VAL :      1986 JIG VAL :       1988  ******************       -2
CURRENT1GAIN :: 13th, OLD DIFF = 2, CUR DIFF = 2,  NEW VALUE : 156 :: 2

CURRENT1GAIN  ::: ESC VAL :      1986 JIG VAL :       1988  ******************       -2
CURRENT1GAIN :: 14th, OLD DIFF = 2, CUR DIFF = 2,  NEW VALUE : 155 :: 2

CURRENT1GAIN  ::: ESC VAL :      1985 JIG VAL :       1988  ******************       -3
DIR CHANGE PLUS  3 2
CURRENT1GAIN :: 15th, OLD DIFF = 2, CUR DIFF = 3,  NEW VALUE : 156 :: 3

CURRENT1GAIN  ::: ESC VAL :      1986 JIG VAL :       1988  ******************       -2
CURRENT1GAIN :: 16th, OLD DIFF = 3, CUR DIFF = 2,  NEW VALUE : 157 :: 2

CURRENT1GAIN  ::: ESC VAL :      1986 JIG VAL :       1988  ******************       -2
CURRENT1GAIN :: 17th, OLD DIFF = 2, CUR DIFF = 2,  NEW VALUE : 158 :: 2

CURRENT1GAIN  ::: ESC VAL :      1986 JIG VAL :       1988  ******************       -2
CURRENT1GAIN :: 18th, OLD DIFF = 2, CUR DIFF = 2,  NEW VALUE : 159 :: 2

CURRENT1GAIN  ::: ESC VAL :      1987 JIG VAL :       1988  ******************       -1
**************************************************
***** :: :: GAIN finish value :  159
**************************************************

####  CURRENT2OFFSET  START ####

CURRENT2OFFSET  ::: FWD VAL :      1939 REV VAL :       1991  ****************>  -52
CURRENT2OFFSET :: 0th, OLD DIFF = 0, CUR DIFF = 52,  NEW VALUE : 13 :: 26

CURRENT2OFFSET  ::: FWD VAL :      1914 REV VAL :       2016  ****************>  -102
DIR CHANGE MINUS  102 52
CURRENT2OFFSET :: 1th, OLD DIFF = 52, CUR DIFF = 102,  NEW VALUE : -38 :: 102

CURRENT2OFFSET  ::: FWD VAL :      1962 REV VAL :       1967  ****************>  -5
CURRENT2OFFSET :: 2th, OLD DIFF = 102, CUR DIFF = 5,  NEW VALUE : -43 :: 5

CURRENT2OFFSET  ::: FWD VAL :      1967 REV VAL :       1963  ****************>  4
CURRENT2OFFSET :: 3th, OLD DIFF = 5, CUR DIFF = 4,  NEW VALUE : -42 :: 4

CURRENT2OFFSET  ::: FWD VAL :      1966 REV VAL :       1964  ****************>  2
CURRENT2OFFSET :: 4th, OLD DIFF = 4, CUR DIFF = 2,  NEW VALUE : -41 :: 2

CURRENT2OFFSET  ::: FWD VAL :      1965 REV VAL :       1965  ****************>  0
**************************************************
***** :: OFFSET finish value :  -41
**************************************************

####  CURRENT2GAIN  START ####

CURRENT2GAIN  ::: ESC VAL :      1965 JIG VAL :       1984  ******************       -19
CURRENT2GAIN :: 0th, OLD DIFF = 0, CUR DIFF = 19,  NEW VALUE : 122 :: 9

CURRENT2GAIN  ::: ESC VAL :      1968 JIG VAL :       1984  ******************       -16
CURRENT2GAIN :: 1th, OLD DIFF = 19, CUR DIFF = 16,  NEW VALUE : 138 :: 16

CURRENT2GAIN  ::: ESC VAL :      1972 JIG VAL :       1984  ******************       -12
CURRENT2GAIN :: 2th, OLD DIFF = 16, CUR DIFF = 12,  NEW VALUE : 150 :: 12

CURRENT2GAIN  ::: ESC VAL :      1974 JIG VAL :       1984  ******************       -10
CURRENT2GAIN :: 3th, OLD DIFF = 12, CUR DIFF = 10,  NEW VALUE : 160 :: 10

CURRENT2GAIN  ::: ESC VAL :      1977 JIG VAL :       1984  ******************       -7
CURRENT2GAIN :: 4th, OLD DIFF = 10, CUR DIFF = 7,  NEW VALUE : 167 :: 7

CURRENT2GAIN  ::: ESC VAL :      1979 JIG VAL :       1984  ******************       -5
CURRENT2GAIN :: 5th, OLD DIFF = 7, CUR DIFF = 5,  NEW VALUE : 172 :: 5

CURRENT2GAIN  ::: ESC VAL :      1980 JIG VAL :       1984  ******************       -4
CURRENT2GAIN :: 6th, OLD DIFF = 5, CUR DIFF = 4,  NEW VALUE : 176 :: 4

CURRENT2GAIN  ::: ESC VAL :      1981 JIG VAL :       1984  ******************       -3
CURRENT2GAIN :: 7th, OLD DIFF = 4, CUR DIFF = 3,  NEW VALUE : 177 :: 3

CURRENT2GAIN  ::: ESC VAL :      1981 JIG VAL :       1983  ******************       -2
CURRENT2GAIN :: 8th, OLD DIFF = 3, CUR DIFF = 2,  NEW VALUE : 178 :: 2

CURRENT2GAIN  ::: ESC VAL :      1982 JIG VAL :       1983  ******************       -1
**************************************************
***** :: :: GAIN finish value :  178
**************************************************
Exception ERROR :  duplicate key value violates unique constraint "converter_esccalivalue_serialNo_key"
DETAIL:  Key ("serialNo")=(202206020240) already exists.

Manually Calibration VCS, ICS
WarningDialog :: OK
check_password ModbusSerialClient(rtu baud[115200]) 1999 43981
##################################################
### IR LEAK START ########
##################################################

####  IRLEAK1OFFSET  START ####

IRLEAK1OFFSET  ::: FWD VAL :      1408 REV VAL :       1416  ****************>  -8
IRLEAK1OFFSET :: 0th, OLD DIFF = 0, CUR DIFF = 8,  NEW VALUE : -103 :: 4

IRLEAK1OFFSET  ::: FWD VAL :      1410 REV VAL :       1415  ****************>  -5
IRLEAK1OFFSET :: 1th, OLD DIFF = 8, CUR DIFF = 5,  NEW VALUE : -98 :: 5

IRLEAK1OFFSET  ::: FWD VAL :      1410 REV VAL :       1415  ****************>  -5
IRLEAK1OFFSET :: 2th, OLD DIFF = 5, CUR DIFF = 5,  NEW VALUE : -93 :: 5

IRLEAK1OFFSET  ::: FWD VAL :      1410 REV VAL :       1412  ****************>  -2
IRLEAK1OFFSET :: 3th, OLD DIFF = 5, CUR DIFF = 2,  NEW VALUE : -91 :: 2

IRLEAK1OFFSET  ::: FWD VAL :      1410 REV VAL :       1411  ****************>  -1
**************************************************
***** :: OFFSET finish value :  -91
**************************************************

####  IRLEAK1GAIN  START ####

IRLEAK1GAIN  ::: ESC VAL :      1415 JIG VAL :       1404  ******************       11
IRLEAK1GAIN :: 0th, OLD DIFF = 0, CUR DIFF = 11,  NEW VALUE : 44 :: 5

IRLEAK1GAIN  ::: ESC VAL :      1415 JIG VAL :       1404  ******************       11
IRLEAK1GAIN :: 1th, OLD DIFF = 11, CUR DIFF = 11,  NEW VALUE : 55 :: 11

IRLEAK1GAIN  ::: ESC VAL :      1420 JIG VAL :       1404  ******************       16
DIR CHANGE MINUS  16 11
IRLEAK1GAIN :: 2th, OLD DIFF = 11, CUR DIFF = 16,  NEW VALUE : 47 :: 16

IRLEAK1GAIN  ::: ESC VAL :      1413 JIG VAL :       1404  ******************       9
IRLEAK1GAIN :: 3th, OLD DIFF = 16, CUR DIFF = 9,  NEW VALUE : 38 :: 9

IRLEAK1GAIN  ::: ESC VAL :      1410 JIG VAL :       1404  ******************       6
IRLEAK1GAIN :: 4th, OLD DIFF = 9, CUR DIFF = 6,  NEW VALUE : 32 :: 6

IRLEAK1GAIN  ::: ESC VAL :      1407 JIG VAL :       1404  ******************       3
IRLEAK1GAIN :: 5th, OLD DIFF = 6, CUR DIFF = 3,  NEW VALUE : 29 :: 3

IRLEAK1GAIN  ::: ESC VAL :      1404 JIG VAL :       1404  ******************       0
**************************************************
***** :: :: GAIN finish value :  29
**************************************************

####  IRLEAK2OFFSET  START ####

IRLEAK2OFFSET  ::: FWD VAL :      1428 REV VAL :       1433  ****************>  -5
IRLEAK2OFFSET :: 0th, OLD DIFF = 0, CUR DIFF = 5,  NEW VALUE : 20 :: 2

IRLEAK2OFFSET  ::: FWD VAL :      1426 REV VAL :       1432  ****************>  -6
DIR CHANGE MINUS  6 5
IRLEAK2OFFSET :: 1th, OLD DIFF = 5, CUR DIFF = 6,  NEW VALUE : 17 :: 6

IRLEAK2OFFSET  ::: FWD VAL :      1427 REV VAL :       1432  ****************>  -5
IRLEAK2OFFSET :: 2th, OLD DIFF = 6, CUR DIFF = 5,  NEW VALUE : 12 :: 5

IRLEAK2OFFSET  ::: FWD VAL :      1427 REV VAL :       1432  ****************>  -5
IRLEAK2OFFSET :: 3th, OLD DIFF = 5, CUR DIFF = 5,  NEW VALUE : 7 :: 5

IRLEAK2OFFSET  ::: FWD VAL :      1429 REV VAL :       1431  ****************>  -2
IRLEAK2OFFSET :: 4th, OLD DIFF = 5, CUR DIFF = 2,  NEW VALUE : 5 :: 2

IRLEAK2OFFSET  ::: FWD VAL :      1430 REV VAL :       1430  ****************>  0
**************************************************
***** :: OFFSET finish value :  5
**************************************************

####  IRLEAK2GAIN  START ####

IRLEAK2GAIN  ::: ESC VAL :      1430 JIG VAL :       1417  ******************       13
IRLEAK2GAIN :: 0th, OLD DIFF = 0, CUR DIFF = 13,  NEW VALUE : 55 :: 6

IRLEAK2GAIN  ::: ESC VAL :      1432 JIG VAL :       1416  ******************       16
DIR CHANGE MINUS  16 13
IRLEAK2GAIN :: 1th, OLD DIFF = 13, CUR DIFF = 16,  NEW VALUE : 47 :: 16

IRLEAK2GAIN  ::: ESC VAL :      1428 JIG VAL :       1416  ******************       12
IRLEAK2GAIN :: 2th, OLD DIFF = 16, CUR DIFF = 12,  NEW VALUE : 35 :: 12

IRLEAK2GAIN  ::: ESC VAL :      1423 JIG VAL :       1416  ******************       7
IRLEAK2GAIN :: 3th, OLD DIFF = 12, CUR DIFF = 7,  NEW VALUE : 28 :: 7

IRLEAK2GAIN  ::: ESC VAL :      1417 JIG VAL :       1416  ******************       1
**************************************************
***** :: :: GAIN finish value :  28
**************************************************
select_calibration ::  ['VBIAS', 'CAP', 'ZCS', 'AOUT', 'D_IN']
check_password ModbusSerialClient(rtu baud[115200]) 1999 43981
##################################################
##### VBIAS OFFSET ######
##################################################
Start Value :  264
VBIAOFFSET :: 0th :: FWD :: 130 :: REV :: -127 :: NEW GAIN :: 263 :: 1 :: abs(DIFF) :: 3

Start Value :  263
VBIAOFFSET :: 0th :: FWD :: 130 :: REV :: -127 :: NEW GAIN :: 262 :: 1 :: abs(DIFF) :: 3

Start Value :  262
VBIAOFFSET :: 0th :: FWD :: 130 :: REV :: -127 :: NEW GAIN :: 261 :: 1 :: abs(DIFF) :: 3

Start Value :  261
VBIAOFFSET :: 0th :: FWD :: 130 :: REV :: -127 :: NEW GAIN :: 260 :: 1 :: abs(DIFF) :: 3

Start Value :  260
VBIAOFFSET :: 0th :: FWD :: 130 :: REV :: -127 :: NEW GAIN :: 259 :: 1 :: abs(DIFF) :: 3

Start Value :  259
VBIAOFFSET :: 0th :: FWD :: 130 :: REV :: -127 :: NEW GAIN :: 258 :: 1 :: abs(DIFF) :: 3

Start Value :  258
VBIAOFFSET :: 0th :: FWD :: 129 :: REV :: -127 :: NEW GAIN :: 257 :: 1 :: abs(DIFF) :: 2

Start Value :  257
VBIAOFFSET :: 0th :: FWD :: 129 :: REV :: -127 :: NEW GAIN :: 256 :: 1 :: abs(DIFF) :: 2

Start Value :  256
VBIAOFFSET :: 0th :: FWD :: 129 :: REV :: -128 :: NEW GAIN :: 255 :: 1 :: abs(DIFF) :: 1

Start Value :  255
VBIAOFFSET :: 0th :: FWD :: 129 :: REV :: -128 :: NEW GAIN :: 254 :: 1 :: abs(DIFF) :: 1

Start Value :  254
VBIAOFFSET :: 0th :: FWD :: 129 :: REV :: -128 :: NEW GAIN :: 253 :: 1 :: abs(DIFF) :: 1

Start Value :  253
VBIAOFFSET :: 0th :: FWD :: 129 :: REV :: -128 :: NEW GAIN :: 252 :: 1 :: abs(DIFF) :: 1

Start Value :  252
VBIAOFFSET :: 0th :: FWD :: 129 :: REV :: -128 :: NEW GAIN :: 251 :: 1 :: abs(DIFF) :: 1

Start Value :  251
VBIAOFFSET :: 0th :: FWD :: 129 :: REV :: -128 :: NEW GAIN :: 250 :: 1 :: abs(DIFF) :: 1

Start Value :  250
VBIAOFFSET :: 0th :: FWD :: 129 :: REV :: -128 :: NEW GAIN :: 249 :: 1 :: abs(DIFF) :: 1

Start Value :  249
VBIAOFFSET :: 0th :: FWD :: 129 :: REV :: -128 :: NEW GAIN :: 248 :: 1 :: abs(DIFF) :: 1

Start Value :  248
VBIAOFFSET :: 0th :: FWD :: 129 :: REV :: -128 :: NEW GAIN :: 247 :: 1 :: abs(DIFF) :: 1

Start Value :  247
VBIAOFFSET :: 0th :: FWD :: 129 :: REV :: -128 :: NEW GAIN :: 246 :: 1 :: abs(DIFF) :: 1

Start Value :  246
VBIAOFFSET :: 0th :: FWD :: 129 :: REV :: -128 :: NEW GAIN :: 245 :: 1 :: abs(DIFF) :: 1

***** :: VBIAS OFFSET ***** :: finish value :  128 -128
VBIA GAIN  ::: ESC V :      128 JIG V :       124  ***********************>       4
VBIAGAIN :: 0th, OLD DIFF = 1, CUR DIFF = 4,  NEW VALUE : 241 :: 4

VBIA GAIN  ::: ESC V :      169 JIG V :       124  ***********************>       45
DIR CHANGE PLUS  45 4
VBIAGAIN :: 1th, OLD DIFF = 4, CUR DIFF = 45,  NEW VALUE : 263 :: 45

VBIA GAIN  ::: ESC V :      173 JIG V :       124  ***********************>       49
DIR CHANGE MINUS  49 45
VBIAGAIN :: 2th, OLD DIFF = 45, CUR DIFF = 49,  NEW VALUE : 239 :: 49

VBIA GAIN  ::: ESC V :      168 JIG V :       124  ***********************>       44
VBIAGAIN :: 3th, OLD DIFF = 49, CUR DIFF = 44,  NEW VALUE : 195 :: 44

VBIA GAIN  ::: ESC V :      160 JIG V :       124  ***********************>       36
VBIAGAIN :: 4th, OLD DIFF = 44, CUR DIFF = 36,  NEW VALUE : 159 :: 36

VBIA GAIN  ::: ESC V :      153 JIG V :       124  ***********************>       29
VBIAGAIN :: 5th, OLD DIFF = 36, CUR DIFF = 29,  NEW VALUE : 130 :: 29

VBIA GAIN  ::: ESC V :      147 JIG V :       124  ***********************>       23
VBIAGAIN :: 6th, OLD DIFF = 29, CUR DIFF = 23,  NEW VALUE : 107 :: 23

VBIA GAIN  ::: ESC V :      142 JIG V :       124  ***********************>       18
VBIAGAIN :: 7th, OLD DIFF = 23, CUR DIFF = 18,  NEW VALUE : 89 :: 18

VBIA GAIN  ::: ESC V :      139 JIG V :       124  ***********************>       15
VBIAGAIN :: 8th, OLD DIFF = 18, CUR DIFF = 15,  NEW VALUE : 74 :: 15

VBIA GAIN  ::: ESC V :      136 JIG V :       124  ***********************>       12
VBIAGAIN :: 9th, OLD DIFF = 15, CUR DIFF = 12,  NEW VALUE : 62 :: 12

VBIA GAIN  ::: ESC V :      134 JIG V :       124  ***********************>       10
VBIAGAIN :: 10th, OLD DIFF = 12, CUR DIFF = 10,  NEW VALUE : 52 :: 10

VBIA GAIN  ::: ESC V :      132 JIG V :       124  ***********************>       8
VBIAGAIN :: 11th, OLD DIFF = 10, CUR DIFF = 8,  NEW VALUE : 44 :: 8

VBIA GAIN  ::: ESC V :      130 JIG V :       124  ***********************>       6
VBIAGAIN :: 12th, OLD DIFF = 8, CUR DIFF = 6,  NEW VALUE : 38 :: 6

VBIA GAIN  ::: ESC V :      129 JIG V :       124  ***********************>       5
VBIAGAIN :: 13th, OLD DIFF = 6, CUR DIFF = 5,  NEW VALUE : 33 :: 5

VBIA GAIN  ::: ESC V :      128 JIG V :       124  ***********************>       4
VBIAGAIN :: 14th, OLD DIFF = 5, CUR DIFF = 4,  NEW VALUE : 29 :: 4

VBIA GAIN  ::: ESC V :      127 JIG V :       124  ***********************>       3
VBIAGAIN :: 15th, OLD DIFF = 4, CUR DIFF = 3,  NEW VALUE : 26 :: 3

VBIA GAIN  ::: ESC V :      127 JIG V :       124  ***********************>       3
VBIAGAIN :: 16th, OLD DIFF = 3, CUR DIFF = 3,  NEW VALUE : 23 :: 3

VBIA GAIN  ::: ESC V :      126 JIG V :       124  ***********************>       2
VBIAGAIN :: 17th, OLD DIFF = 3, CUR DIFF = 2,  NEW VALUE : 21 :: 2

VBIA GAIN  ::: ESC V :      126 JIG V :       124  ***********************>       2
VBIAGAIN :: 18th, OLD DIFF = 2, CUR DIFF = 2,  NEW VALUE : 19 :: 2

VBIA GAIN  ::: ESC V :      125 JIG V :       124  ***********************>       1
select_calibration ::  ['CAP', 'ZCS', 'AOUT', 'D_IN']
check_password ModbusSerialClient(rtu baud[115200]) 1999 43981
##################################################
############# CAP VALUE ##################
##################################################
Start Value :  -25
  ** :: CAPOFFSET :: 0th :: FWD :: 125 :: REV :: 124 :: NEW GAIN :: -15 :: 10 :: 167

     !!! Same PLUS :: -5 1th
  ** :: CAPOFFSET :: 1th :: FWD :: 125 :: REV :: 124 :: NEW GAIN :: -5 :: 10 :: 167

     !!! Same PLUS :: 5 2th
  ** :: CAPOFFSET :: 2th :: FWD :: 125 :: REV :: 124 :: NEW GAIN :: 5 :: 10 :: 167

     !!! Same PLUS :: 15 3th
  ** :: CAPOFFSET :: 3th :: FWD :: 125 :: REV :: 124 :: NEW GAIN :: 15 :: 10 :: 167

     !!! Same PLUS :: 25 4th
  ** :: CAPOFFSET :: 4th :: FWD :: 125 :: REV :: 124 :: NEW GAIN :: 25 :: 10 :: 167

     !!! Same PLUS :: 35 5th
  ** :: CAPOFFSET :: 5th :: FWD :: 125 :: REV :: 124 :: NEW GAIN :: 35 :: 10 :: 167

     !!! Same PLUS :: 45 6th
  ** :: CAPOFFSET :: 6th :: FWD :: 125 :: REV :: 124 :: NEW GAIN :: 45 :: 10 :: 167

     !!! Same PLUS :: 55 7th
  ** :: CAPOFFSET :: 7th :: FWD :: 125 :: REV :: 124 :: NEW GAIN :: 55 :: 10 :: 167

     !!! Same PLUS :: 65 8th
  ** :: CAPOFFSET :: 8th :: FWD :: 125 :: REV :: 124 :: NEW GAIN :: 65 :: 10 :: 167

     !!! Same PLUS :: 75 9th
  ** :: CAPOFFSET :: 9th :: FWD :: 125 :: REV :: 124 :: NEW GAIN :: 75 :: 10 :: 167

     !!! Same PLUS :: 85 10th
  ** :: CAPOFFSET :: 10th :: FWD :: 125 :: REV :: 124 :: NEW GAIN :: 85 :: 10 :: 167

     !!! Same PLUS :: 95 11th
  ** :: CAPOFFSET :: 11th :: FWD :: 125 :: REV :: 124 :: NEW GAIN :: 95 :: 10 :: 167

     !!! Same PLUS :: 105 12th
  ** :: CAPOFFSET :: 12th :: FWD :: 125 :: REV :: 124 :: NEW GAIN :: 105 :: 10 :: 167

     !!! Same PLUS :: 115 13th
  ** :: CAPOFFSET :: 13th :: FWD :: 125 :: REV :: 124 :: NEW GAIN :: 115 :: 10 :: 167

     !!! Same PLUS :: 125 14th
  ** :: CAPOFFSET :: 14th :: FWD :: 125 :: REV :: 124 :: NEW GAIN :: 125 :: 10 :: 167

     !!! Same PLUS :: 135 15th
  ** :: CAPOFFSET :: 15th :: FWD :: 125 :: REV :: 124 :: NEW GAIN :: 135 :: 10 :: 167

     !!! Same PLUS :: 145 16th
  ** :: CAPOFFSET :: 16th :: FWD :: 125 :: REV :: 124 :: NEW GAIN :: 145 :: 10 :: 167

     !!! Same PLUS :: 155 17th
  ** :: CAPOFFSET :: 17th :: FWD :: 125 :: REV :: 124 :: NEW GAIN :: 155 :: 10 :: 167

     !!! Same PLUS :: 165 18th
  ** :: CAPOFFSET :: 18th :: FWD :: 125 :: REV :: 124 :: NEW GAIN :: 165 :: 10 :: 167

     !!! Same PLUS :: 175 19th
  ** :: CAPOFFSET :: 19th :: FWD :: 125 :: REV :: 124 :: NEW GAIN :: 175 :: 10 :: 167

     !!! Same PLUS :: 185 20th
  ** :: CAPOFFSET :: 20th :: FWD :: 125 :: REV :: 124 :: NEW GAIN :: 185 :: 10 :: 167

     !!! Same PLUS :: 195 21th
  ** :: CAPOFFSET :: 21th :: FWD :: 125 :: REV :: 124 :: NEW GAIN :: 195 :: 10 :: 167

     !!! Same PLUS :: 205 22th
  ** :: CAPOFFSET :: 22th :: FWD :: 125 :: REV :: 124 :: NEW GAIN :: 205 :: 10 :: 167

     !!! Same PLUS :: 215 23th
  ** :: CAPOFFSET :: 23th :: FWD :: 125 :: REV :: 124 :: NEW GAIN :: 215 :: 10 :: 167

     !!! Same PLUS :: 225 24th
  ** :: CAPOFFSET :: 24th :: FWD :: 125 :: REV :: 124 :: NEW GAIN :: 225 :: 10 :: 167

     !!! Same PLUS :: 235 25th
  ** :: CAPOFFSET :: 25th :: FWD :: 125 :: REV :: 124 :: NEW GAIN :: 235 :: 10 :: 167

     !!! Same PLUS :: 245 26th
  ** :: CAPOFFSET :: 26th :: FWD :: 125 :: REV :: 124 :: NEW GAIN :: 245 :: 10 :: 167

     !!! Same PLUS :: 255 27th
  ** :: CAPOFFSET :: 27th :: FWD :: 125 :: REV :: 124 :: NEW GAIN :: 255 :: 10 :: 167

     !!! Same PLUS :: 265 28th
  ** :: CAPOFFSET :: 28th :: FWD :: 125 :: REV :: 124 :: NEW GAIN :: 265 :: 10 :: 167

     !!! Same PLUS :: 275 29th
  ** :: CAPOFFSET :: 29th :: FWD :: 125 :: REV :: 124 :: NEW GAIN :: 275 :: 10 :: 167

     !!! Same PLUS :: 285 30th
  ** :: CAPOFFSET :: 30th :: FWD :: 125 :: REV :: 124 :: NEW GAIN :: 285 :: 10 :: 167

     !!! Same PLUS :: Change Direction -20 30th
  ** :: CAPOFFSET :: 31th :: FWD :: 125 :: REV :: 124 :: NEW GAIN :: -20 :: 10 :: 167

     !!! Same MINUS :: -30 1th
  ** :: CAPOFFSET :: 32th :: FWD :: 125 :: REV :: 124 :: NEW GAIN :: -30 :: 10 :: 167

     !!! Same MINUS :: -40 2th
  ** :: CAPOFFSET :: 33th :: FWD :: 125 :: REV :: 124 :: NEW GAIN :: -40 :: 10 :: 167

     !!! Same MINUS :: -50 3th
  ** :: CAPOFFSET :: 34th :: FWD :: 125 :: REV :: 124 :: NEW GAIN :: -50 :: 10 :: 167

     !!! Same MINUS :: -60 4th
  ** :: CAPOFFSET :: 35th :: FWD :: 125 :: REV :: 124 :: NEW GAIN :: -60 :: 10 :: 167

     !!! Same MINUS :: -70 5th
  ** :: CAPOFFSET :: 36th :: FWD :: 125 :: REV :: 124 :: NEW GAIN :: -70 :: 10 :: 167

     !!! Same MINUS :: -80 6th
  ** :: CAPOFFSET :: 37th :: FWD :: 125 :: REV :: 124 :: NEW GAIN :: -80 :: 10 :: 167

     !!! Same MINUS :: -90 7th
  ** :: CAPOFFSET :: 38th :: FWD :: 125 :: REV :: 124 :: NEW GAIN :: -90 :: 10 :: 167

     !!! Same MINUS :: -100 8th
  ** :: CAPOFFSET :: 39th :: FWD :: 125 :: REV :: 124 :: NEW GAIN :: -100 :: 10 :: 167

     !!! Same MINUS :: -110 9th
  ** :: CAPOFFSET :: 40th :: FWD :: 125 :: REV :: 124 :: NEW GAIN :: -110 :: 10 :: 167

     !!! Same MINUS :: -120 10th
  ** :: CAPOFFSET :: 41th :: FWD :: 125 :: REV :: 124 :: NEW GAIN :: -120 :: 10 :: 167

     !!! Same MINUS :: -130 11th
  ** :: CAPOFFSET :: 42th :: FWD :: 125 :: REV :: 124 :: NEW GAIN :: -130 :: 10 :: 167

     !!! Same MINUS :: -140 12th
  ** :: CAPOFFSET :: 43th :: FWD :: 125 :: REV :: 124 :: NEW GAIN :: -140 :: 10 :: 167

     !!! Same MINUS :: -150 13th
  ** :: CAPOFFSET :: 44th :: FWD :: 125 :: REV :: 124 :: NEW GAIN :: -150 :: 10 :: 167

     !!! Same MINUS :: -160 14th
  ** :: CAPOFFSET :: 45th :: FWD :: 125 :: REV :: 124 :: NEW GAIN :: -160 :: 10 :: 167

     !!! Same MINUS :: -170 15th
  ** :: CAPOFFSET :: 46th :: FWD :: 125 :: REV :: 124 :: NEW GAIN :: -170 :: 10 :: 167

     !!! Same MINUS :: -180 16th
  ** :: CAPOFFSET :: 47th :: FWD :: 125 :: REV :: 124 :: NEW GAIN :: -180 :: 10 :: 167

     !!! Same MINUS :: -190 17th
  ** :: CAPOFFSET :: 48th :: FWD :: 125 :: REV :: 124 :: NEW GAIN :: -190 :: 10 :: 167

     !!! Same MINUS :: -200 18th
  ** :: CAPOFFSET :: 49th :: FWD :: 125 :: REV :: 124 :: NEW GAIN :: -200 :: 10 :: 167

     !!! Same MINUS :: -210 19th
  ** :: CAPOFFSET :: 50th :: FWD :: 125 :: REV :: 124 :: NEW GAIN :: -210 :: 10 :: 167

     !!! Same MINUS :: -220 20th
  ** :: CAPOFFSET :: 51th :: FWD :: 125 :: REV :: 124 :: NEW GAIN :: -220 :: 10 :: 167

     !!! Same MINUS :: -230 21th
  ** :: CAPOFFSET :: 52th :: FWD :: 125 :: REV :: 124 :: NEW GAIN :: -230 :: 10 :: 167

     !!! Same MINUS :: -240 22th
  ** :: CAPOFFSET :: 53th :: FWD :: 125 :: REV :: 124 :: NEW GAIN :: -240 :: 10 :: 167

     !!! Same MINUS :: -250 23th
  ** :: CAPOFFSET :: 54th :: FWD :: 125 :: REV :: 124 :: NEW GAIN :: -250 :: 10 :: 167

     !!! Same MINUS :: -260 24th
  ** :: CAPOFFSET :: 55th :: FWD :: 125 :: REV :: 124 :: NEW GAIN :: -260 :: 10 :: 167

     !!! Same MINUS :: -270 25th
  ** :: CAPOFFSET :: 56th :: FWD :: 125 :: REV :: 124 :: NEW GAIN :: -270 :: 10 :: 167

     !!! Same MINUS :: -280 26th
  ** :: CAPOFFSET :: 57th :: FWD :: 125 :: REV :: 124 :: NEW GAIN :: -280 :: 10 :: 167

     !!! Same MINUS :: -290 27th
  ** :: CAPOFFSET :: 58th :: FWD :: 125 :: REV :: 124 :: NEW GAIN :: -290 :: 10 :: 167

     !!! Same MINUS :: -300 28th
  ** :: CAPOFFSET :: 59th :: FWD :: 125 :: REV :: 124 :: NEW GAIN :: -300 :: 10 :: 167

     !!! Same MINUS :: -310 29th
  ** :: CAPOFFSET :: 60th :: FWD :: 125 :: REV :: 124 :: NEW GAIN :: -310 :: 10 :: 167

     !!! Same MINUS :: -320 30th
  ** :: CAPOFFSET :: 61th :: FWD :: 125 :: REV :: 124 :: NEW GAIN :: -320 :: 10 :: 167

     !!! Same MINUS :: Change Direction -300 30th
  ** :: CAPOFFSET :: 62th :: FWD :: 125 :: REV :: 124 :: NEW GAIN :: -300 :: 10 :: 167

     !!! Same PLUS :: -290 1th
  ** :: CAPOFFSET :: 63th :: FWD :: 125 :: REV :: 124 :: NEW GAIN :: -290 :: 10 :: 167

     !!! Same PLUS :: -280 2th
  ** :: CAPOFFSET :: 64th :: FWD :: 125 :: REV :: 124 :: NEW GAIN :: -280 :: 10 :: 167

     !!! Same PLUS :: -270 3th
  ** :: CAPOFFSET :: 65th :: FWD :: 125 :: REV :: 124 :: NEW GAIN :: -270 :: 10 :: 167

     !!! Same PLUS :: -260 4th
  ** :: CAPOFFSET :: 66th :: FWD :: 125 :: REV :: 124 :: NEW GAIN :: -260 :: 10 :: 167

     !!! Same PLUS :: -250 5th
  ** :: CAPOFFSET :: 67th :: FWD :: 125 :: REV :: 124 :: NEW GAIN :: -250 :: 10 :: 167

     !!! Same PLUS :: -240 6th
  ** :: CAPOFFSET :: 68th :: FWD :: 125 :: REV :: 124 :: NEW GAIN :: -240 :: 10 :: 167

     !!! Same PLUS :: -230 7th
  ** :: CAPOFFSET :: 69th :: FWD :: 125 :: REV :: 124 :: NEW GAIN :: -230 :: 10 :: 167

     !!! Same PLUS :: -220 8th
  ** :: CAPOFFSET :: 70th :: FWD :: 125 :: REV :: 124 :: NEW GAIN :: -220 :: 10 :: 167

     !!! Same PLUS :: -210 9th
  ** :: CAPOFFSET :: 71th :: FWD :: 125 :: REV :: 124 :: NEW GAIN :: -210 :: 10 :: 167

     !!! Same PLUS :: -200 10th
  ** :: CAPOFFSET :: 72th :: FWD :: 125 :: REV :: 124 :: NEW GAIN :: -200 :: 10 :: 167

     !!! Same PLUS :: -190 11th
  ** :: CAPOFFSET :: 73th :: FWD :: 125 :: REV :: 124 :: NEW GAIN :: -190 :: 10 :: 167

     !!! Same PLUS :: -180 12th
  ** :: CAPOFFSET :: 74th :: FWD :: 125 :: REV :: 124 :: NEW GAIN :: -180 :: 10 :: 167

     !!! Same PLUS :: -170 13th
  ** :: CAPOFFSET :: 75th :: FWD :: 125 :: REV :: 124 :: NEW GAIN :: -170 :: 10 :: 167

     !!! Same PLUS :: -160 14th
  ** :: CAPOFFSET :: 76th :: FWD :: 125 :: REV :: 124 :: NEW GAIN :: -160 :: 10 :: 167

     !!! Same PLUS :: -150 15th
  ** :: CAPOFFSET :: 77th :: FWD :: 125 :: REV :: 124 :: NEW GAIN :: -150 :: 10 :: 167

     !!! Same PLUS :: -140 16th
  ** :: CAPOFFSET :: 78th :: FWD :: 125 :: REV :: 124 :: NEW GAIN :: -140 :: 10 :: 167

     !!! Same PLUS :: -130 17th
  ** :: CAPOFFSET :: 79th :: FWD :: 125 :: REV :: 124 :: NEW GAIN :: -130 :: 10 :: 167

     !!! Same PLUS :: -120 18th
  ** :: CAPOFFSET :: 80th :: FWD :: 125 :: REV :: 124 :: NEW GAIN :: -120 :: 10 :: 167

     !!! Same PLUS :: -110 19th
  ** :: CAPOFFSET :: 81th :: FWD :: 125 :: REV :: 124 :: NEW GAIN :: -110 :: 10 :: 167

     !!! Same PLUS :: -100 20th
  ** :: CAPOFFSET :: 82th :: FWD :: 125 :: REV :: 124 :: NEW GAIN :: -100 :: 10 :: 167

     !!! Same PLUS :: -90 21th
  ** :: CAPOFFSET :: 83th :: FWD :: 125 :: REV :: 124 :: NEW GAIN :: -90 :: 10 :: 167

     !!! Same PLUS :: -80 22th
  ** :: CAPOFFSET :: 84th :: FWD :: 125 :: REV :: 124 :: NEW GAIN :: -80 :: 10 :: 167

     !!! Same PLUS :: -70 23th
  ** :: CAPOFFSET :: 85th :: FWD :: 125 :: REV :: 124 :: NEW GAIN :: -70 :: 10 :: 167

     !!! Same PLUS :: -60 24th
  ** :: CAPOFFSET :: 86th :: FWD :: 125 :: REV :: 124 :: NEW GAIN :: -60 :: 10 :: 167

     !!! Same PLUS :: -50 25th
  ** :: CAPOFFSET :: 87th :: FWD :: 125 :: REV :: 124 :: NEW GAIN :: -50 :: 10 :: 167

     !!! Same PLUS :: -40 26th
  ** :: CAPOFFSET :: 88th :: FWD :: 125 :: REV :: 124 :: NEW GAIN :: -40 :: 10 :: 167

     !!! Same PLUS :: -30 27th
  ** :: CAPOFFSET :: 89th :: FWD :: 125 :: REV :: 124 :: NEW GAIN :: -30 :: 10 :: 167

     !!! Same PLUS :: -20 28th
  ** :: CAPOFFSET :: 90th :: FWD :: 125 :: REV :: 124 :: NEW GAIN :: -20 :: 10 :: 167

     !!! Same PLUS :: -10 29th
  ** :: CAPOFFSET :: 91th :: FWD :: 125 :: REV :: 124 :: NEW GAIN :: -10 :: 10 :: 167

     !!! Same PLUS :: 0 30th
  ** :: CAPOFFSET :: 92th :: FWD :: 125 :: REV :: 124 :: NEW GAIN :: 0 :: 10 :: 167

     !!! Same PLUS :: Change Direction -20 30th
  ** :: CAPOFFSET :: 93th :: FWD :: 125 :: REV :: 124 :: NEW GAIN :: -20 :: 10 :: 167

     !!! Same MINUS :: -30 1th
  ** :: CAPOFFSET :: 94th :: FWD :: 125 :: REV :: 124 :: NEW GAIN :: -30 :: 10 :: 167

     !!! Same MINUS :: -40 2th
  ** :: CAPOFFSET :: 95th :: FWD :: 125 :: REV :: 124 :: NEW GAIN :: -40 :: 10 :: 167

     !!! Same MINUS :: -50 3th
  ** :: CAPOFFSET :: 96th :: FWD :: 125 :: REV :: 124 :: NEW GAIN :: -50 :: 10 :: 167

     !!! Same MINUS :: -60 4th
  ** :: CAPOFFSET :: 97th :: FWD :: 125 :: REV :: 124 :: NEW GAIN :: -60 :: 10 :: 167

     !!! Same MINUS :: -70 5th
  ** :: CAPOFFSET :: 98th :: FWD :: 125 :: REV :: 124 :: NEW GAIN :: -70 :: 10 :: 167

     !!! Same MINUS :: -80 6th
  ** :: CAPOFFSET :: 99th :: FWD :: 125 :: REV :: 124 :: NEW GAIN :: -80 :: 10 :: 167

     !!! Same MINUS :: -90 7th
  ** :: CAPOFFSET :: 100th :: FWD :: 125 :: REV :: 124 :: NEW GAIN :: -90 :: 10 :: 167

     !!! Same MINUS :: -100 8th
  ** :: CAPOFFSET :: 101th :: FWD :: 125 :: REV :: 124 :: NEW GAIN :: -100 :: 10 :: 167

     !!! Same MINUS :: -110 9th
  ** :: CAPOFFSET :: 102th :: FWD :: 125 :: REV :: 124 :: NEW GAIN :: -110 :: 10 :: 167

     !!! Same MINUS :: -120 10th
  ** :: CAPOFFSET :: 103th :: FWD :: 125 :: REV :: 124 :: NEW GAIN :: -120 :: 10 :: 167

     !!! Same MINUS :: -130 11th
  ** :: CAPOFFSET :: 104th :: FWD :: 125 :: REV :: 124 :: NEW GAIN :: -130 :: 10 :: 167

     !!! Same MINUS :: -140 12th
  ** :: CAPOFFSET :: 105th :: FWD :: 125 :: REV :: 124 :: NEW GAIN :: -140 :: 10 :: 167

     !!! Same MINUS :: -150 13th
  ** :: CAPOFFSET :: 106th :: FWD :: 125 :: REV :: 124 :: NEW GAIN :: -150 :: 10 :: 167

     !!! Same MINUS :: -160 14th
  ** :: CAPOFFSET :: 107th :: FWD :: 125 :: REV :: 124 :: NEW GAIN :: -160 :: 10 :: 167

     !!! Same MINUS :: -170 15th
  ** :: CAPOFFSET :: 108th :: FWD :: 125 :: REV :: 124 :: NEW GAIN :: -170 :: 10 :: 167

     !!! Same MINUS :: -180 16th
  ** :: CAPOFFSET :: 109th :: FWD :: 125 :: REV :: 124 :: NEW GAIN :: -180 :: 10 :: 167

     !!! Same MINUS :: -190 17th
  ** :: CAPOFFSET :: 110th :: FWD :: 125 :: REV :: 124 :: NEW GAIN :: -190 :: 10 :: 167

     !!! Same MINUS :: -200 18th
  ** :: CAPOFFSET :: 111th :: FWD :: 125 :: REV :: 124 :: NEW GAIN :: -200 :: 10 :: 167

     !!! Same MINUS :: -210 19th
  ** :: CAPOFFSET :: 112th :: FWD :: 125 :: REV :: 124 :: NEW GAIN :: -210 :: 10 :: 167

     !!! Same MINUS :: -220 20th
  ** :: CAPOFFSET :: 113th :: FWD :: 125 :: REV :: 124 :: NEW GAIN :: -220 :: 10 :: 167

     !!! Same MINUS :: -230 21th
  ** :: CAPOFFSET :: 114th :: FWD :: 125 :: REV :: 124 :: NEW GAIN :: -230 :: 10 :: 167

     !!! Same MINUS :: -240 22th
  ** :: CAPOFFSET :: 115th :: FWD :: 125 :: REV :: 124 :: NEW GAIN :: -240 :: 10 :: 167

     !!! Same MINUS :: -250 23th
  ** :: CAPOFFSET :: 116th :: FWD :: 125 :: REV :: 124 :: NEW GAIN :: -250 :: 10 :: 167

     !!! Same MINUS :: -260 24th
  ** :: CAPOFFSET :: 117th :: FWD :: 125 :: REV :: 124 :: NEW GAIN :: -260 :: 10 :: 167

     !!! Same MINUS :: -270 25th
  ** :: CAPOFFSET :: 118th :: FWD :: 125 :: REV :: 124 :: NEW GAIN :: -270 :: 10 :: 167

     !!! Same MINUS :: -280 26th
  ** :: CAPOFFSET :: 119th :: FWD :: 125 :: REV :: 124 :: NEW GAIN :: -280 :: 10 :: 167

     !!! Same MINUS :: -290 27th
  ** :: CAPOFFSET :: 120th :: FWD :: 125 :: REV :: 124 :: NEW GAIN :: -290 :: 10 :: 167

     !!! Same MINUS :: -300 28th
  ** :: CAPOFFSET :: 121th :: FWD :: 125 :: REV :: 124 :: NEW GAIN :: -300 :: 10 :: 167

     !!! Same MINUS :: -310 29th
  ** :: CAPOFFSET :: 122th :: FWD :: 125 :: REV :: 124 :: NEW GAIN :: -310 :: 10 :: 167

     !!! Same MINUS :: -320 30th
  ** :: CAPOFFSET :: 123th :: FWD :: 125 :: REV :: 124 :: NEW GAIN :: -320 :: 10 :: 167

     !!! Same MINUS :: Change Direction -300 30th
  ** :: CAPOFFSET :: 124th :: FWD :: 125 :: REV :: 124 :: NEW GAIN :: -300 :: 10 :: 167

     !!! Same PLUS :: -290 1th
  ** :: CAPOFFSET :: 125th :: FWD :: 125 :: REV :: 124 :: NEW GAIN :: -290 :: 10 :: 167

     !!! Same PLUS :: -280 2th
  ** :: CAPOFFSET :: 126th :: FWD :: 125 :: REV :: 124 :: NEW GAIN :: -280 :: 10 :: 167

     !!! Same PLUS :: -270 3th
  ** :: CAPOFFSET :: 127th :: FWD :: 125 :: REV :: 124 :: NEW GAIN :: -270 :: 10 :: 167

     !!! Same PLUS :: -260 4th
  ** :: CAPOFFSET :: 128th :: FWD :: 125 :: REV :: 124 :: NEW GAIN :: -260 :: 10 :: 167

     !!! Same PLUS :: -250 5th
  ** :: CAPOFFSET :: 129th :: FWD :: 125 :: REV :: 124 :: NEW GAIN :: -250 :: 10 :: 167

     !!! Same PLUS :: -240 6th
  ** :: CAPOFFSET :: 130th :: FWD :: 125 :: REV :: 124 :: NEW GAIN :: -240 :: 10 :: 167

     !!! Same PLUS :: -230 7th
  ** :: CAPOFFSET :: 131th :: FWD :: 125 :: REV :: 124 :: NEW GAIN :: -230 :: 10 :: 167

     !!! Same PLUS :: -220 8th
  ** :: CAPOFFSET :: 132th :: FWD :: 125 :: REV :: 124 :: NEW GAIN :: -220 :: 10 :: 167

     !!! Same PLUS :: -210 9th
  ** :: CAPOFFSET :: 133th :: FWD :: 125 :: REV :: 124 :: NEW GAIN :: -210 :: 10 :: 167

     !!! Same PLUS :: -200 10th
  ** :: CAPOFFSET :: 134th :: FWD :: 125 :: REV :: 124 :: NEW GAIN :: -200 :: 10 :: 167

     !!! Same PLUS :: -190 11th
  ** :: CAPOFFSET :: 135th :: FWD :: 125 :: REV :: 124 :: NEW GAIN :: -190 :: 10 :: 167

     !!! Same PLUS :: -180 12th
  ** :: CAPOFFSET :: 136th :: FWD :: 125 :: REV :: 124 :: NEW GAIN :: -180 :: 10 :: 167

     !!! Same PLUS :: -170 13th
  ** :: CAPOFFSET :: 137th :: FWD :: 125 :: REV :: 124 :: NEW GAIN :: -170 :: 10 :: 167

     !!! Same PLUS :: -160 14th
  ** :: CAPOFFSET :: 138th :: FWD :: 125 :: REV :: 124 :: NEW GAIN :: -160 :: 10 :: 167

     !!! Same PLUS :: -150 15th
  ** :: CAPOFFSET :: 139th :: FWD :: 125 :: REV :: 124 :: NEW GAIN :: -150 :: 10 :: 167

     !!! Same PLUS :: -140 16th
  ** :: CAPOFFSET :: 140th :: FWD :: 125 :: REV :: 124 :: NEW GAIN :: -140 :: 10 :: 167

     !!! Same PLUS :: -130 17th
  ** :: CAPOFFSET :: 141th :: FWD :: 125 :: REV :: 124 :: NEW GAIN :: -130 :: 10 :: 167

     !!! Same PLUS :: -120 18th
  ** :: CAPOFFSET :: 142th :: FWD :: 125 :: REV :: 124 :: NEW GAIN :: -120 :: 10 :: 167

     !!! Same PLUS :: -110 19th
  ** :: CAPOFFSET :: 143th :: FWD :: 125 :: REV :: 124 :: NEW GAIN :: -110 :: 10 :: 167

     !!! Same PLUS :: -100 20th
  ** :: CAPOFFSET :: 144th :: FWD :: 125 :: REV :: 124 :: NEW GAIN :: -100 :: 10 :: 167

     !!! Same PLUS :: -90 21th
  ** :: CAPOFFSET :: 145th :: FWD :: 125 :: REV :: 124 :: NEW GAIN :: -90 :: 10 :: 167

     !!! Same PLUS :: -80 22th
  ** :: CAPOFFSET :: 146th :: FWD :: 125 :: REV :: 124 :: NEW GAIN :: -80 :: 10 :: 167

     !!! Same PLUS :: -70 23th
  ** :: CAPOFFSET :: 147th :: FWD :: 125 :: REV :: 124 :: NEW GAIN :: -70 :: 10 :: 167

     !!! Same PLUS :: -60 24th
  ** :: CAPOFFSET :: 148th :: FWD :: 125 :: REV :: 124 :: NEW GAIN :: -60 :: 10 :: 167

     !!! Same PLUS :: -50 25th
  ** :: CAPOFFSET :: 149th :: FWD :: 125 :: REV :: 124 :: NEW GAIN :: -50 :: 10 :: 167

     !!! Same PLUS :: -40 26th
  ** :: CAPOFFSET :: 150th :: FWD :: 125 :: REV :: 124 :: NEW GAIN :: -40 :: 10 :: 167

     !!! Same PLUS :: -30 27th
  ** :: CAPOFFSET :: 151th :: FWD :: 125 :: REV :: 124 :: NEW GAIN :: -30 :: 10 :: 167

     !!! Same PLUS :: -20 28th
  ** :: CAPOFFSET :: 152th :: FWD :: 125 :: REV :: 124 :: NEW GAIN :: -20 :: 10 :: 167

     !!! Same PLUS :: -10 29th
  ** :: CAPOFFSET :: 153th :: FWD :: 125 :: REV :: 124 :: NEW GAIN :: -10 :: 10 :: 167

     !!! Same PLUS :: 0 30th
  ** :: CAPOFFSET :: 154th :: FWD :: 125 :: REV :: 124 :: NEW GAIN :: 0 :: 10 :: 167

     !!! Same PLUS :: Change Direction -20 30th
  ** :: CAPOFFSET :: 155th :: FWD :: 125 :: REV :: 124 :: NEW GAIN :: -20 :: 10 :: 167

     !!! Same MINUS :: -30 1th
  ** :: CAPOFFSET :: 156th :: FWD :: 125 :: REV :: 124 :: NEW GAIN :: -30 :: 10 :: 167

     !!! Same MINUS :: -40 2th
  ** :: CAPOFFSET :: 157th :: FWD :: 125 :: REV :: 124 :: NEW GAIN :: -40 :: 10 :: 167

     !!! Same MINUS :: -50 3th
  ** :: CAPOFFSET :: 158th :: FWD :: 125 :: REV :: 124 :: NEW GAIN :: -50 :: 10 :: 167

     !!! Same MINUS :: -60 4th
  ** :: CAPOFFSET :: 159th :: FWD :: 125 :: REV :: 124 :: NEW GAIN :: -60 :: 10 :: 167

     !!! Same MINUS :: -70 5th
  ** :: CAPOFFSET :: 160th :: FWD :: 125 :: REV :: 124 :: NEW GAIN :: -70 :: 10 :: 167

     !!! Same MINUS :: -80 6th
  ** :: CAPOFFSET :: 161th :: FWD :: 125 :: REV :: 124 :: NEW GAIN :: -80 :: 10 :: 167

     !!! Same MINUS :: -90 7th
  ** :: CAPOFFSET :: 162th :: FWD :: 125 :: REV :: 124 :: NEW GAIN :: -90 :: 10 :: 167

     !!! Same MINUS :: -100 8th
  ** :: CAPOFFSET :: 163th :: FWD :: 125 :: REV :: 124 :: NEW GAIN :: -100 :: 10 :: 167

     !!! Same MINUS :: -110 9th
  ** :: CAPOFFSET :: 164th :: FWD :: 125 :: REV :: 124 :: NEW GAIN :: -110 :: 10 :: 167

     !!! Same MINUS :: -120 10th
  ** :: CAPOFFSET :: 165th :: FWD :: 125 :: REV :: 124 :: NEW GAIN :: -120 :: 10 :: 167

     !!! Same MINUS :: -130 11th
  ** :: CAPOFFSET :: 166th :: FWD :: 125 :: REV :: 124 :: NEW GAIN :: -130 :: 10 :: 167

     !!! Same MINUS :: -140 12th
  ** :: CAPOFFSET :: 167th :: FWD :: 125 :: REV :: 124 :: NEW GAIN :: -140 :: 10 :: 167

     !!! Same MINUS :: -150 13th
  ** :: CAPOFFSET :: 168th :: FWD :: 125 :: REV :: 124 :: NEW GAIN :: -150 :: 10 :: 167

     !!! Same MINUS :: -160 14th
  ** :: CAPOFFSET :: 169th :: FWD :: 125 :: REV :: 124 :: NEW GAIN :: -160 :: 10 :: 167

     !!! Same MINUS :: -170 15th
  ** :: CAPOFFSET :: 170th :: FWD :: 125 :: REV :: 124 :: NEW GAIN :: -170 :: 10 :: 167

     !!! Same MINUS :: -180 16th
  ** :: CAPOFFSET :: 171th :: FWD :: 125 :: REV :: 124 :: NEW GAIN :: -180 :: 10 :: 167

     !!! Same MINUS :: -190 17th
  ** :: CAPOFFSET :: 172th :: FWD :: 125 :: REV :: 124 :: NEW GAIN :: -190 :: 10 :: 167

     !!! Same MINUS :: -200 18th
  ** :: CAPOFFSET :: 173th :: FWD :: 125 :: REV :: 124 :: NEW GAIN :: -200 :: 10 :: 167

     !!! Same MINUS :: -210 19th
  ** :: CAPOFFSET :: 174th :: FWD :: 125 :: REV :: 124 :: NEW GAIN :: -210 :: 10 :: 167

     !!! Same MINUS :: -220 20th
  ** :: CAPOFFSET :: 175th :: FWD :: 125 :: REV :: 124 :: NEW GAIN :: -220 :: 10 :: 167

     !!! Same MINUS :: -230 21th
  ** :: CAPOFFSET :: 176th :: FWD :: 125 :: REV :: 124 :: NEW GAIN :: -230 :: 10 :: 167

     !!! Same MINUS :: -240 22th
  ** :: CAPOFFSET :: 177th :: FWD :: 125 :: REV :: 124 :: NEW GAIN :: -240 :: 10 :: 167

     !!! Same MINUS :: -250 23th
  ** :: CAPOFFSET :: 178th :: FWD :: 125 :: REV :: 124 :: NEW GAIN :: -250 :: 10 :: 167

     !!! Same MINUS :: -260 24th
  ** :: CAPOFFSET :: 179th :: FWD :: 125 :: REV :: 124 :: NEW GAIN :: -260 :: 10 :: 167

     !!! Same MINUS :: -270 25th
  ** :: CAPOFFSET :: 180th :: FWD :: 125 :: REV :: 124 :: NEW GAIN :: -270 :: 10 :: 167

     !!! Same MINUS :: -280 26th
  ** :: CAPOFFSET :: 181th :: FWD :: 125 :: REV :: 124 :: NEW GAIN :: -280 :: 10 :: 167

     !!! Same MINUS :: -290 27th
  ** :: CAPOFFSET :: 182th :: FWD :: 125 :: REV :: 124 :: NEW GAIN :: -290 :: 10 :: 167

     !!! Same MINUS :: -300 28th
  ** :: CAPOFFSET :: 183th :: FWD :: 125 :: REV :: 124 :: NEW GAIN :: -300 :: 10 :: 167

     !!! Same MINUS :: -310 29th
  ** :: CAPOFFSET :: 184th :: FWD :: 125 :: REV :: 124 :: NEW GAIN :: -310 :: 10 :: 167

     !!! Same MINUS :: -320 30th
  ** :: CAPOFFSET :: 185th :: FWD :: 125 :: REV :: 124 :: NEW GAIN :: -320 :: 10 :: 167

     !!! Same MINUS :: Change Direction -300 30th
  ** :: CAPOFFSET :: 186th :: FWD :: 125 :: REV :: 124 :: NEW GAIN :: -300 :: 10 :: 167

     !!! Same PLUS :: -290 1th
  ** :: CAPOFFSET :: 187th :: FWD :: 125 :: REV :: 124 :: NEW GAIN :: -290 :: 10 :: 167

     !!! Same PLUS :: -280 2th
  ** :: CAPOFFSET :: 188th :: FWD :: 125 :: REV :: 124 :: NEW GAIN :: -280 :: 10 :: 167

     !!! Same PLUS :: -270 3th
  ** :: CAPOFFSET :: 189th :: FWD :: 125 :: REV :: 124 :: NEW GAIN :: -270 :: 10 :: 167

     !!! Same PLUS :: -260 4th
  ** :: CAPOFFSET :: 190th :: FWD :: 125 :: REV :: 124 :: NEW GAIN :: -260 :: 10 :: 167

     !!! Same PLUS :: -250 5th
  ** :: CAPOFFSET :: 191th :: FWD :: 125 :: REV :: 124 :: NEW GAIN :: -250 :: 10 :: 167

     !!! Same PLUS :: -240 6th
  ** :: CAPOFFSET :: 192th :: FWD :: 125 :: REV :: 124 :: NEW GAIN :: -240 :: 10 :: 167

     !!! Same PLUS :: -230 7th
  ** :: CAPOFFSET :: 193th :: FWD :: 125 :: REV :: 124 :: NEW GAIN :: -230 :: 10 :: 167

     !!! Same PLUS :: -220 8th
  ** :: CAPOFFSET :: 194th :: FWD :: 125 :: REV :: 124 :: NEW GAIN :: -220 :: 10 :: 167

     !!! Same PLUS :: -210 9th
  ** :: CAPOFFSET :: 195th :: FWD :: 125 :: REV :: 124 :: NEW GAIN :: -210 :: 10 :: 167

     !!! Same PLUS :: -200 10th
  ** :: CAPOFFSET :: 196th :: FWD :: 125 :: REV :: 124 :: NEW GAIN :: -200 :: 10 :: 167

     !!! Same PLUS :: -190 11th
  ** :: CAPOFFSET :: 197th :: FWD :: 125 :: REV :: 124 :: NEW GAIN :: -190 :: 10 :: 167

     !!! Same PLUS :: -180 12th
  ** :: CAPOFFSET :: 198th :: FWD :: 125 :: REV :: 124 :: NEW GAIN :: -180 :: 10 :: 167

     !!! Same PLUS :: -170 13th
  ** :: CAPOFFSET :: 199th :: FWD :: 125 :: REV :: 124 :: NEW GAIN :: -170 :: 10 :: 167

     !!! Same PLUS :: -160 14th
  ** :: CAPOFFSET :: 200th :: FWD :: 125 :: REV :: 124 :: NEW GAIN :: -160 :: 10 :: 167

     !!! Same PLUS :: -150 15th
  ** :: CAPOFFSET :: 201th :: FWD :: 125 :: REV :: 124 :: NEW GAIN :: -150 :: 10 :: 167

     !!! Same PLUS :: -140 16th
  ** :: CAPOFFSET :: 202th :: FWD :: 125 :: REV :: 124 :: NEW GAIN :: -140 :: 10 :: 167

     !!! Same PLUS :: -130 17th
  ** :: CAPOFFSET :: 203th :: FWD :: 125 :: REV :: 124 :: NEW GAIN :: -130 :: 10 :: 167

     !!! Same PLUS :: -120 18th
  ** :: CAPOFFSET :: 204th :: FWD :: 125 :: REV :: 124 :: NEW GAIN :: -120 :: 10 :: 167

     !!! Same PLUS :: -110 19th
  ** :: CAPOFFSET :: 205th :: FWD :: 125 :: REV :: 124 :: NEW GAIN :: -110 :: 10 :: 167

     !!! Same PLUS :: -100 20th
  ** :: CAPOFFSET :: 206th :: FWD :: 125 :: REV :: 124 :: NEW GAIN :: -100 :: 10 :: 167

     !!! Same PLUS :: -90 21th
  ** :: CAPOFFSET :: 207th :: FWD :: 125 :: REV :: 124 :: NEW GAIN :: -90 :: 10 :: 167

     !!! Same PLUS :: -80 22th
  ** :: CAPOFFSET :: 208th :: FWD :: 125 :: REV :: 124 :: NEW GAIN :: -80 :: 10 :: 167

     !!! Same PLUS :: -70 23th
  ** :: CAPOFFSET :: 209th :: FWD :: 125 :: REV :: 124 :: NEW GAIN :: -70 :: 10 :: 167

     !!! Same PLUS :: -60 24th
  ** :: CAPOFFSET :: 210th :: FWD :: 125 :: REV :: 124 :: NEW GAIN :: -60 :: 10 :: 167

     !!! Same PLUS :: -50 25th
  ** :: CAPOFFSET :: 211th :: FWD :: 125 :: REV :: 124 :: NEW GAIN :: -50 :: 10 :: 167

     !!! Same PLUS :: -40 26th
  ** :: CAPOFFSET :: 212th :: FWD :: 125 :: REV :: 124 :: NEW GAIN :: -40 :: 10 :: 167

     !!! Same PLUS :: -30 27th
  ** :: CAPOFFSET :: 213th :: FWD :: 125 :: REV :: 124 :: NEW GAIN :: -30 :: 10 :: 167

     !!! Same PLUS :: -20 28th
  ** :: CAPOFFSET :: 214th :: FWD :: 125 :: REV :: 124 :: NEW GAIN :: -20 :: 10 :: 167

     !!! Same PLUS :: -10 29th
  ** :: CAPOFFSET :: 215th :: FWD :: 125 :: REV :: 124 :: NEW GAIN :: -10 :: 10 :: 167

     !!! Same PLUS :: 0 30th
  ** :: CAPOFFSET :: 216th :: FWD :: 125 :: REV :: 124 :: NEW GAIN :: 0 :: 10 :: 167

     !!! Same PLUS :: Change Direction -20 30th
  ** :: CAPOFFSET :: 217th :: FWD :: 125 :: REV :: 124 :: NEW GAIN :: -20 :: 10 :: 167

     !!! Same MINUS :: -30 1th
  ** :: CAPOFFSET :: 218th :: FWD :: 125 :: REV :: 124 :: NEW GAIN :: -30 :: 10 :: 167

     !!! Same MINUS :: -40 2th
  ** :: CAPOFFSET :: 219th :: FWD :: 125 :: REV :: 124 :: NEW GAIN :: -40 :: 10 :: 167

     !!! Same MINUS :: -50 3th
  ** :: CAPOFFSET :: 220th :: FWD :: 125 :: REV :: 124 :: NEW GAIN :: -50 :: 10 :: 167

     !!! Same MINUS :: -60 4th
  ** :: CAPOFFSET :: 221th :: FWD :: 125 :: REV :: 124 :: NEW GAIN :: -60 :: 10 :: 167

     !!! Same MINUS :: -70 5th
  ** :: CAPOFFSET :: 222th :: FWD :: 125 :: REV :: 124 :: NEW GAIN :: -70 :: 10 :: 167

     !!! Same MINUS :: -80 6th
  ** :: CAPOFFSET :: 223th :: FWD :: 125 :: REV :: 124 :: NEW GAIN :: -80 :: 10 :: 167

     !!! Same MINUS :: -90 7th
  ** :: CAPOFFSET :: 224th :: FWD :: 125 :: REV :: 124 :: NEW GAIN :: -90 :: 10 :: 167

     !!! Same MINUS :: -100 8th
  ** :: CAPOFFSET :: 225th :: FWD :: 125 :: REV :: 124 :: NEW GAIN :: -100 :: 10 :: 167

     !!! Same MINUS :: -110 9th
  ** :: CAPOFFSET :: 226th :: FWD :: 125 :: REV :: 124 :: NEW GAIN :: -110 :: 10 :: 167

     !!! Same MINUS :: -120 10th
  ** :: CAPOFFSET :: 227th :: FWD :: 125 :: REV :: 124 :: NEW GAIN :: -120 :: 10 :: 167

     !!! Same MINUS :: -130 11th
  ** :: CAPOFFSET :: 228th :: FWD :: 125 :: REV :: 124 :: NEW GAIN :: -130 :: 10 :: 167

     !!! Same MINUS :: -140 12th
  ** :: CAPOFFSET :: 229th :: FWD :: 125 :: REV :: 124 :: NEW GAIN :: -140 :: 10 :: 167

     !!! Same MINUS :: -150 13th
  ** :: CAPOFFSET :: 230th :: FWD :: 125 :: REV :: 124 :: NEW GAIN :: -150 :: 10 :: 167

     !!! Same MINUS :: -160 14th
  ** :: CAPOFFSET :: 231th :: FWD :: 125 :: REV :: 124 :: NEW GAIN :: -160 :: 10 :: 167

     !!! Same MINUS :: -170 15th
  ** :: CAPOFFSET :: 232th :: FWD :: 125 :: REV :: 124 :: NEW GAIN :: -170 :: 10 :: 167

     !!! Same MINUS :: -180 16th
  ** :: CAPOFFSET :: 233th :: FWD :: 125 :: REV :: 124 :: NEW GAIN :: -180 :: 10 :: 167

     !!! Same MINUS :: -190 17th
  ** :: CAPOFFSET :: 234th :: FWD :: 125 :: REV :: 124 :: NEW GAIN :: -190 :: 10 :: 167

     !!! Same MINUS :: -200 18th
  ** :: CAPOFFSET :: 235th :: FWD :: 125 :: REV :: 124 :: NEW GAIN :: -200 :: 10 :: 167

     !!! Same MINUS :: -210 19th
  ** :: CAPOFFSET :: 236th :: FWD :: 125 :: REV :: 124 :: NEW GAIN :: -210 :: 10 :: 167

     !!! Same MINUS :: -220 20th
  ** :: CAPOFFSET :: 237th :: FWD :: 125 :: REV :: 124 :: NEW GAIN :: -220 :: 10 :: 167

     !!! Same MINUS :: -230 21th
  ** :: CAPOFFSET :: 238th :: FWD :: 125 :: REV :: 124 :: NEW GAIN :: -230 :: 10 :: 167

     !!! Same MINUS :: -240 22th
  ** :: CAPOFFSET :: 239th :: FWD :: 125 :: REV :: 124 :: NEW GAIN :: -240 :: 10 :: 167

     !!! Same MINUS :: -250 23th
  ** :: CAPOFFSET :: 240th :: FWD :: 125 :: REV :: 124 :: NEW GAIN :: -250 :: 10 :: 167

     !!! Same MINUS :: -260 24th
  ** :: CAPOFFSET :: 241th :: FWD :: 125 :: REV :: 124 :: NEW GAIN :: -260 :: 10 :: 167

     !!! Same MINUS :: -270 25th
  ** :: CAPOFFSET :: 242th :: FWD :: 125 :: REV :: 124 :: NEW GAIN :: -270 :: 10 :: 167

     !!! Same MINUS :: -280 26th
  ** :: CAPOFFSET :: 243th :: FWD :: 125 :: REV :: 124 :: NEW GAIN :: -280 :: 10 :: 167

     !!! Same MINUS :: -290 27th
  ** :: CAPOFFSET :: 244th :: FWD :: 125 :: REV :: 124 :: NEW GAIN :: -290 :: 10 :: 167

     !!! Same MINUS :: -300 28th
  ** :: CAPOFFSET :: 245th :: FWD :: 125 :: REV :: 124 :: NEW GAIN :: -300 :: 10 :: 167

     !!! Same MINUS :: -310 29th
  ** :: CAPOFFSET :: 246th :: FWD :: 125 :: REV :: 124 :: NEW GAIN :: -310 :: 10 :: 167

     !!! Same MINUS :: -320 30th
  ** :: CAPOFFSET :: 247th :: FWD :: 125 :: REV :: 124 :: NEW GAIN :: -320 :: 10 :: 167

     !!! Same MINUS :: Change Direction -300 30th
  ** :: CAPOFFSET :: 248th :: FWD :: 125 :: REV :: 124 :: NEW GAIN :: -300 :: 10 :: 167

     !!! Same PLUS :: -290 1th
  ** :: CAPOFFSET :: 249th :: FWD :: 125 :: REV :: 124 :: NEW GAIN :: -290 :: 10 :: 167

     !!! Same PLUS :: -280 2th
  ** :: CAPOFFSET :: 250th :: FWD :: 125 :: REV :: 124 :: NEW GAIN :: -280 :: 10 :: 167

     !!! Same PLUS :: -270 3th
  ** :: CAPOFFSET :: 251th :: FWD :: 125 :: REV :: 124 :: NEW GAIN :: -270 :: 10 :: 167

     !!! Same PLUS :: -260 4th
  ** :: CAPOFFSET :: 252th :: FWD :: 125 :: REV :: 124 :: NEW GAIN :: -260 :: 10 :: 167

     !!! Same PLUS :: -250 5th
  ** :: CAPOFFSET :: 253th :: FWD :: 125 :: REV :: 124 :: NEW GAIN :: -250 :: 10 :: 167

     !!! Same PLUS :: -240 6th
  ** :: CAPOFFSET :: 254th :: FWD :: 125 :: REV :: 124 :: NEW GAIN :: -240 :: 10 :: 167

     !!! Same PLUS :: -230 7th
  ** :: CAPOFFSET :: 255th :: FWD :: 125 :: REV :: 124 :: NEW GAIN :: -230 :: 10 :: 167

     !!! Same PLUS :: -220 8th
  ** :: CAPOFFSET :: 256th :: FWD :: 125 :: REV :: 124 :: NEW GAIN :: -220 :: 10 :: 167

     !!! Same PLUS :: -210 9th
  ** :: CAPOFFSET :: 257th :: FWD :: 125 :: REV :: 124 :: NEW GAIN :: -210 :: 10 :: 167

     !!! Same PLUS :: -200 10th
  ** :: CAPOFFSET :: 258th :: FWD :: 125 :: REV :: 124 :: NEW GAIN :: -200 :: 10 :: 167

     !!! Same PLUS :: -190 11th
  ** :: CAPOFFSET :: 259th :: FWD :: 125 :: REV :: 124 :: NEW GAIN :: -190 :: 10 :: 167

     !!! Same PLUS :: -180 12th
  ** :: CAPOFFSET :: 260th :: FWD :: 125 :: REV :: 124 :: NEW GAIN :: -180 :: 10 :: 167

     !!! Same PLUS :: -170 13th
  ** :: CAPOFFSET :: 261th :: FWD :: 125 :: REV :: 124 :: NEW GAIN :: -170 :: 10 :: 167

     !!! Same PLUS :: -160 14th
  ** :: CAPOFFSET :: 262th :: FWD :: 125 :: REV :: 124 :: NEW GAIN :: -160 :: 10 :: 167

     !!! Same PLUS :: -150 15th
  ** :: CAPOFFSET :: 263th :: FWD :: 125 :: REV :: 124 :: NEW GAIN :: -150 :: 10 :: 167

     !!! Same PLUS :: -140 16th
  ** :: CAPOFFSET :: 264th :: FWD :: 125 :: REV :: 124 :: NEW GAIN :: -140 :: 10 :: 167

     !!! Same PLUS :: -130 17th
  ** :: CAPOFFSET :: 265th :: FWD :: 125 :: REV :: 124 :: NEW GAIN :: -130 :: 10 :: 167

     !!! Same PLUS :: -120 18th
  ** :: CAPOFFSET :: 266th :: FWD :: 125 :: REV :: 124 :: NEW GAIN :: -120 :: 10 :: 167

     !!! Same PLUS :: -110 19th
  ** :: CAPOFFSET :: 267th :: FWD :: 125 :: REV :: 124 :: NEW GAIN :: -110 :: 10 :: 167

     !!! Same PLUS :: -100 20th
  ** :: CAPOFFSET :: 268th :: FWD :: 125 :: REV :: 124 :: NEW GAIN :: -100 :: 10 :: 167

     !!! Same PLUS :: -90 21th
  ** :: CAPOFFSET :: 269th :: FWD :: 125 :: REV :: 124 :: NEW GAIN :: -90 :: 10 :: 167

     !!! Same PLUS :: -80 22th
  ** :: CAPOFFSET :: 270th :: FWD :: 125 :: REV :: 124 :: NEW GAIN :: -80 :: 10 :: 167

     !!! Same PLUS :: -70 23th
  ** :: CAPOFFSET :: 271th :: FWD :: 125 :: REV :: 124 :: NEW GAIN :: -70 :: 10 :: 167

     !!! Same PLUS :: -60 24th
  ** :: CAPOFFSET :: 272th :: FWD :: 125 :: REV :: 124 :: NEW GAIN :: -60 :: 10 :: 167

     !!! Same PLUS :: -50 25th
  ** :: CAPOFFSET :: 273th :: FWD :: 125 :: REV :: 124 :: NEW GAIN :: -50 :: 10 :: 167

     !!! Same PLUS :: -40 26th
  ** :: CAPOFFSET :: 274th :: FWD :: 125 :: REV :: 124 :: NEW GAIN :: -40 :: 10 :: 167

     !!! Same PLUS :: -30 27th
  ** :: CAPOFFSET :: 275th :: FWD :: 125 :: REV :: 124 :: NEW GAIN :: -30 :: 10 :: 167

     !!! Same PLUS :: -20 28th
  ** :: CAPOFFSET :: 276th :: FWD :: 125 :: REV :: 124 :: NEW GAIN :: -20 :: 10 :: 167

     !!! Same PLUS :: -10 29th
  ** :: CAPOFFSET :: 277th :: FWD :: 125 :: REV :: 124 :: NEW GAIN :: -10 :: 10 :: 167

     !!! Same PLUS :: 0 30th
  ** :: CAPOFFSET :: 278th :: FWD :: 125 :: REV :: 124 :: NEW GAIN :: 0 :: 10 :: 167

     !!! Same PLUS :: Change Direction -20 30th
  ** :: CAPOFFSET :: 279th :: FWD :: 125 :: REV :: 124 :: NEW GAIN :: -20 :: 10 :: 167

     !!! Same MINUS :: -30 1th
  ** :: CAPOFFSET :: 280th :: FWD :: 125 :: REV :: 124 :: NEW GAIN :: -30 :: 10 :: 167

     !!! Same MINUS :: -40 2th
  ** :: CAPOFFSET :: 281th :: FWD :: 125 :: REV :: 124 :: NEW GAIN :: -40 :: 10 :: 167

     !!! Same MINUS :: -50 3th
  ** :: CAPOFFSET :: 282th :: FWD :: 125 :: REV :: 124 :: NEW GAIN :: -50 :: 10 :: 167

     !!! Same MINUS :: -60 4th
  ** :: CAPOFFSET :: 283th :: FWD :: 125 :: REV :: 124 :: NEW GAIN :: -60 :: 10 :: 167

     !!! Same MINUS :: -70 5th
  ** :: CAPOFFSET :: 284th :: FWD :: 125 :: REV :: 124 :: NEW GAIN :: -70 :: 10 :: 167

     !!! Same MINUS :: -80 6th
  ** :: CAPOFFSET :: 285th :: FWD :: 125 :: REV :: 124 :: NEW GAIN :: -80 :: 10 :: 167

     !!! Same MINUS :: -90 7th
  ** :: CAPOFFSET :: 286th :: FWD :: 125 :: REV :: 124 :: NEW GAIN :: -90 :: 10 :: 167

     !!! Same MINUS :: -100 8th
  ** :: CAPOFFSET :: 287th :: FWD :: 125 :: REV :: 124 :: NEW GAIN :: -100 :: 10 :: 167

     !!! Same MINUS :: -110 9th
  ** :: CAPOFFSET :: 288th :: FWD :: 125 :: REV :: 124 :: NEW GAIN :: -110 :: 10 :: 167

     !!! Same MINUS :: -120 10th
  ** :: CAPOFFSET :: 289th :: FWD :: 125 :: REV :: 124 :: NEW GAIN :: -120 :: 10 :: 167

     !!! Same MINUS :: -130 11th
  ** :: CAPOFFSET :: 290th :: FWD :: 125 :: REV :: 124 :: NEW GAIN :: -130 :: 10 :: 167

     !!! Same MINUS :: -140 12th
  ** :: CAPOFFSET :: 291th :: FWD :: 125 :: REV :: 124 :: NEW GAIN :: -140 :: 10 :: 167

     !!! Same MINUS :: -150 13th
  ** :: CAPOFFSET :: 292th :: FWD :: 125 :: REV :: 124 :: NEW GAIN :: -150 :: 10 :: 167

     !!! Same MINUS :: -160 14th
  ** :: CAPOFFSET :: 293th :: FWD :: 125 :: REV :: 124 :: NEW GAIN :: -160 :: 10 :: 167

     !!! Same MINUS :: -170 15th
  ** :: CAPOFFSET :: 294th :: FWD :: 125 :: REV :: 124 :: NEW GAIN :: -170 :: 10 :: 167

     !!! Same MINUS :: -180 16th
  ** :: CAPOFFSET :: 295th :: FWD :: 125 :: REV :: 124 :: NEW GAIN :: -180 :: 10 :: 167

     !!! Same MINUS :: -190 17th
  ** :: CAPOFFSET :: 296th :: FWD :: 125 :: REV :: 124 :: NEW GAIN :: -190 :: 10 :: 167

     !!! Same MINUS :: -200 18th
  ** :: CAPOFFSET :: 297th :: FWD :: 125 :: REV :: 124 :: NEW GAIN :: -200 :: 10 :: 167

     !!! Same MINUS :: -210 19th
  ** :: CAPOFFSET :: 298th :: FWD :: 125 :: REV :: 124 :: NEW GAIN :: -210 :: 10 :: 167

     !!! Same MINUS :: -220 20th
  ** :: CAPOFFSET :: 299th :: FWD :: 125 :: REV :: 124 :: NEW GAIN :: -220 :: 10 :: 167

     !!! Same MINUS :: -230 21th
  ** :: CAPOFFSET :: 300th :: FWD :: 125 :: REV :: 124 :: NEW GAIN :: -230 :: 10 :: 167

     !!! Same MINUS :: -240 22th
  ** :: CAPOFFSET :: 301th :: FWD :: 125 :: REV :: 124 :: NEW GAIN :: -240 :: 10 :: 167

     !!! Same MINUS :: -250 23th
  ** :: CAPOFFSET :: 302th :: FWD :: 125 :: REV :: 124 :: NEW GAIN :: -250 :: 10 :: 167

     !!! Same MINUS :: -260 24th
  ** :: CAPOFFSET :: 303th :: FWD :: 125 :: REV :: 124 :: NEW GAIN :: -260 :: 10 :: 167

     !!! Same MINUS :: -270 25th
  ** :: CAPOFFSET :: 304th :: FWD :: 125 :: REV :: 124 :: NEW GAIN :: -270 :: 10 :: 167

     !!! Same MINUS :: -280 26th
  ** :: CAPOFFSET :: 305th :: FWD :: 125 :: REV :: 124 :: NEW GAIN :: -280 :: 10 :: 167

     !!! Same MINUS :: -290 27th
  ** :: CAPOFFSET :: 306th :: FWD :: 125 :: REV :: 124 :: NEW GAIN :: -290 :: 10 :: 167

     !!! Same MINUS :: -300 28th
  ** :: CAPOFFSET :: 307th :: FWD :: 125 :: REV :: 124 :: NEW GAIN :: -300 :: 10 :: 167

     !!! Same MINUS :: -310 29th
  ** :: CAPOFFSET :: 308th :: FWD :: 125 :: REV :: 124 :: NEW GAIN :: -310 :: 10 :: 167

     !!! Same MINUS :: -320 30th
  ** :: CAPOFFSET :: 309th :: FWD :: 125 :: REV :: 124 :: NEW GAIN :: -320 :: 10 :: 167

     !!! Same MINUS :: Change Direction -300 30th
  ** :: CAPOFFSET :: 310th :: FWD :: 125 :: REV :: 124 :: NEW GAIN :: -300 :: 10 :: 167

     !!! Same PLUS :: -290 1th
  ** :: CAPOFFSET :: 311th :: FWD :: 125 :: REV :: 124 :: NEW GAIN :: -290 :: 10 :: 167

     !!! Same PLUS :: -280 2th
  ** :: CAPOFFSET :: 312th :: FWD :: 125 :: REV :: 124 :: NEW GAIN :: -280 :: 10 :: 167

     !!! Same PLUS :: -270 3th
  ** :: CAPOFFSET :: 313th :: FWD :: 125 :: REV :: 124 :: NEW GAIN :: -270 :: 10 :: 167

     !!! Same PLUS :: -260 4th
  ** :: CAPOFFSET :: 314th :: FWD :: 125 :: REV :: 124 :: NEW GAIN :: -260 :: 10 :: 167

     !!! Same PLUS :: -250 5th
  ** :: CAPOFFSET :: 315th :: FWD :: 125 :: REV :: 124 :: NEW GAIN :: -250 :: 10 :: 167

     !!! Same PLUS :: -240 6th
  ** :: CAPOFFSET :: 316th :: FWD :: 125 :: REV :: 124 :: NEW GAIN :: -240 :: 10 :: 167

     !!! Same PLUS :: -230 7th
  ** :: CAPOFFSET :: 317th :: FWD :: 125 :: REV :: 124 :: NEW GAIN :: -230 :: 10 :: 167

     !!! Same PLUS :: -220 8th
  ** :: CAPOFFSET :: 318th :: FWD :: 125 :: REV :: 124 :: NEW GAIN :: -220 :: 10 :: 167

     !!! Same PLUS :: -210 9th
  ** :: CAPOFFSET :: 319th :: FWD :: 125 :: REV :: 124 :: NEW GAIN :: -210 :: 10 :: 167

     !!! Same PLUS :: -200 10th
  ** :: CAPOFFSET :: 320th :: FWD :: 125 :: REV :: 124 :: NEW GAIN :: -200 :: 10 :: 167

     !!! Same PLUS :: -190 11th
  ** :: CAPOFFSET :: 321th :: FWD :: 125 :: REV :: 124 :: NEW GAIN :: -190 :: 10 :: 167

     !!! Same PLUS :: -180 12th
  ** :: CAPOFFSET :: 322th :: FWD :: 125 :: REV :: 124 :: NEW GAIN :: -180 :: 10 :: 167

     !!! Same PLUS :: -170 13th
  ** :: CAPOFFSET :: 323th :: FWD :: 125 :: REV :: 124 :: NEW GAIN :: -170 :: 10 :: 167

     !!! Same PLUS :: -160 14th
  ** :: CAPOFFSET :: 324th :: FWD :: 125 :: REV :: 124 :: NEW GAIN :: -160 :: 10 :: 167

     !!! Same PLUS :: -150 15th
  ** :: CAPOFFSET :: 325th :: FWD :: 125 :: REV :: 124 :: NEW GAIN :: -150 :: 10 :: 167

     !!! Same PLUS :: -140 16th
  ** :: CAPOFFSET :: 326th :: FWD :: 125 :: REV :: 124 :: NEW GAIN :: -140 :: 10 :: 167

     !!! Same PLUS :: -130 17th
  ** :: CAPOFFSET :: 327th :: FWD :: 125 :: REV :: 124 :: NEW GAIN :: -130 :: 10 :: 167

     !!! Same PLUS :: -120 18th
  ** :: CAPOFFSET :: 328th :: FWD :: 125 :: REV :: 124 :: NEW GAIN :: -120 :: 10 :: 167

     !!! Same PLUS :: -110 19th
  ** :: CAPOFFSET :: 329th :: FWD :: 125 :: REV :: 124 :: NEW GAIN :: -110 :: 10 :: 167

     !!! Same PLUS :: -100 20th
  ** :: CAPOFFSET :: 330th :: FWD :: 125 :: REV :: 124 :: NEW GAIN :: -100 :: 10 :: 167

     !!! Same PLUS :: -90 21th
  ** :: CAPOFFSET :: 331th :: FWD :: 125 :: REV :: 124 :: NEW GAIN :: -90 :: 10 :: 167

     !!! Same PLUS :: -80 22th
  ** :: CAPOFFSET :: 332th :: FWD :: 125 :: REV :: 124 :: NEW GAIN :: -80 :: 10 :: 167

     !!! Same PLUS :: -70 23th
  ** :: CAPOFFSET :: 333th :: FWD :: 125 :: REV :: 124 :: NEW GAIN :: -70 :: 10 :: 167

     !!! Same PLUS :: -60 24th
  ** :: CAPOFFSET :: 334th :: FWD :: 125 :: REV :: 124 :: NEW GAIN :: -60 :: 10 :: 167

     !!! Same PLUS :: -50 25th
  ** :: CAPOFFSET :: 335th :: FWD :: 125 :: REV :: 124 :: NEW GAIN :: -50 :: 10 :: 167

     !!! Same PLUS :: -40 26th
  ** :: CAPOFFSET :: 336th :: FWD :: 125 :: REV :: 124 :: NEW GAIN :: -40 :: 10 :: 167

     !!! Same PLUS :: -30 27th
  ** :: CAPOFFSET :: 337th :: FWD :: 125 :: REV :: 124 :: NEW GAIN :: -30 :: 10 :: 167

     !!! Same PLUS :: -20 28th
  ** :: CAPOFFSET :: 338th :: FWD :: 125 :: REV :: 124 :: NEW GAIN :: -20 :: 10 :: 167

     !!! Same PLUS :: -10 29th
  ** :: CAPOFFSET :: 339th :: FWD :: 125 :: REV :: 124 :: NEW GAIN :: -10 :: 10 :: 167

     !!! Same PLUS :: 0 30th
  ** :: CAPOFFSET :: 340th :: FWD :: 125 :: REV :: 124 :: NEW GAIN :: 0 :: 10 :: 167

     !!! Same PLUS :: Change Direction -20 30th
  ** :: CAPOFFSET :: 341th :: FWD :: 125 :: REV :: 124 :: NEW GAIN :: -20 :: 10 :: 167

     !!! Same MINUS :: -30 1th
  ** :: CAPOFFSET :: 342th :: FWD :: 125 :: REV :: 124 :: NEW GAIN :: -30 :: 10 :: 167

     !!! Same MINUS :: -40 2th
  ** :: CAPOFFSET :: 343th :: FWD :: 125 :: REV :: 124 :: NEW GAIN :: -40 :: 10 :: 167

     !!! Same MINUS :: -50 3th
  ** :: CAPOFFSET :: 344th :: FWD :: 125 :: REV :: 124 :: NEW GAIN :: -50 :: 10 :: 167

     !!! Same MINUS :: -60 4th
  ** :: CAPOFFSET :: 345th :: FWD :: 125 :: REV :: 124 :: NEW GAIN :: -60 :: 10 :: 167

     !!! Same MINUS :: -70 5th
  ** :: CAPOFFSET :: 346th :: FWD :: 125 :: REV :: 124 :: NEW GAIN :: -70 :: 10 :: 167

     !!! Same MINUS :: -80 6th
  ** :: CAPOFFSET :: 347th :: FWD :: 125 :: REV :: 124 :: NEW GAIN :: -80 :: 10 :: 167

     !!! Same MINUS :: -90 7th
  ** :: CAPOFFSET :: 348th :: FWD :: 125 :: REV :: 124 :: NEW GAIN :: -90 :: 10 :: 167

     !!! Same MINUS :: -100 8th
  ** :: CAPOFFSET :: 349th :: FWD :: 125 :: REV :: 124 :: NEW GAIN :: -100 :: 10 :: 167

     !!! Same MINUS :: -110 9th
  ** :: CAPOFFSET :: 350th :: FWD :: 125 :: REV :: 124 :: NEW GAIN :: -110 :: 10 :: 167

     !!! Same MINUS :: -120 10th
  ** :: CAPOFFSET :: 351th :: FWD :: 125 :: REV :: 124 :: NEW GAIN :: -120 :: 10 :: 167

     !!! Same MINUS :: -130 11th
  ** :: CAPOFFSET :: 352th :: FWD :: 125 :: REV :: 124 :: NEW GAIN :: -130 :: 10 :: 167

     !!! Same MINUS :: -140 12th
  ** :: CAPOFFSET :: 353th :: FWD :: 125 :: REV :: 124 :: NEW GAIN :: -140 :: 10 :: 167

     !!! Same MINUS :: -150 13th
  ** :: CAPOFFSET :: 354th :: FWD :: 125 :: REV :: 124 :: NEW GAIN :: -150 :: 10 :: 167

     !!! Same MINUS :: -160 14th
  ** :: CAPOFFSET :: 355th :: FWD :: 125 :: REV :: 124 :: NEW GAIN :: -160 :: 10 :: 167

     !!! Same MINUS :: -170 15th
  ** :: CAPOFFSET :: 356th :: FWD :: 125 :: REV :: 124 :: NEW GAIN :: -170 :: 10 :: 167

     !!! Same MINUS :: -180 16th
  ** :: CAPOFFSET :: 357th :: FWD :: 125 :: REV :: 124 :: NEW GAIN :: -180 :: 10 :: 167

     !!! Same MINUS :: -190 17th
  ** :: CAPOFFSET :: 358th :: FWD :: 125 :: REV :: 124 :: NEW GAIN :: -190 :: 10 :: 167

     !!! Same MINUS :: -200 18th
  ** :: CAPOFFSET :: 359th :: FWD :: 125 :: REV :: 124 :: NEW GAIN :: -200 :: 10 :: 167

     !!! Same MINUS :: -210 19th
  ** :: CAPOFFSET :: 360th :: FWD :: 125 :: REV :: 124 :: NEW GAIN :: -210 :: 10 :: 167

     !!! Same MINUS :: -220 20th
  ** :: CAPOFFSET :: 361th :: FWD :: 125 :: REV :: 124 :: NEW GAIN :: -220 :: 10 :: 167

     !!! Same MINUS :: -230 21th
  ** :: CAPOFFSET :: 362th :: FWD :: 125 :: REV :: 124 :: NEW GAIN :: -230 :: 10 :: 167

     !!! Same MINUS :: -240 22th
  ** :: CAPOFFSET :: 363th :: FWD :: 125 :: REV :: 124 :: NEW GAIN :: -240 :: 10 :: 167

     !!! Same MINUS :: -250 23th
  ** :: CAPOFFSET :: 364th :: FWD :: 125 :: REV :: 124 :: NEW GAIN :: -250 :: 10 :: 167

     !!! Same MINUS :: -260 24th
  ** :: CAPOFFSET :: 365th :: FWD :: 125 :: REV :: 124 :: NEW GAIN :: -260 :: 10 :: 167

     !!! Same MINUS :: -270 25th
  ** :: CAPOFFSET :: 366th :: FWD :: 125 :: REV :: 124 :: NEW GAIN :: -270 :: 10 :: 167

     !!! Same MINUS :: -280 26th
  ** :: CAPOFFSET :: 367th :: FWD :: 125 :: REV :: 124 :: NEW GAIN :: -280 :: 10 :: 167

     !!! Same MINUS :: -290 27th
  ** :: CAPOFFSET :: 368th :: FWD :: 125 :: REV :: 124 :: NEW GAIN :: -290 :: 10 :: 167

     !!! Same MINUS :: -300 28th
  ** :: CAPOFFSET :: 369th :: FWD :: 125 :: REV :: 124 :: NEW GAIN :: -300 :: 10 :: 167

     !!! Same MINUS :: -310 29th
  ** :: CAPOFFSET :: 370th :: FWD :: 125 :: REV :: 124 :: NEW GAIN :: -310 :: 10 :: 167

     !!! Same MINUS :: -320 30th
  ** :: CAPOFFSET :: 371th :: FWD :: 125 :: REV :: 124 :: NEW GAIN :: -320 :: 10 :: 167

     !!! Same MINUS :: Change Direction -300 30th
  ** :: CAPOFFSET :: 372th :: FWD :: 125 :: REV :: 124 :: NEW GAIN :: -300 :: 10 :: 167

     !!! Same PLUS :: -290 1th
  ** :: CAPOFFSET :: 373th :: FWD :: 125 :: REV :: 124 :: NEW GAIN :: -290 :: 10 :: 167

     !!! Same PLUS :: -280 2th
  ** :: CAPOFFSET :: 374th :: FWD :: 125 :: REV :: 124 :: NEW GAIN :: -280 :: 10 :: 167

     !!! Same PLUS :: -270 3th
  ** :: CAPOFFSET :: 375th :: FWD :: 125 :: REV :: 124 :: NEW GAIN :: -270 :: 10 :: 167

     !!! Same PLUS :: -260 4th
  ** :: CAPOFFSET :: 376th :: FWD :: 125 :: REV :: 124 :: NEW GAIN :: -260 :: 10 :: 167

     !!! Same PLUS :: -250 5th
  ** :: CAPOFFSET :: 377th :: FWD :: 125 :: REV :: 124 :: NEW GAIN :: -250 :: 10 :: 167

     !!! Same PLUS :: -240 6th
  ** :: CAPOFFSET :: 378th :: FWD :: 125 :: REV :: 124 :: NEW GAIN :: -240 :: 10 :: 167

     !!! Same PLUS :: -230 7th
  ** :: CAPOFFSET :: 379th :: FWD :: 125 :: REV :: 124 :: NEW GAIN :: -230 :: 10 :: 167

     !!! Same PLUS :: -220 8th
  ** :: CAPOFFSET :: 380th :: FWD :: 125 :: REV :: 124 :: NEW GAIN :: -220 :: 10 :: 167

     !!! Same PLUS :: -210 9th
  ** :: CAPOFFSET :: 381th :: FWD :: 125 :: REV :: 124 :: NEW GAIN :: -210 :: 10 :: 167

     !!! Same PLUS :: -200 10th
  ** :: CAPOFFSET :: 382th :: FWD :: 125 :: REV :: 124 :: NEW GAIN :: -200 :: 10 :: 167

     !!! Same PLUS :: -190 11th
  ** :: CAPOFFSET :: 383th :: FWD :: 125 :: REV :: 124 :: NEW GAIN :: -190 :: 10 :: 167

     !!! Same PLUS :: -180 12th
  ** :: CAPOFFSET :: 384th :: FWD :: 125 :: REV :: 124 :: NEW GAIN :: -180 :: 10 :: 167

     !!! Same PLUS :: -170 13th
  ** :: CAPOFFSET :: 385th :: FWD :: 125 :: REV :: 124 :: NEW GAIN :: -170 :: 10 :: 167

     !!! Same PLUS :: -160 14th
  ** :: CAPOFFSET :: 386th :: FWD :: 125 :: REV :: 124 :: NEW GAIN :: -160 :: 10 :: 167

     !!! Same PLUS :: -150 15th
  ** :: CAPOFFSET :: 387th :: FWD :: 125 :: REV :: 124 :: NEW GAIN :: -150 :: 10 :: 167

     !!! Same PLUS :: -140 16th
  ** :: CAPOFFSET :: 388th :: FWD :: 125 :: REV :: 124 :: NEW GAIN :: -140 :: 10 :: 167

     !!! Same PLUS :: -130 17th
  ** :: CAPOFFSET :: 389th :: FWD :: 125 :: REV :: 124 :: NEW GAIN :: -130 :: 10 :: 167

     !!! Same PLUS :: -120 18th
  ** :: CAPOFFSET :: 390th :: FWD :: 125 :: REV :: 124 :: NEW GAIN :: -120 :: 10 :: 167

     !!! Same PLUS :: -110 19th
  ** :: CAPOFFSET :: 391th :: FWD :: 125 :: REV :: 124 :: NEW GAIN :: -110 :: 10 :: 167

     !!! Same PLUS :: -100 20th
  ** :: CAPOFFSET :: 392th :: FWD :: 125 :: REV :: 124 :: NEW GAIN :: -100 :: 10 :: 167

     !!! Same PLUS :: -90 21th
  ** :: CAPOFFSET :: 393th :: FWD :: 125 :: REV :: 124 :: NEW GAIN :: -90 :: 10 :: 167

     !!! Same PLUS :: -80 22th
  ** :: CAPOFFSET :: 394th :: FWD :: 125 :: REV :: 124 :: NEW GAIN :: -80 :: 10 :: 167

     !!! Same PLUS :: -70 23th
  ** :: CAPOFFSET :: 395th :: FWD :: 125 :: REV :: 124 :: NEW GAIN :: -70 :: 10 :: 167

     !!! Same PLUS :: -60 24th
  ** :: CAPOFFSET :: 396th :: FWD :: 125 :: REV :: 124 :: NEW GAIN :: -60 :: 10 :: 167

     !!! Same PLUS :: -50 25th
  ** :: CAPOFFSET :: 397th :: FWD :: 125 :: REV :: 124 :: NEW GAIN :: -50 :: 10 :: 167

     !!! Same PLUS :: -40 26th
  ** :: CAPOFFSET :: 398th :: FWD :: 125 :: REV :: 124 :: NEW GAIN :: -40 :: 10 :: 167

     !!! Same PLUS :: -30 27th
  ** :: CAPOFFSET :: 399th :: FWD :: 125 :: REV :: 124 :: NEW GAIN :: -30 :: 10 :: 167

     !!! Same PLUS :: -20 28th
  ** :: CAPOFFSET :: 400th :: FWD :: 125 :: REV :: 124 :: NEW GAIN :: -20 :: 10 :: 167

     !!! Same PLUS :: -10 29th
  ** :: CAPOFFSET :: 401th :: FWD :: 125 :: REV :: 124 :: NEW GAIN :: -10 :: 10 :: 167

     !!! Same PLUS :: 0 30th
  ** :: CAPOFFSET :: 402th :: FWD :: 125 :: REV :: 124 :: NEW GAIN :: 0 :: 10 :: 167

     !!! Same PLUS :: Change Direction -20 30th
  ** :: CAPOFFSET :: 403th :: FWD :: 125 :: REV :: 124 :: NEW GAIN :: -20 :: 10 :: 167

     !!! Same MINUS :: -30 1th
  ** :: CAPOFFSET :: 404th :: FWD :: 125 :: REV :: 124 :: NEW GAIN :: -30 :: 10 :: 167

     !!! Same MINUS :: -40 2th
  ** :: CAPOFFSET :: 405th :: FWD :: 125 :: REV :: 124 :: NEW GAIN :: -40 :: 10 :: 167

     !!! Same MINUS :: -50 3th
  ** :: CAPOFFSET :: 406th :: FWD :: 125 :: REV :: 124 :: NEW GAIN :: -50 :: 10 :: 167

     !!! Same MINUS :: -60 4th
  ** :: CAPOFFSET :: 407th :: FWD :: 125 :: REV :: 124 :: NEW GAIN :: -60 :: 10 :: 167

     !!! Same MINUS :: -70 5th
  ** :: CAPOFFSET :: 408th :: FWD :: 125 :: REV :: 124 :: NEW GAIN :: -70 :: 10 :: 167

     !!! Same MINUS :: -80 6th
  ** :: CAPOFFSET :: 409th :: FWD :: 125 :: REV :: 124 :: NEW GAIN :: -80 :: 10 :: 167

     !!! Same MINUS :: -90 7th
  ** :: CAPOFFSET :: 410th :: FWD :: 125 :: REV :: 124 :: NEW GAIN :: -90 :: 10 :: 167

     !!! Same MINUS :: -100 8th
  ** :: CAPOFFSET :: 411th :: FWD :: 125 :: REV :: 124 :: NEW GAIN :: -100 :: 10 :: 167

     !!! Same MINUS :: -110 9th
  ** :: CAPOFFSET :: 412th :: FWD :: 125 :: REV :: 124 :: NEW GAIN :: -110 :: 10 :: 167

     !!! Same MINUS :: -120 10th
  ** :: CAPOFFSET :: 413th :: FWD :: 125 :: REV :: 124 :: NEW GAIN :: -120 :: 10 :: 167

     !!! Same MINUS :: -130 11th
  ** :: CAPOFFSET :: 414th :: FWD :: 125 :: REV :: 124 :: NEW GAIN :: -130 :: 10 :: 167

     !!! Same MINUS :: -140 12th
  ** :: CAPOFFSET :: 415th :: FWD :: 125 :: REV :: 124 :: NEW GAIN :: -140 :: 10 :: 167

     !!! Same MINUS :: -150 13th
  ** :: CAPOFFSET :: 416th :: FWD :: 125 :: REV :: 124 :: NEW GAIN :: -150 :: 10 :: 167

     !!! Same MINUS :: -160 14th
  ** :: CAPOFFSET :: 417th :: FWD :: 125 :: REV :: 124 :: NEW GAIN :: -160 :: 10 :: 167

     !!! Same MINUS :: -170 15th
  ** :: CAPOFFSET :: 418th :: FWD :: 125 :: REV :: 124 :: NEW GAIN :: -170 :: 10 :: 167

     !!! Same MINUS :: -180 16th
  ** :: CAPOFFSET :: 419th :: FWD :: 125 :: REV :: 124 :: NEW GAIN :: -180 :: 10 :: 167

     !!! Same MINUS :: -190 17th
  ** :: CAPOFFSET :: 420th :: FWD :: 125 :: REV :: 124 :: NEW GAIN :: -190 :: 10 :: 167

     !!! Same MINUS :: -200 18th
  ** :: CAPOFFSET :: 421th :: FWD :: 125 :: REV :: 124 :: NEW GAIN :: -200 :: 10 :: 167

     !!! Same MINUS :: -210 19th
  ** :: CAPOFFSET :: 422th :: FWD :: 125 :: REV :: 124 :: NEW GAIN :: -210 :: 10 :: 167

     !!! Same MINUS :: -220 20th
  ** :: CAPOFFSET :: 423th :: FWD :: 125 :: REV :: 124 :: NEW GAIN :: -220 :: 10 :: 167

     !!! Same MINUS :: -230 21th
  ** :: CAPOFFSET :: 424th :: FWD :: 125 :: REV :: 124 :: NEW GAIN :: -230 :: 10 :: 167

     !!! Same MINUS :: -240 22th
  ** :: CAPOFFSET :: 425th :: FWD :: 125 :: REV :: 124 :: NEW GAIN :: -240 :: 10 :: 167

     !!! Same MINUS :: -250 23th
  ** :: CAPOFFSET :: 426th :: FWD :: 125 :: REV :: 124 :: NEW GAIN :: -250 :: 10 :: 167

     !!! Same MINUS :: -260 24th
  ** :: CAPOFFSET :: 427th :: FWD :: 125 :: REV :: 124 :: NEW GAIN :: -260 :: 10 :: 167

     !!! Same MINUS :: -270 25th
  ** :: CAPOFFSET :: 428th :: FWD :: 125 :: REV :: 124 :: NEW GAIN :: -270 :: 10 :: 167

     !!! Same MINUS :: -280 26th
  ** :: CAPOFFSET :: 429th :: FWD :: 125 :: REV :: 124 :: NEW GAIN :: -280 :: 10 :: 167

     !!! Same MINUS :: -290 27th
  ** :: CAPOFFSET :: 430th :: FWD :: 125 :: REV :: 124 :: NEW GAIN :: -290 :: 10 :: 167

 STOP ALL DEVICE
########################################
######## ESC RESET ##########################
########################################