<?xml version="1.0" encoding="utf-8"?>
<!-- Generator: Adobe Illustrator 19.0.1, SVG Export Plug-In . SVG Version: 6.00 Build 0)  -->
<svg version="1.1" id="Layer_1" xmlns="http://www.w3.org/2000/svg" xmlns:xlink="http://www.w3.org/1999/xlink" x="0px" y="0px"
	 viewBox="0 0 1000 1000" enable-background="new 0 0 1000 1000" xml:space="preserve">
<rect x="0" y="0" fill="#ffffff" width="1000" height="1000"/>
<polygon id="XMLID_1_" opacity="0.6" fill="#000000" points="950,1000 0,1000 0,0 1000,0 1000,950 "/>
</svg>
