{
  "id": "namr-store",
  "version": "1.0.2",
  "meta": {
    "label": "namR store",
    "description": "This plugin recipe gives you a simple way to access namR store datasets",
    "author": "Valentin Lecoq-Vallon",
    "icon": "icon-globe",
    "tags": [],
    "url": "https://www.dataiku.com/product/plugins/namr-store/",
    "licenseInfo": "Apache Software License"
  }
}