<svg height="60" viewBox="-60 0 512 512" width="60" xmlns="http://www.w3.org/2000/svg">
    <path d="m391.5 195.75c0 39.300781-11.75 77.308594-33.96875 109.941406-13.980469 20.519532-31.460938 37.980469-51.621094 51.707032-10.71875 7.300781-22.199218 13.550781-34.300781 18.640624l-52.917969 120.949219c-3.960937 9.082031-12.921875 14.960938-22.820312 15.011719h-.121094c-9.949219 0-18.960938-5.890625-22.941406-15.019531l-52.917969-120.941407c-11.941406-5.019531-23.269531-11.167968-33.859375-18.339843-20.339844-13.777344-37.980469-31.339844-52.0625-52.007813-22.21875-32.632812-33.96875-70.640625-33.96875-109.941406 0-107.941406 87.808594-195.75 195.75-195.75h.121094c107.890625.0703125 195.628906 87.851562 195.628906 195.75zm0 0" fill="#d1dee8" />
    <path d="m391.5 195.75c0 39.300781-11.75 77.308594-33.96875 109.941406-13.980469 20.519532-31.460938 37.980469-51.621094 51.707032-10.71875 7.300781-22.199218 13.550781-34.300781 18.640624l-52.917969 120.949219c-3.960937 9.082031-12.921875 14.960938-22.820312 15.011719v-512c107.890625.0703125 195.628906 87.851562 195.628906 195.75zm0 0" fill="#9fb1bc" />
    <path d="m306.078125 357.109375c-10.699219 7.332031-22.15625 13.609375-34.25 18.730469l-52.597656 121.089844c-3.960938 9.128906-12.949219 15.039062-22.902344 15.070312-.148437 0-.296875 0-.457031-.011719-9.769532-.136719-18.582032-5.96875-22.519532-14.949219l-53.242187-120.800781c-11.949219-4.988281-23.300781-11.109375-33.910156-18.25-.9375-8.429687-1.578125-16.117187-1.589844-21.566406-.019531-5.671875.359375-11.25 1.089844-16.703125 7.589843-56.519531 53.910156-100.199219 109.859375-100.347656h.3125c55.839844.007812 101.820312 43.449218 109.96875 99.859375.789062 5.429687 1.21875 10.96875 1.28125 16.609375.058594 4.511718-.210938 12.082031-1.042969 21.269531zm0 0" fill="#ff664d" />
    <path d="m258.898438 136.109375c.089843 34.921875-28.148438 63.429687-63.027344 63.71875h-.359375c-35.050781.09375-63.640625-28.339844-63.730469-63.386719-.089844-35.050781 28.347656-63.632812 63.390625-63.722656.238281 0 .46875 0 .699219.011719 34.730468.269531 62.9375 28.558593 63.027344 63.378906zm0 0" fill="#ff664d" />
    <g fill="#dd311b">
        <path d="m195.871094 199.828125v-127.097656c34.730468.269531 62.9375 28.558593 63.027344 63.378906.089843 34.921875-28.148438 63.429687-63.027344 63.71875zm0 0" />
        <path d="m306.078125 357.109375c-10.699219 7.332031-22.15625 13.609375-34.25 18.730469l-52.597656 121.089844c-3.960938 9.128906-12.949219 15.039062-22.902344 15.070312-.148437 0-.296875 0-.457031-.011719v-292.617187c55.839844.007812 101.820312 43.449218 109.96875 99.859375.789062 5.429687 1.21875 10.96875 1.28125 16.609375.058594 4.511718-.210938 12.082031-1.042969 21.269531zm0 0" />
    </g>
</svg>