{
    "type": "service_account",
    "project_id": "ecomfainalproject",
    "private_key_id": "80e0324ca491f74a86713f912f303f4a6e5ce051",
    "private_key": "-----BEGIN PRIVATE KEY-----\nMIIEvgIBADANBgkqhkiG9w0BAQEFAASCBKgwggSkAgEAAoIBAQCm5shG291D56uK\n/Pp/a/gfAHPoCQGeHXWruHBf7mzJRXLbF8VhiyD0B/dJFALjiGlheABg0ejg5rQ0\n3HbBD2GIfJV3w5yZTpMrzj3j1oF16A+DTbUtmrEbV+Gpypg6qJ+bTMRnRMod1x+s\nN2b27wh35/Kk6XxBN9N7b0TzBSet/5VV1MpnZrgqT2aUt2P4xCI9WhFhp5YkBmEx\n6RzPWqA40ROLVbBQsAV9x5jervifkcevl7/ICEh1WbdUeGKk75GSleWSypSgmYP7\nT6rBPbvau1ssMxgY+1vFh3enR6uHE5Sb80qvPsoGtyDn1m0616DsDscf56bGexJb\nG+sSBrS5AgMBAAECggEABCKaKjVG12idRbGMZE1QxbXdaU2V0mzQ7ksAz8Oowtjb\nZmXBoG/RxnIPFKqwAqKt17ohKkTxI+dbZibjM1fV9wt9KY05a0v41gBDZMp7BSiV\nf8+UUlevlSmZf/syx9tHLxIZGKTp7BDZKktqG+qit1PSHXdienwvW3LPjsTdLZCq\nC3xAtW/Ye1sQ6bkL67UdY4dtowRgNIG+7Fji9s9/9mYICspaYXlnni/KJb2mxTj3\n2l3/d2UjGnxyKUwdM527PL0iJH4Oipk4AYxYK9PtZHB0kyp+k8jwMKyF1SGsM05O\nx0OZuI1gu4DiQCLfvTJ49+ekQKZmOrZRwo+/T2g77QKBgQDU46geemBTtExl4/9+\n7N4kz3GztRTznRixGxjS9g9qFe2jBj4/uADwPyMdaJpK/ogzLSgYahpgK3R+QIyJ\noJh9bjTOulicU6PCi7rWjlsyAG8bm+vG+gsmgrkYOFxum1Mb/MhPy3IoGNu7ZJQq\n5cbdX8wDG3cl3QofTVWfp0PX7QKBgQDIsxVYxRbNReDn5GXPaDPb0zufn7i2zgpu\nr2Eg8cax4DMHEtgcyb/6OyYu/dFvQUzjj/qeHwvS09cCpZhJyUSJkFtupGLUSlFM\nzezEuJCZe2kjIFRJE1kOQwxpLxDdxtGad8WliE087We2i/MsScJrl9TaH2AWKJ2c\nZi5eyOqefQKBgQC2nHFhc2edZVMDM4e9wEDtImRN2k6WiXLcuHmavCaMwTKOXJSY\n46Uqb34Xg9qV6a+69kkmaB0n0R6kDYp/o5oqPZZencnUjooyHtmtoX7obSbhb+XX\nUDSwXAGZnP7sgZ/QqgzJJaJOcsRJAgV2ppLm4X2GTNDvUaOVJikEQd4YIQKBgFdA\n5CrvpHYhxyGJvmlpWAJd1zIScm+nLAnq3UNBWazDV+vfWW1KmNflFzieyIqhzRex\n5LcRsEY8KuHPtGF/yvgzdkyn0v+QP8AwVps/0j2n1ZGb4IjUjIcSxzaDa8W/Rijt\noVPR6iJu5AQM2++JMaktHTCnK1L23W69TbOPjdDRAoGBAJDddluXWK2RrX1YStat\nRm6kqF7AzsHGAZT+oXt21z6/dHuTYFKfwlOJyqErW9Aa12K2+zr9tS16JH8zgyEO\nJx3/LzdcjBZSHyo7j32Qn1s1R1L8JTfxGa4IXss/bo/nt0VP9bhORnos9zxBnA3x\nue7Y7sfQzsUUCLepa5/8e1MY\n-----END PRIVATE KEY-----\n",
    "client_email": "firebase-adminsdk-hkwo9@ecomfainalproject.iam.gserviceaccount.com",
    "client_id": "112176517496515442853",
    "auth_uri": "https://accounts.google.com/o/oauth2/auth",
    "token_uri": "https://oauth2.googleapis.com/token",
    "auth_provider_x509_cert_url": "https://www.googleapis.com/oauth2/v1/certs",
    "client_x509_cert_url": "https://www.googleapis.com/robot/v1/metadata/x509/firebase-adminsdk-hkwo9%40ecomfainalproject.iam.gserviceaccount.com"
}