{
  "metodePembayaran": [
    {
      "id": 1,
      "name": "BCA"
    },
    {
      "id": 2,
      "name": "BNI"
    },
    {
      "id": 3,
      "name": "GOPAY"
    },
    {
      "id": 4,
      "name": "OVO"
    }
  ]
}
