D:\Projet-devops-V2\back\src\main\java\com\FormationSpringBoot\GestionProduit\service\IServiceProduit.java
D:\Projet-devops-V2\back\src\main\java\com\FormationSpringBoot\GestionProduit\dao\ProduitRepository.java
D:\Projet-devops-V2\back\src\main\java\com\FormationSpringBoot\GestionProduit\controlleur\ProduitControlleur.java
D:\Projet-devops-V2\back\src\main\java\com\FormationSpringBoot\GestionProduit\restapicontroller\ProductRestAPI.java
D:\Projet-devops-V2\back\src\main\java\com\FormationSpringBoot\GestionProduit\entities\Categorie.java
D:\Projet-devops-V2\back\src\main\java\com\FormationSpringBoot\GestionProduit\GestionProduitApplication.java
D:\Projet-devops-V2\back\src\main\java\com\FormationSpringBoot\GestionProduit\service\ServiceProduit.java
D:\Projet-devops-V2\back\src\main\java\com\FormationSpringBoot\GestionProduit\entities\Produit.java
D:\Projet-devops-V2\back\src\main\java\com\FormationSpringBoot\GestionProduit\dao\CategorieRepository.java
D:\Projet-devops-V2\back\src\main\java\com\FormationSpringBoot\GestionProduit\service\IServiceCategorie.java
D:\Projet-devops-V2\back\src\main\java\com\FormationSpringBoot\GestionProduit\service\ServiceCategorie.java
