during wakeup:
Wakeup Latency, Response Time, Execution Time
36,954,918
22,939,917
21,938,917
22,938,916
21,938,917
21,938,917
21,936,915
21,937,916
23,940,917
21,936,915
21,936,915
21,937,916
21,937,916
22,938,916
22,938,916
21,937,916
22,939,917
24,940,916
22,939,917
20,936,916
21,937,916
21,937,916
21,937,916
21,937,916
during execution:
Wakeup Latency, Response Time, Execution Time
11,942,931
11,940,929
11,941,930
11,941,930
11,942,931
11,940,929
11,942,931
10,939,929
11,940,929
10,941,931
11,940,929
11,940,929
11,941,930
11,941,930
14,949,935
11,940,929
11,942,931
11,941,930
12,942,930
10,939,929
11,943,932
15,950,935
11,940,929
12,945,933
11,941,930
11,940,929
14,944,130
11,942,931
11,940,929
10,940,930
10,940,930
10,939,929
10,940,930
10,939,929
10,941,931
10,940,930
10,942,932
10,947,937
11,942,931
10,940,930
11,942,931
10,942,932
10,941,931
10,942,932
11,940,929
10,942,932
11,941,931
10,941,931
11,941,930
10,939,929
11,942,931
10,940,930
11,941,930
11,943,932
10,941,931
10,940,930
12,943,931
10,939,929
11,942,931
10,940,930
11,941,930
10,941,931
10,941,931
11,941,930
9,940,931
11,941,930
10,941,931
11,940,929
10,940,930
9,940,931
11,940,929
11,942,931
11,941,930
11,941,930
11,941,930
11,942,931
11,942,931
11,940,929

task migration:
Wakeup Latency, Response Time, Execution Time
14,950,936