G40	; disable tool radius compensation
G49	; disable tool length compensation
G80	; cancel modal motion
G54	; select coordinate system 1
G90	; disable incremental moves
G21	; metric
F300	; set feedrate
S1000	; set spindle speed
G61	; exact path mode
M3	; start spindle
G04 P3.0	; wait for 3.0 seconds
G0 X13.795900 Y2.001395 Z25.000000
F100	; set feedrate
G1 Z0.000000
F300	; set feedrate
G1 X13.788900 Y2.000705
  X13.768400 Y1.999995
  X13.745600 Y2.001735
  X13.729900 Y2.006065
  X13.724200 Y2.010785
  Y2.019525
  X13.703400 Y2.040955
  X13.646700 Y2.103675
  X13.562600 Y2.191345
  X13.485600 Y2.269245
  X13.459600 Y2.294915
  X13.433700 Y2.320845
  X13.356600 Y2.399355
  X13.272600 Y2.487415
  X13.215700 Y2.549915
  X13.195100 Y2.570635
  Y2.580285
  X13.188500 Y2.588595
  X13.169600 Y2.612455
  X13.139900 Y2.647715
  X13.100600 Y2.692855
  X13.053100 Y2.746465
  X12.998500 Y2.806955
  X12.938400 Y2.872825
  X12.890200 Y2.925285
  X12.873900 Y2.942645
  X12.841200 Y2.978075
  X12.742700 Y3.084465
  X12.622000 Y3.214885
  X12.525500 Y3.319445
  X12.478200 Y3.370595
  X12.466200 Y3.383625
  X12.457300 Y3.393335
  X12.432300 Y3.423765
  X12.404600 Y3.462395
  X12.386200 Y3.495055
  X12.379500 Y3.511765
  Y3.521915
  X12.374600 Y3.535745
  X12.361600 Y3.557885
  X12.342300 Y3.580715
  X12.324900 Y3.596675
  X12.318700 Y3.601285
  X12.307000 Y3.610235
  X12.274100 Y3.640135
  X12.209400 Y3.702305
  X12.132600 Y3.779455
  X12.051700 Y3.863165
  X11.974900 Y3.945145
  X11.910200 Y4.016875
  X11.865500 Y4.070035
  X11.848800 Y4.089735
  Y4.102965
  X11.829500 Y4.123145
  X11.776900 Y4.181635
  X11.699300 Y4.262805
  X11.628600 Y4.334415
  X11.604800 Y4.357955
  X11.580600 Y4.381665
  X11.509500 Y4.454145
  X11.431600 Y4.538085
  X11.378800 Y4.600895
  X11.359500 Y4.625375
  Y4.637895
  X11.353400 Y4.650985
  X11.336900 Y4.672465
  X11.312300 Y4.695465
  X11.290000 Y4.712455
  X11.282300 Y4.717445
  X11.273900 Y4.722815
  X11.250600 Y4.741265
  X11.220000 Y4.770345
  X11.194000 Y4.800995
  X11.179900 Y4.821825
  X11.176500 Y4.829315
  X11.172300 Y4.837885
  X11.145800 Y4.875425
  X11.084500 Y4.954915
  X11.001300 Y5.056745
  X10.929200 Y5.141765
  X10.904800 Y5.169705
  X10.876100 Y5.202635
  X10.789800 Y5.301265
  X10.701200 Y5.402385
  X10.634700 Y5.477855
  X10.585900 Y5.532445
  X10.550500 Y5.570845
  X10.524300 Y5.597925
  X10.502800 Y5.618315
  X10.487100 Y5.632265
  X10.481800 Y5.636815
  X10.476500 Y5.641375
  X10.461100 Y5.655535
  X10.444000 Y5.673275
  X10.432200 Y5.687925
  X10.427900 Y5.695095
  Y5.697485
  X10.427600 Y5.699855
  X10.417000 Y5.715425
  X10.389200 Y5.751515
  X10.348700 Y5.800495
  X10.312100 Y5.843265
  X10.299800 Y5.857305
  X10.273000 Y5.887855
  X10.193100 Y5.979425
  X10.124900 Y6.058535
  X10.082500 Y6.110085
  X10.060200 Y6.139425
  X10.053200 Y6.149415
  X10.039300 Y6.169055
  X9.994000 Y6.225525
  X9.919000 Y6.313035
  X9.845200 Y6.392845
  X9.803400 Y6.434735
  X9.790000 Y6.445745
  X9.766400 Y6.465425
  X9.696000 Y6.525055
  X9.627200 Y6.586585
  X9.568500 Y6.644585
  X9.520400 Y6.695785
  X9.504700 Y6.713105
  X9.494200 Y6.724495
  X9.464900 Y6.760465
  X9.432500 Y6.806265
  X9.410700 Y6.845055
  X9.402700 Y6.864895
  Y6.876195
  X9.398400 Y6.890025
  X9.386700 Y6.907055
  X9.369600 Y6.920845
  X9.354400 Y6.928055
  X9.349100 Y6.929355
  X9.333100 Y6.933375
  X9.291100 Y6.968635
  X9.228400 Y7.044745
  X9.178000 Y7.132805
  X9.157500 Y7.189015
  Y7.212775
  X9.154300 Y7.227805
  X9.145800 Y7.239635
  X9.133100 Y7.242455
  X9.121000 Y7.237785
  X9.117700 Y7.235235
  X9.114000 Y7.232785
  X9.099800 Y7.230135
  X9.081100 Y7.236645
  X9.063700 Y7.253525
  X9.052500 Y7.272565
  X9.049900 Y7.279345
  X9.046100 Y7.289335
  X9.025600 Y7.320695
  X8.979800 Y7.379605
  X8.918700 Y7.448395
  X8.866700 Y7.501995
  X8.848800 Y7.519205
  X8.830800 Y7.536395
  X8.779300 Y7.590425
  X8.718300 Y7.661885
  X8.672100 Y7.725095
  X8.651500 Y7.759765
  X8.647700 Y7.771485
  X8.644100 Y7.782385
  X8.627600 Y7.813145
  X8.593200 Y7.863925
  X8.549600 Y7.917405
  X8.514200 Y7.955105
  X8.501700 Y7.966905
  X8.489800 Y7.978005
  X8.455800 Y8.012905
  X8.418100 Y8.056405
  X8.392600 Y8.092405
  X8.383200 Y8.110005
  Y8.120605
  X8.378700 Y8.135105
  X8.366600 Y8.157905
  X8.348600 Y8.181705
  X8.332300 Y8.198905
  X8.326400 Y8.204005
  X8.319200 Y8.210205
  X8.298600 Y8.229805
  X8.263600 Y8.265005
  X8.225800 Y8.304805
  X8.198900 Y8.334605
  X8.190200 Y8.344705
  X8.179900 Y8.356605
  X8.148900 Y8.392105
  X8.096100 Y8.452805
  X8.038600 Y8.518805
  X7.997220 Y8.566105
  X7.983440 Y8.581805
  X7.968740 Y8.598505
  X7.927670 Y8.650905
  X7.868750 Y8.733705
  X7.813740 Y8.819305
  X7.779890 Y8.877305
  X7.769680 Y8.897205
  X7.760030 Y8.916805
  X7.726930 Y8.973505
  X7.673760 Y9.053205
  X7.617240 Y9.126805
  X7.578440 Y9.171405
  X7.564390 Y9.185005
  X7.552240 Y9.196705
  X7.518000 Y9.233905
  X7.480350 Y9.281505
  X7.455070 Y9.322605
  X7.445850 Y9.344505
  Y9.358005
  X7.439820 Y9.376305
  X7.423490 Y9.405905
  X7.399400 Y9.436605
  X7.377810 Y9.458405
  X7.370000 Y9.464805
  X7.361150 Y9.472205
  X7.336850 Y9.496805
  X7.302180 Y9.537805
  X7.270110 Y9.582505
  X7.250320 Y9.614805
  X7.244720 Y9.626005
  X7.238810 Y9.637005
  X7.219930 Y9.669205
  X7.191290 Y9.714105
  X7.162040 Y9.755405
  X7.142740 Y9.780005
  X7.135740 Y9.787605
  X7.129650 Y9.794405
  X7.113430 Y9.816605
  X7.094990 Y9.847605
  X7.082510 Y9.876805
  X7.077900 Y9.894605
  Y9.906505
  X7.073500 Y9.924205
  X7.061570 Y9.951805
  X7.043610 Y9.980005
  X7.027440 Y9.999505
  X7.021420 Y10.005305
  X7.013610 Y10.013105
  X6.990280 Y10.036605
  X6.961960 Y10.065905
  X6.935260 Y10.094805
  X6.909280 Y10.125005
  X6.882900 Y10.158205
  X6.855080 Y10.196105
  X6.824750 Y10.240105
  X6.790940 Y10.291905
  X6.752600 Y10.353305
  X6.708650 Y10.425905
  X6.658030 Y10.511305
  X6.599760 Y10.611005
  X6.532760 Y10.726905
  X6.455990 Y10.860505
  X6.368380 Y11.013405
  X6.293780 Y11.143905
  X6.268970 Y11.187405
  X6.251240 Y11.218505
  X6.194860 Y11.309905
  X6.118920 Y11.422905
  X6.050130 Y11.513905
  X6.011370 Y11.558805
  X5.997650 Y11.570505
  X5.986920 Y11.579705
  X5.957890 Y11.610805
  X5.925500 Y11.655805
  X5.903690 Y11.700105
  X5.895710 Y11.729205
  Y11.748805
  X5.889150 Y11.778605
  X5.871310 Y11.825805
  X5.844930 Y11.874705
  X5.821600 Y11.908605
  X5.812820 Y11.919005
  X5.803320 Y11.930705
  X5.777710 Y11.967905
  X5.742880 Y12.026405
  X5.712390 Y12.087505
  X5.694970 Y12.129505
  X5.690420 Y12.143805
  X5.686180 Y12.157005
  X5.671860 Y12.195705
  X5.651420 Y12.244705
  X5.631440 Y12.284905
  X5.619400 Y12.305105
  X5.614570 Y12.310705
  X5.600080 Y12.327105
  X5.558470 Y12.384305
  X5.487510 Y12.490105
  X5.417420 Y12.603605
  X5.376070 Y12.675805
  X5.363760 Y12.700405
  X5.358390 Y12.711005
  X5.341890 Y12.742205
  X5.319430 Y12.783205
  X5.298820 Y12.818605
  X5.286870 Y12.837905
  X5.282600 Y12.844005
  X5.263610 Y12.871505
  X5.189010 Y12.995405
  X5.131670 Y13.119405
  X5.121350 Y13.147105
  X5.116850 Y13.159605
  X5.101760 Y13.196805
  X5.080220 Y13.243805
  X5.059240 Y13.282605
  X5.046430 Y13.302505
  X5.041280 Y13.308305
  X5.031780 Y13.319605
  X5.007690 Y13.357005
  X4.964180 Y13.432805
  X4.914260 Y13.528305
  X4.861580 Y13.635805
  X4.809780 Y13.748105
  X4.762360 Y13.857105
  X4.722970 Y13.955605
  X4.701380 Y14.015405
  X4.695250 Y14.035705
  X4.688900 Y14.057905
  X4.666760 Y14.123505
  X4.629760 Y14.221105
  X4.589350 Y14.317005
  X4.560920 Y14.378305
  X4.550610 Y14.398305
  X4.526960 Y14.444605
  X4.460000 Y14.585605
  X4.377060 Y14.774305
  X4.309670 Y14.946505
  X4.274720 Y15.048505
  X4.265560 Y15.083105
  X4.261060 Y15.100705
  X4.244570 Y15.154605
  X4.211680 Y15.254705
  X4.171600 Y15.370405
  X4.139850 Y15.459005
  X4.129000 Y15.488505
  X4.116100 Y15.523505
  X4.079580 Y15.629305
  X4.020880 Y15.807405
  X3.960000 Y15.999905
  X3.917850 Y16.138105
  X3.904290 Y16.184205
  X3.894680 Y16.217205
  X3.866250 Y16.316305
  X3.830610 Y16.444005
  X3.795610 Y16.573605
  X3.759600 Y16.711505
  X3.720900 Y16.864205
  X3.677890 Y17.037905
  X3.628890 Y17.239205
  X3.586360 Y17.415605
  X3.572310 Y17.474305
  X3.567750 Y17.493205
  X3.555970 Y17.550105
  X3.539490 Y17.640305
  X3.524570 Y17.733305
  X3.515610 Y17.797205
  X3.513070 Y17.818605
  X3.510290 Y17.844005
  X3.498900 Y17.932805
  X3.475360 Y18.106305
  X3.445900 Y18.315405
  X3.421970 Y18.481305
  X3.413940 Y18.536405
  X3.400220 Y18.627205
  X3.368810 Y18.901305
  X3.337010 Y19.310005
  X3.318180 Y19.768105
  X3.312000 Y20.152005
  Y20.304605
  X3.314110 Y20.378905
  X3.320030 Y20.511105
  X3.328760 Y20.659305
  X3.336530 Y20.769605
  X3.339500 Y20.806305
  X3.342650 Y20.845305
  X3.352100 Y20.962405
  X3.365930 Y21.135605
  X3.379280 Y21.304605
  X3.387570 Y21.412405
  X3.390290 Y21.448305
  X3.392680 Y21.485305
  X3.402930 Y21.595805
  X3.422510 Y21.773505
  X3.445960 Y21.959005
  X3.463860 Y22.087805
  X3.470360 Y22.130605
  X3.480030 Y22.193505
  X3.509100 Y22.381905
  X3.545560 Y22.618905
  X3.579310 Y22.838605
  X3.609900 Y23.038905
  X3.637030 Y23.216805
  X3.660310 Y23.370105
  X3.679290 Y23.496305
  X3.690100 Y23.568505
  X3.693670 Y23.592505
  X3.701750 Y23.648205
  X3.731650 Y23.814605
  X3.783900 Y24.050005
  X3.853670 Y24.313105
  X3.920940 Y24.542105
  X3.944490 Y24.617905
  X3.956100 Y24.655005
  X3.990000 Y24.766105
  X4.027220 Y24.893205
  X4.052400 Y24.985805
  X4.061620 Y25.019005
  Y25.035105
  X4.066500 Y25.050605
  X4.080500 Y25.091805
  X4.102310 Y25.150705
  X4.130740 Y25.224505
  X4.164540 Y25.310005
  X4.202570 Y25.404305
  X4.243470 Y25.504705
  X4.286180 Y25.608105
  X4.329360 Y25.711705
  X4.371900 Y25.812205
  X4.412470 Y25.907105
  X4.449920 Y25.993205
  X4.482960 Y26.067605
  X4.510460 Y26.127505
  X4.531180 Y26.169905
  X4.540030 Y26.186805
  X4.543880 Y26.191705
  X4.548390 Y26.197905
  X4.568400 Y26.232105
  X4.611040 Y26.308805
  X4.665460 Y26.410805
  X4.710760 Y26.498605
  X4.725570 Y26.527905
  X4.745170 Y26.565705
  X4.807220 Y26.677205
  X4.918220 Y26.869205
  X5.044210 Y27.078805
  X5.138610 Y27.231105
  X5.170780 Y27.281405
  X5.213150 Y27.348105
  X5.346670 Y27.543905
  X5.546920 Y27.819205
  X5.762530 Y28.096905
  X5.984580 Y28.366505
  X6.203990 Y28.617405
  X6.411830 Y28.839005
  X6.599110 Y29.020605
  X6.715540 Y29.121405
  X6.756880 Y29.151505
  X6.770880 Y29.161905
  X6.810970 Y29.195805
  X6.878790 Y29.256805
  X6.951810 Y29.327105
  X7.004330 Y29.380105
  X7.021420 Y29.398205
  X7.044150 Y29.422605
  X7.118970 Y29.490305
  X7.268000 Y29.614705
  X7.454580 Y29.761405
  X7.664810 Y29.920005
  X7.884810 Y30.080305
  X8.100600 Y30.231805
  X8.298400 Y30.364405
  X8.422200 Y30.443105
  X8.464300 Y30.467805
  X8.559100 Y30.523105
  X8.848200 Y30.681105
  X9.232300 Y30.873805
  X9.606400 Y31.041105
  X9.871200 Y31.147005
  X9.960800 Y31.178605
  X9.977800 Y31.184705
  X10.029000 Y31.203305
  X10.088700 Y31.226405
  X10.133300 Y31.245005
  X10.153100 Y31.254605
  X10.156600 Y31.257205
  X10.168300 Y31.265705
  X10.209500 Y31.282405
  X10.306600 Y31.316705
  X10.437300 Y31.357105
  X10.591300 Y31.400805
  X10.757800 Y31.445005
  X10.926600 Y31.486705
  X11.087000 Y31.522905
  X11.193100 Y31.544605
  X11.228700 Y31.550805
  X11.344200 Y31.571305
  X11.692700 Y31.622605
  X12.135500 Y31.669905
  X12.559600 Y31.692105
  X12.967400 Y31.689505
  X13.361400 Y31.661805
  X13.743900 Y31.609005
  X14.117600 Y31.531105
  X14.393900 Y31.457005
  X14.484800 Y31.428105
  X14.556600 Y31.405305
  X14.770900 Y31.333205
  X15.024500 Y31.239405
  X15.255500 Y31.141805
  X15.473100 Y31.035305
  X15.687300 Y30.914605
  X15.907600 Y30.774905
  X16.143400 Y30.611005
  X16.339800 Y30.467005
  X16.404600 Y30.418105
  X16.444800 Y30.387505
  X16.561300 Y30.290405
  X16.726000 Y30.140805
  X16.892300 Y29.976405
  X17.053400 Y29.804605
  X17.202700 Y29.632605
  X17.333500 Y29.467805
  X17.439500 Y29.317505
  X17.497600 Y29.222205
  X17.513800 Y29.188905
  X17.519100 Y29.178505
  X17.536200 Y29.147505
  X17.559800 Y29.107405
  X17.581900 Y29.073205
  X17.594600 Y29.055105
  X17.599500 Y29.049605
  X17.605900 Y29.042405
  X17.622400 Y29.018505
  X17.652800 Y28.969505
  X17.689200 Y28.905005
  X17.730800 Y28.827805
  X17.776000 Y28.740305
  X17.823700 Y28.645105
  X17.872700 Y28.545005
  X17.921600 Y28.442405
  X17.969500 Y28.340005
  X18.014900 Y28.240405
  X18.056700 Y28.146305
  X18.093700 Y28.060005
  X18.124500 Y27.984305
  X18.148100 Y27.921805
  X18.163300 Y27.875005
  X18.168500 Y27.853805
  Y27.835705
  X18.188100 Y27.803205
  X18.242700 Y27.811105
  X18.325900 Y27.867205
  X18.406700 Y27.941405
  X18.431700 Y27.967905
  X18.441000 Y27.978105
  X18.469800 Y28.007405
  X18.522600 Y28.058605
  X18.587600 Y28.119905
  X18.662300 Y28.188905
  X18.744400 Y28.263305
  X18.831300 Y28.341305
  X18.920900 Y28.420405
  X18.988100 Y28.479205
  X19.010600 Y28.498605
  X19.043000 Y28.526505
  X19.140300 Y28.609705
  X19.252000 Y28.703205
  X19.351600 Y28.783605
  X19.445200 Y28.855605
  X19.539100 Y28.923905
  X19.639400 Y28.992805
  X19.752300 Y29.067205
  X19.851000 Y29.130705
  X19.884100 Y29.151505
  X19.984200 Y29.215405
  X20.292300 Y29.395405
  X20.713700 Y29.616805
  X21.130900 Y29.807505
  X21.426400 Y29.925005
  X21.526600 Y29.959005
  X21.576900 Y29.976105
  X21.729800 Y30.021505
  X21.959900 Y30.080605
  X22.208800 Y30.134905
  X22.468300 Y30.182805
  X22.730100 Y30.223205
  X22.986300 Y30.254605
  X23.228800 Y30.275405
  X23.394100 Y30.283605
  X23.449200 Y30.284305
  X23.492100 Y30.285105
  X23.621000 Y30.283205
  X23.821900 Y30.275305
  X24.040300 Y30.261505
  X24.265200 Y30.243105
  X24.484900 Y30.221105
  X24.688000 Y30.196505
  X24.863400 Y30.170405
  X24.965600 Y30.151805
  X24.999400 Y30.143905
  X25.092400 Y30.121805
  X25.368800 Y30.043605
  X25.727100 Y29.920405
  X26.073900 Y29.774905
  X26.408300 Y29.607405
  X26.729400 Y29.418105
  X27.036300 Y29.207605
  X27.328500 Y28.976305
  X27.538400 Y28.789605
  X27.605300 Y28.724305
  X27.639800 Y28.690805
  X27.743100 Y28.590405
  X27.849900 Y28.485305
  X27.933800 Y28.399905
  X28.002700 Y28.324705
  X28.064900 Y28.250705
  X28.128300 Y28.168905
  X28.201200 Y28.069905
  X28.268900 Y27.975705
  X28.291400 Y27.944305
  X28.353800 Y27.858305
  X28.528800 Y27.591305
  X28.743500 Y27.218505
  X28.936600 Y26.823105
  X29.109100 Y26.402405
  X29.261900 Y25.953805
  X29.396400 Y25.474505
  X29.513500 Y24.961705
  X29.591900 Y24.550405
  X29.614400 Y24.412605
  X29.619100 Y24.383805
  X29.629800 Y24.296305
  X29.643400 Y24.149905
  X29.655200 Y23.977505
  X29.665200 Y23.783505
  X29.673400 Y23.571705
  X29.679500 Y23.346405
  X29.683900 Y23.111805
  X29.686300 Y22.872005
  X29.686700 Y22.631005
  X29.685200 Y22.393105
  X29.681600 Y22.162405
  X29.676000 Y21.942905
  X29.668200 Y21.738905
  X29.658400 Y21.554505
  X29.646400 Y21.393805
  X29.636700 Y21.294005
  X29.632400 Y21.261005
  X29.620900 Y21.170605
  X29.583500 Y20.899905
  X29.532100 Y20.565105
  X29.476600 Y20.249505
  X29.415300 Y19.945405
  X29.346700 Y19.645705
  X29.269500 Y19.342905
  X29.181900 Y19.030005
  X29.107800 Y18.781705
  X29.082400 Y18.699005
  X29.013900 Y18.477905
  X28.784200 Y17.821705
  X28.436200 Y16.959305
  X28.035300 Y16.106505
  X27.578500 Y15.257905
  X27.062600 Y14.407605
  X26.484400 Y13.550705
  X25.840900 Y12.681305
  X25.310800 Y12.012505
  X25.128800 Y11.793905
  X25.106600 Y11.767205
  X25.039800 Y11.687305
  X24.955700 Y11.587105
  X24.878500 Y11.495605
  X24.810200 Y11.415005
  X24.752600 Y11.347505
  X24.707600 Y11.295505
  X24.677100 Y11.261105
  X24.666600 Y11.249205
  X24.663100 Y11.246705
  X24.659600 Y11.244305
  X24.628900 Y11.212405
  X24.554600 Y11.131905
  X24.450800 Y11.017505
  X24.358900 Y10.915605
  X24.328400 Y10.881505
  X24.296900 Y10.846205
  X24.202100 Y10.740105
  X24.086700 Y10.610405
  X23.994500 Y10.507105
  X23.949500 Y10.457205
  X23.938200 Y10.444805
  X23.923400 Y10.428405
  X23.878100 Y10.379705
  X23.802100 Y10.299305
  X23.712300 Y10.205905
  X23.610600 Y10.101505
  X23.499500 Y9.988405
  X23.380700 Y9.868405
  X23.256700 Y9.743805
  X23.129400 Y9.616605
  X23.000700 Y9.489105
  X22.873300 Y9.363205
  X22.748800 Y9.241005
  X22.629400 Y9.124805
  X22.517300 Y9.016505
  X22.414600 Y8.918305
  X22.323400 Y8.832305
  X22.265300 Y8.778405
  X22.245900 Y8.760605
  X22.218000 Y8.735405
  X22.134900 Y8.658705
  X22.029200 Y8.559005
  X21.940100 Y8.473005
  X21.893500 Y8.426905
  X21.879400 Y8.412105
  X21.865300 Y8.397305
  X21.812300 Y8.346405
  X21.705500 Y8.247005
  X21.573300 Y8.127105
  X21.466200 Y8.031605
  X21.430300 Y8.000005
  X21.356200 Y7.935205
  X21.133800 Y7.740665
  X20.871000 Y7.511385
  X20.640500 Y7.311085
  X20.440800 Y7.138495
  X20.270600 Y6.992395
  X20.128500 Y6.871585
  X20.013000 Y6.774785
  X19.945500 Y6.719125
  X19.922800 Y6.700785
  X19.897100 Y6.680215
  X19.820900 Y6.617565
  X19.709900 Y6.524565
  X19.603400 Y6.433205
  X19.536600 Y6.374605
  X19.514600 Y6.354705
  X19.502600 Y6.343805
  X19.465700 Y6.311845
  X19.396300 Y6.253245
  X19.309800 Y6.181525
  X19.209200 Y6.099275
  X19.098000 Y6.009055
  X18.979200 Y5.913455
  X18.856200 Y5.815095
  X18.763300 Y5.741095
  X18.732300 Y5.716525
  X18.701600 Y5.692375
  X18.609900 Y5.619785
  X18.492000 Y5.526305
  X18.381400 Y5.438355
  X18.281200 Y5.358175
  X18.193800 Y5.287965
  X18.122400 Y5.230025
  X18.069900 Y5.186565
  X18.046600 Y5.166775
  X18.039100 Y5.159825
  X18.031900 Y5.153635
  X18.009900 Y5.135565
  X17.963500 Y5.098025
  X17.902300 Y5.049205
  X17.828500 Y4.990885
  X17.744600 Y4.925065
  X17.653000 Y4.853565
  X17.555900 Y4.778375
  X17.480900 Y4.720485
  X17.455900 Y4.701215
  X17.429100 Y4.680765
  X17.349100 Y4.619135
  X17.233700 Y4.529835
  X17.113400 Y4.436085
  X16.991600 Y4.340815
  X16.872300 Y4.246785
  X16.758800 Y4.156955
  X16.654900 Y4.074055
  X16.587000 Y4.019305
  X16.564500 Y4.000965
  X16.530500 Y3.973785
  X16.428000 Y3.893215
  X16.263900 Y3.766705
  X16.076900 Y3.624885
  X15.872000 Y3.471345
  X15.654100 Y3.309565
  X15.427800 Y3.143165
  X15.198500 Y2.975695
  X14.970800 Y2.810595
  X14.749600 Y2.651465
  X14.539900 Y2.501785
  X14.346400 Y2.365175
  X14.174400 Y2.245165
  X14.028200 Y2.145235
  X13.913300 Y2.068955
  X13.834100 Y2.019805
  X13.805800 Y2.002535
  X13.795900 Y2.001395
G0 Z25.000000
  X33.070600 Y28.049205
F100	; set feedrate
G1 Z0.000000
F300	; set feedrate
G1 X33.050100 Y28.051905
  X32.988900 Y28.060105
  X32.878700 Y28.075005
  X32.744500 Y28.092905
  X32.591400 Y28.113205
  X32.424400 Y28.135305
  X32.248200 Y28.158505
  X32.067800 Y28.182005
  X31.933000 Y28.199305
  X31.888100 Y28.205005
  X31.831900 Y28.212405
  X31.663400 Y28.234205
  X31.468500 Y28.259605
  X31.301300 Y28.281505
  X31.159600 Y28.300705
  X31.041600 Y28.317605
  X30.945100 Y28.332905
  X30.868000 Y28.346905
  X30.808100 Y28.360405
  X30.763700 Y28.373605
  X30.732300 Y28.387205
  X30.712100 Y28.401805
  X30.701000 Y28.417805
  X30.696900 Y28.435705
  X30.697700 Y28.456305
  X30.701400 Y28.479605
  X30.704900 Y28.499905
  X30.705900 Y28.506705
  X30.708000 Y28.521105
  X30.713200 Y28.564605
  X30.726700 Y28.678805
  X30.745600 Y28.842505
  X30.768900 Y29.048905
  X30.796200 Y29.291305
  X30.826400 Y29.562805
  X30.859100 Y29.856505
  X30.884600 Y30.088505
  X30.893300 Y30.165805
  X31.061400 Y31.694005
  X30.951000 Y31.721505
  X30.942400 Y31.723805
  X30.916600 Y31.728905
  X30.860900 Y31.739305
  X30.786600 Y31.752205
  X30.696900 Y31.766905
  X30.594400 Y31.783305
  X30.482100 Y31.800705
  X30.363100 Y31.818505
  X30.270900 Y31.831805
  X30.240200 Y31.836305
  X30.149600 Y31.849305
  X29.877700 Y31.888305
  X29.562800 Y31.933805
  X29.292100 Y31.972905
  X29.062400 Y32.006705
  X28.870300 Y32.035705
  X28.712300 Y32.060705
  X28.585200 Y32.082205
  X28.485600 Y32.101105
  X28.410300 Y32.117905
  X28.355900 Y32.133605
  X28.318900 Y32.148505
  X28.296200 Y32.163305
  X28.284400 Y32.179005
  X28.280100 Y32.196005
  X28.279800 Y32.215105
  X28.280500 Y32.231505
  Y32.248605
  X28.283800 Y32.283205
  X28.293100 Y32.377005
  X28.307600 Y32.511705
  X28.326700 Y32.681305
  X28.349500 Y32.879505
  X28.375300 Y33.100005
  X28.403400 Y33.336705
  X28.433000 Y33.582905
  X28.463100 Y33.832805
  X28.493400 Y34.079905
  X28.522800 Y34.317905
  X28.550700 Y34.540705
  X28.576400 Y34.741805
  X28.598900 Y34.915105
  X28.617700 Y35.054305
  X28.628100 Y35.128305
  X28.631900 Y35.152905
  X28.634600 Y35.170805
  X28.644800 Y35.223905
  X28.659800 Y35.285605
  X28.675200 Y35.331305
  X28.685300 Y35.351005
  X28.689800 Y35.354005
  X28.697700 Y35.360005
  X28.739500 Y35.356405
  X28.856900 Y35.346705
  X29.030100 Y35.326405
  X29.247300 Y35.297405
  X29.496600 Y35.261405
  X29.766200 Y35.219705
  X30.044100 Y35.174505
  X30.249900 Y35.139205
  X30.318500 Y35.127005
  X30.371400 Y35.117405
  X30.530600 Y35.090005
  X30.726600 Y35.058105
  X30.903000 Y35.031705
  X31.057000 Y35.010805
  X31.185500 Y34.996305
  X31.285100 Y34.988205
  X31.352700 Y34.987105
  X31.379200 Y34.988905
  X31.385300 Y34.993205
  X31.389500 Y34.996305
  X31.398700 Y35.014605
  X31.413000 Y35.056105
  X31.426400 Y35.111705
  X31.435300 Y35.159005
  X31.437600 Y35.174905
  X31.442800 Y35.214905
  X31.458000 Y35.334705
  X31.482300 Y35.535605
  X31.509400 Y35.767605
  X31.538000 Y36.021105
  X31.567100 Y36.286405
  X31.595500 Y36.553305
  X31.622000 Y36.812205
  X31.639900 Y36.993205
  X31.645600 Y37.053505
  X31.648900 Y37.086505
  X31.658900 Y37.185805
  X31.671900 Y37.312405
  X31.684100 Y37.430305
  X31.695300 Y37.536405
  X31.705200 Y37.627605
  X31.713500 Y37.701405
  X31.720100 Y37.754305
  X31.723000 Y37.776405
  X31.724400 Y37.783605
  X31.726700 Y37.794305
  X31.736900 Y37.851705
  X31.743100 Y37.900305
  X31.743400 Y37.906405
  X31.743700 Y37.911705
  X31.748900 Y37.927105
  X31.762400 Y37.950105
  X31.781400 Y37.972605
  X31.798000 Y37.987505
  X31.804100 Y37.991805
  X31.814100 Y37.999005
  X31.859200 Y38.000005
  X31.973800 Y37.995805
  X32.133700 Y37.981405
  X32.324600 Y37.958205
  X32.532000 Y37.928505
  X32.742000 Y37.894005
  X32.939900 Y37.856705
  X33.069100 Y37.828905
  X33.111900 Y37.818205
  X33.137300 Y37.811905
  X33.214400 Y37.795105
  X33.341700 Y37.769605
  X33.477700 Y37.745005
  X33.574400 Y37.729005
  X33.606700 Y37.724405
  X33.650300 Y37.717905
  X33.780900 Y37.697905
  X33.930800 Y37.674005
  X34.057400 Y37.652905
  X34.161400 Y37.634205
  X34.243900 Y37.617805
  X34.305600 Y37.603505
  X34.347400 Y37.591405
  X34.365100 Y37.584605
  X34.370200 Y37.581105
  X34.374900 Y37.577805
  X34.380200 Y37.535705
  X34.381700 Y37.429905
  X34.375100 Y37.279005
  X34.364800 Y37.143605
  X34.360300 Y37.098605
  X34.357700 Y37.071105
  X34.350100 Y36.988905
  X34.337300 Y36.852205
  X34.322400 Y36.694205
  X34.306000 Y36.520105
  X34.288500 Y36.335605
  X34.270600 Y36.146005
  X34.252600 Y35.956705
  X34.239400 Y35.819205
  X34.235100 Y35.773205
  X34.230900 Y35.728605
  X34.218400 Y35.594705
  X34.201700 Y35.420805
  X34.185700 Y35.255805
  X34.170600 Y35.104005
  X34.156900 Y34.970005
  X34.145100 Y34.857805
  X34.135600 Y34.771805
  X34.130700 Y34.730105
  X34.128900 Y34.716305
  X34.126900 Y34.701105
  X34.121300 Y34.655705
  X34.118300 Y34.608905
  X34.121000 Y34.573605
  X34.131300 Y34.547405
  X34.150500 Y34.527905
  X34.180100 Y34.512605
  X34.221400 Y34.499405
  X34.262600 Y34.489205
  X34.276300 Y34.485805
  X34.299600 Y34.480405
  X34.369900 Y34.466305
  X34.505300 Y34.440805
  X34.668900 Y34.411905
  X34.847300 Y34.381705
  X35.026600 Y34.352205
  X35.193700 Y34.325805
  X35.334800 Y34.305005
  X35.411200 Y34.294405
  X35.436600 Y34.291505
  X35.453400 Y34.289605
  X35.508400 Y34.281105
  X35.613100 Y34.263505
  X35.736700 Y34.240605
  X35.833300 Y34.221405
  X35.865300 Y34.214605
  X35.895300 Y34.208505
  X35.985300 Y34.189905
  X36.086700 Y34.169305
  X36.158700 Y34.155005
  X36.182600 Y34.149705
  X36.190500
  X36.193500 Y34.149405
  X36.217700 Y34.145805
  X36.275500 Y34.137005
  X36.355500 Y34.124605
  X36.426000 Y34.113505
  X36.449500 Y34.109905
  X36.688000 Y34.071105
  X36.660500 Y33.723905
  X36.658900 Y33.705405
  X36.654500 Y33.650005
  X36.646400 Y33.551805
  X36.636400 Y33.432405
  X36.624800 Y33.294605
  X36.611600 Y33.141505
  X36.597300 Y32.976305
  X36.582000 Y32.801705
  X36.566200 Y32.621005
  X36.549900 Y32.436905
  X36.533500 Y32.252805
  X36.517300 Y32.071405
  X36.501600 Y31.895805
  X36.486400 Y31.729205
  X36.472400 Y31.574305
  X36.459500 Y31.434505
  X36.450900 Y31.342905
  X36.448100 Y31.312405
  X36.445500 Y31.284205
  X36.435100 Y31.200105
  X36.418100 Y31.110305
  X36.395600 Y31.041005
  X36.366600 Y30.990705
  X36.329400 Y30.957805
  X36.282700 Y30.940405
  X36.225300 Y30.936905
  X36.173100 Y30.942505
  X36.156000 Y30.945805
  X36.128500 Y30.950805
  X36.046200 Y30.965005
  X35.892800 Y30.990405
  X35.709900 Y31.019605
  X35.511400 Y31.050405
  X35.311700 Y31.080805
  X35.124800 Y31.108505
  X34.964500 Y31.131305
  X34.875200 Y31.143305
  X34.845300 Y31.146805
  X34.816300 Y31.150405
  X34.729500 Y31.162605
  X34.580300 Y31.185305
  X34.417000 Y31.211405
  X34.298000 Y31.231105
  X34.258400 Y31.237905
  X34.206400 Y31.246705
  X34.049600 Y31.265605
  X33.902000 Y31.267605
  X33.814100 Y31.243805
  X33.784600 Y31.206405
  X33.784500 Y31.193805
  Y31.180305
  X33.779900 Y31.139505
  X33.767100 Y31.010005
  X33.748400 Y30.825005
  X33.731200 Y30.659205
  X33.725300 Y30.603905
  X33.722000 Y30.571405
  X33.712000 Y30.473605
  X33.696300 Y30.319705
  X33.678700 Y30.148205
  X33.659900 Y29.964405
  X33.640300 Y29.774205
  X33.620600 Y29.582905
  X33.601400 Y29.396505
  X33.587700 Y29.264505
  X33.583100 Y29.220405
  X33.574400 Y29.134405
  X33.547600 Y28.876705
  X33.518900 Y28.606405
  X33.495900 Y28.400405
  X33.477100 Y28.250005
  X33.461700 Y28.146405
  X33.448100 Y28.080305
  X33.435300 Y28.043205
  X33.426200 Y28.028905
  X33.421900 Y28.025805
  X33.417400 Y28.022805
  X33.384200 Y28.020605
  X33.305600 Y28.022905
  X33.197300 Y28.032205
  X33.102100 Y28.043305
  X33.070600 Y28.047805
  Y28.049205
G0 Z25.000000
  X12.032000 Y8.435405
F100	; set feedrate
G1 Z0.000000
F300	; set feedrate
G1 X12.050600 Y8.455505
  X12.106400 Y8.515705
  X12.176400 Y8.591905
  X12.240800 Y8.662305
  X12.297600 Y8.725005
  X12.345300 Y8.778505
  X12.382700 Y8.820905
  X12.407800 Y8.850505
  X12.417000 Y8.861405
  X12.419400 Y8.865405
  X12.422400 Y8.870305
  X12.439100 Y8.891105
  X12.476400 Y8.934805
  X12.526200 Y8.990405
  X12.568900 Y9.036505
  X12.583400 Y9.051705
  X12.597700 Y9.066805
  X12.640200 Y9.112605
  X12.689900 Y9.167605
  X12.727000 Y9.210805
  X12.743300 Y9.231405
  X12.746000 Y9.236205
  X12.749900 Y9.243105
  X12.765300 Y9.261705
  X12.807700 Y9.311905
  X12.869500 Y9.383305
  X12.947800 Y9.472305
  X13.039200 Y9.575305
  X13.140600 Y9.688805
  X13.248500 Y9.809105
  X13.360100 Y9.932805
  X13.471700 Y10.056305
  X13.580500 Y10.175805
  X13.683000 Y10.288005
  X13.776000 Y10.389205
  X13.856300 Y10.475805
  X13.920600 Y10.544405
  X13.965900 Y10.591205
  X13.982600 Y10.608205
  X13.988800 Y10.612705
  X13.995600 Y10.618005
  X14.014600 Y10.635805
  X14.043900 Y10.666805
  X14.073400 Y10.702205
  X14.093300 Y10.729005
  X14.099200 Y10.738305
  X14.106400 Y10.749705
  X14.139100 Y10.792005
  X14.208800 Y10.876705
  X14.298000 Y10.980805
  X14.371700 Y11.064805
  X14.396600 Y11.092505
  X14.422400 Y11.121205
  X14.499900 Y11.207605
  X14.599800 Y11.319305
  X14.684900 Y11.414705
  X14.729900 Y11.465105
  X14.744100 Y11.480905
  X14.758000 Y11.497005
  X14.800100 Y11.545005
  X14.876300 Y11.632205
  X14.963100 Y11.731305
  X15.028200 Y11.806005
  X15.049900 Y11.830805
  X15.072700 Y11.857205
  X15.141600 Y11.935705
  X15.241400 Y12.048505
  X15.337000 Y12.155405
  X15.396600 Y12.221105
  X15.416400 Y12.242905
  X15.433700 Y12.262105
  X15.484800 Y12.319705
  X15.550100 Y12.395005
  X15.604600 Y12.460005
  X15.633000 Y12.495105
  X15.641200 Y12.506405
  X15.649500 Y12.517805
  X15.680800 Y12.555005
  X15.743900 Y12.626405
  X15.821900 Y12.711005
  X15.884600 Y12.776805
  X15.905800 Y12.798505
  X15.927100 Y12.820405
  X15.990100 Y12.886805
  X16.068100 Y12.971705
  X16.131400 Y13.043305
  X16.163100 Y13.080705
  X16.171900 Y13.092105
  X16.179400 Y13.102505
  X16.203000 Y13.133105
  X16.244100 Y13.183805
  X16.289600 Y13.237405
  X16.323000 Y13.275105
  X16.334400 Y13.287505
  X16.349600 Y13.304205
  X16.395100 Y13.354005
  X16.464200 Y13.430305
  X16.540200 Y13.514505
  X16.621400 Y13.604905
  X16.706700 Y13.699705
  X16.794400 Y13.797605
  X16.882800 Y13.896705
  X16.970900 Y13.995305
  X17.056700 Y14.091905
  X17.139100 Y14.184605
  X17.216400 Y14.271805
  X17.287300 Y14.352005
  X17.349900 Y14.423305
  X17.403200 Y14.484205
  X17.445500 Y14.532905
  X17.468000 Y14.558905
  X17.475300 Y14.567605
  X17.485600 Y14.579705
  X17.516600 Y14.616005
  X17.570200 Y14.678105
  X17.634600 Y14.752405
  X17.708500 Y14.837105
  X17.790500 Y14.930705
  X17.878800 Y15.031505
  X17.972300 Y15.137905
  X18.069400 Y15.248205
  X18.168700 Y15.360705
  X18.268500 Y15.473805
  X18.367700 Y15.585705
  X18.464500 Y15.694905
  X18.557800 Y15.799705
  X18.646000 Y15.898505
  X18.727600 Y15.989605
  X18.782700 Y16.051005
  X18.801000 Y16.071305
  X18.830100 Y16.103605
  X18.916700 Y16.201405
  X19.020600 Y16.320605
  X19.101600 Y16.415705
  X19.139600 Y16.462105
  X19.148100 Y16.473805
  X19.153000 Y16.480605
  X19.168700 Y16.500005
  X19.203800 Y16.542405
  X19.251700 Y16.598305
  X19.310800 Y16.666005
  X19.378500 Y16.743105
  X19.453400 Y16.827405
  X19.533500 Y16.916405
  X19.595800 Y16.985305
  X19.616700 Y17.008205
  X19.639400 Y17.033305
  X19.707700 Y17.108805
  X19.809800 Y17.221905
  X19.919600 Y17.343905
  X20.033800 Y17.470805
  X20.148800 Y17.598805
  X20.261200 Y17.724005
  X20.367400 Y17.842605
  X20.440200 Y17.923805
  X20.464400 Y17.950805
  X20.486600 Y17.975705
  X20.553500 Y18.050105
  X20.638100 Y18.143805
  X20.716200 Y18.229605
  X20.785700 Y18.305405
  X20.844800 Y18.369405
  X20.891300 Y18.419205
  X20.923700 Y18.452605
  X20.935200 Y18.464505
  X20.939600 Y18.467605
  X20.948800 Y18.474305
  X20.969800 Y18.503805
  X20.996700 Y18.560605
  X21.016300 Y18.626405
  X21.023900 Y18.673805
  Y18.692105
  X21.020100 Y18.699905
  X21.007100 Y18.709705
  X20.983000 Y18.719505
  X20.945100 Y18.729305
  X20.891200 Y18.739305
  X20.819200 Y18.749905
  X20.726700 Y18.761105
  X20.611300 Y18.773505
  X20.471200 Y18.787005
  X20.303500 Y18.801805
  X20.106300 Y18.818505
  X19.877300 Y18.836905
  X19.614100 Y18.857605
  X19.314600 Y18.880705
  X18.976300 Y18.906405
  X18.692000 Y18.927805
  X18.597100 Y18.934705
  X18.517000 Y18.940805
  X18.276600 Y18.958805
  X17.997000 Y18.979705
  X17.755900 Y18.998205
  X17.550200 Y19.014305
  X17.377300 Y19.028505
  X17.234100 Y19.041405
  X17.118000 Y19.053105
  X17.026000 Y19.064005
  X16.955500 Y19.074605
  X16.903500 Y19.085305
  X16.867300 Y19.096305
  X16.843900 Y19.108105
  X16.830700 Y19.121005
  X16.824800 Y19.135405
  X16.823300 Y19.151805
  X16.823400 Y19.165805
  Y19.182905
  X16.830900 Y19.220605
  X16.852400 Y19.281805
  X16.886300 Y19.350705
  X16.919100 Y19.406305
  X16.931000 Y19.424005
  X16.944600 Y19.444705
  X16.984200 Y19.507905
  X17.051300 Y19.619405
  X17.123400 Y19.744305
  X17.174800 Y19.836805
  X17.191300 Y19.867805
  X17.207400 Y19.897105
  X17.256200 Y19.984605
  X17.317600 Y20.093505
  X17.368500 Y20.182105
  X17.394600 Y20.226305
  X17.402300 Y20.238305
  X17.409800 Y20.250405
  X17.434800 Y20.292605
  X17.482600 Y20.375105
  X17.539100 Y20.474905
  X17.583400 Y20.553805
  X17.598100 Y20.580105
  X17.612600 Y20.606105
  X17.656400 Y20.684005
  X17.729900 Y20.813505
  X17.814500 Y20.961405
  X17.906300 Y21.121105
  X18.001300 Y21.285705
  X18.095600 Y21.448305
  X18.185200 Y21.602205
  X18.245900 Y21.706005
  X18.266200 Y21.740405
  X18.276900 Y21.758505
  X18.308100 Y21.813105
  X18.357600 Y21.901305
  X18.408400 Y21.993805
  X18.443400 Y22.057905
  X18.454900 Y22.079405
  X18.466300 Y22.101005
  X18.500300 Y22.165705
  X18.541600 Y22.243105
  X18.581000 Y22.315105
  X18.620600 Y22.386005
  X18.662600 Y22.459305
  X18.709100 Y22.539005
  X18.762300 Y22.628905
  X18.808800 Y22.706805
  X18.824400 Y22.732805
  X18.851900 Y22.779005
  X18.933400 Y22.918605
  X19.063800 Y23.144705
  X19.206000 Y23.395105
  X19.314800 Y23.588605
  X19.350800 Y23.653205
  X19.359100 Y23.668105
  X19.384600 Y23.712805
  X19.430800 Y23.793205
  X19.483500 Y23.884305
  X19.523500 Y23.952805
  X19.537000 Y23.975605
  X19.545100 Y23.989305
  X19.569100 Y24.030305
  X19.612800 Y24.105105
  X19.666200 Y24.197105
  X19.727000 Y24.302505
  X19.793700 Y24.418205
  X19.864100 Y24.540705
  X19.936200 Y24.666805
  X19.990200 Y24.761405
  X20.008300 Y24.792905
  X20.027300 Y24.826305
  X20.084500 Y24.926305
  X20.168800 Y25.073805
  X20.258400 Y25.230605
  X20.350600 Y25.391705
  X20.442400 Y25.552405
  X20.531300 Y25.707605
  X20.614400 Y25.852605
  X20.670200 Y25.949905
  X20.688800 Y25.982205
  X20.705500 Y26.011505
  X20.755700 Y26.099905
  X20.818500 Y26.210605
  X20.875300 Y26.311705
  X20.925100 Y26.400805
  X20.966200 Y26.475605
  X20.997300 Y26.533105
  X21.017000 Y26.571105
  X21.023900 Y26.583205
  Y26.589405
  X21.017100 Y26.596105
  X20.995100 Y26.586105
  X20.955900 Y26.555405
  X20.897000 Y26.502005
  X20.816400 Y26.423505
  X20.712000 Y26.318105
  X20.581600 Y26.183505
  X20.462400 Y26.059305
  X20.422800 Y26.017805
  X20.397100 Y25.990705
  X20.319900 Y25.909405
  X20.211000 Y25.795305
  X20.099200 Y25.678905
  X19.988200 Y25.563505
  X19.881000 Y25.452605
  X19.781200 Y25.349705
  X19.692000 Y25.258205
  X19.635500 Y25.200605
  X19.616700 Y25.181405
  X19.579400 Y25.143505
  X19.467700 Y25.029405
  X19.302600 Y24.859705
  X19.141600 Y24.693205
  X19.038900 Y24.586105
  X19.004900 Y24.550305
  X18.970900 Y24.514705
  X18.868300 Y24.408305
  X18.707300 Y24.242205
  X18.542100 Y24.072605
  X18.430500 Y23.958505
  X18.393200 Y23.920605
  X18.354200 Y23.881005
  X18.237700 Y23.761705
  X18.055300 Y23.573605
  X17.868500 Y23.379905
  X17.742000 Y23.248205
  X17.700100 Y23.204005
  X17.680900 Y23.183905
  X17.623500 Y23.123305
  X17.546400 Y23.042805
  X17.470800 Y22.964505
  X17.398900 Y22.890605
  X17.332800 Y22.823305
  X17.274500 Y22.764605
  X17.226200 Y22.716705
  X17.199100 Y22.690305
  X17.189900 Y22.681705
  X17.170300 Y22.663105
  X17.110500 Y22.603605
  X16.999600 Y22.491005
  X16.872000 Y22.359005
  X16.774500 Y22.257105
  X16.742300 Y22.222905
  X16.723700 Y22.203205
  X16.667400 Y22.144005
  X16.571900 Y22.044005
  X16.459600 Y21.927205
  X16.334400 Y21.797605
  X16.200200 Y21.659005
  X16.061000 Y21.515705
  X15.920600 Y21.371505
  X15.817400 Y21.265805
  X15.783000 Y21.230605
  X15.748500 Y21.195305
  X15.645100 Y21.089205
  X15.502800 Y20.942905
  X15.360100 Y20.795705
  X15.221200 Y20.652105
  X15.090200 Y20.516305
  X14.971000 Y20.392505
  X14.868100 Y20.285105
  X14.806000 Y20.220105
  X14.785300 Y20.198305
  X14.718800 Y20.128305
  X14.518100 Y19.918605
  X14.258000 Y19.649905
  X13.996300 Y19.382805
  X13.792400 Y19.176805
  X13.724200 Y19.108305
  X13.682700 Y19.067005
  X13.559800 Y18.941005
  X13.392800 Y18.766105
  X13.236300 Y18.597205
  X13.135600 Y18.485805
  X13.102700 Y18.448305
  X13.094900 Y18.439405
  X13.070600 Y18.413605
  X13.035200 Y18.378305
  X13.000700 Y18.346805
  X12.979200 Y18.328605
  X12.971700 Y18.323105
  X12.963100 Y18.316805
  X12.927600 Y18.284605
  X12.853100 Y18.213505
  X12.758800 Y18.119405
  X12.680800 Y18.039905
  X12.654900 Y18.012905
  X12.624200 Y17.981105
  X12.532300 Y17.885305
  X12.386900 Y17.734205
  X12.237000 Y17.578305
  X12.135100 Y17.472205
  X12.101000 Y17.436805
  X12.071400 Y17.406405
  X11.984100 Y17.313305
  X11.886100 Y17.204605
  X11.817400 Y17.122505
  X11.790200 Y17.085405
  X11.788200 Y17.078505
  X11.781400 Y17.055005
  X11.761400 Y16.984605
  X11.746800 Y16.914305
  X11.750000 Y16.863505
  X11.776600 Y16.827905
  X11.832200 Y16.803905
  X11.922400 Y16.787405
  X12.052800 Y16.774205
  X12.185100 Y16.763605
  X12.229200 Y16.760305
  X12.281700 Y16.756105
  X12.439800 Y16.744905
  X12.639200 Y16.732105
  X12.804800 Y16.723605
  X12.886600 Y16.720405
  X12.913900
  X12.938400 Y16.720705
  X13.033300 Y16.717405
  X13.226700 Y16.707405
  X13.467300 Y16.692605
  X13.663300 Y16.679505
  X13.728400 Y16.674905
  X13.829500 Y16.667405
  X14.133000 Y16.645305
  X14.523100 Y16.618105
  X14.888500 Y16.593805
  X15.218500 Y16.573205
  X15.502600 Y16.556805
  X15.730200 Y16.545405
  X15.891200 Y16.539505
  X15.953800 Y16.537905
  X15.974600 Y16.539705
  X15.992000 Y16.541105
  X16.044800 Y16.538605
  X16.090300 Y16.519605
  X16.110200 Y16.478605
  X16.103200 Y16.411105
  X16.068200 Y16.313105
  X16.004200 Y16.180005
  X15.909900 Y16.007605
  X15.816200 Y15.845305
  X15.784500 Y15.791505
  X15.760200 Y15.750305
  X15.688000 Y15.626105
  X15.582300 Y15.443105
  X15.470300 Y15.246805
  X15.383300 Y15.093205
  X15.354400 Y15.041805
  X15.343400 Y15.022205
  X15.306300 Y14.957505
  X15.234900 Y14.833505
  X15.149400 Y14.686105
  X15.082000 Y14.570605
  X15.059500 Y14.532105
  X15.040700 Y14.500005
  X14.984900 Y14.403805
  X14.907700 Y14.270305
  X14.825100 Y14.126505
  X14.733800 Y13.967205
  X14.631000 Y13.787105
  X14.513700 Y13.580705
  X14.378700 Y13.342905
  X14.261900 Y13.137105
  X14.223000 Y13.068305
  X14.174200 Y12.982505
  X14.026700 Y12.725605
  X13.817700 Y12.364305
  X13.609900 Y12.009205
  X13.466400 Y11.765805
  X13.418400 Y11.684805
  X13.396400 Y11.647805
  X13.330500 Y11.536705
  X13.241300 Y11.386705
  X13.161400 Y11.252205
  X13.116300 Y11.175905
  X13.101600 Y11.150405
  X13.094200 Y11.138405
  X13.072800 Y11.102105
  X13.035300 Y11.037605
  X12.990800 Y10.959705
  X12.940600 Y10.871305
  X12.886400 Y10.775105
  X12.829800 Y10.674005
  X12.772300 Y10.570705
  X12.729800 Y10.493805
  X12.715600 Y10.468105
  X12.701900 Y10.443305
  X12.660200 Y10.368805
  X12.607700 Y10.274705
  X12.558900 Y10.188005
  X12.515600 Y10.110805
  X12.478500 Y10.045305
  X12.449100 Y9.993605
  X12.428400 Y9.957905
  X12.420700 Y9.944605
  X12.418000 Y9.940305
  X12.414500 Y9.935505
  X12.405100 Y9.920305
  X12.388900 Y9.891605
  X12.371700 Y9.858005
  X12.359500 Y9.832005
  X12.355800 Y9.823205
  X12.350600 Y9.812205
  X12.321600 Y9.759305
  X12.256000 Y9.644605
  X12.168800 Y9.495605
  X12.094400 Y9.370305
  X12.069400 Y9.328605
  X12.040900 Y9.282005
  X11.956400 Y9.141505
  X11.834600 Y8.936105
  X11.718500 Y8.737405
  X11.646400 Y8.612405
  X11.622700 Y8.570505
  X11.602500 Y8.535305
  X11.541700 Y8.429705
  X11.467400 Y8.302005
  X11.408000 Y8.201305
  X11.379100 Y8.153305
  X11.371900 Y8.141905
  X11.356200 Y8.117505
  X11.323100 Y8.035305
  X11.318900 Y7.949405
  X11.356100 Y7.897715
  X11.413800 Y7.889315
  X11.431100 Y7.893875
  X11.442300 Y7.896915
  X11.475600 Y7.906605
  X11.514500 Y7.922205
  X11.555100 Y7.947005
  X11.604400 Y7.987505
  X11.669600 Y8.050205
  X11.757800 Y8.141405
  X11.876200 Y8.267705
  X11.993100 Y8.393405
  X12.032000 Y8.435405
M5	; stop spindle
G0 Z25.000000
M2	; end program
