G21 (metric ftw)
G90 (absolute mode)
G92 X0.00 Y0.00 Z0.00 (you are here)

M300 S30 (pen down)
G4 P50 (wait 50ms)
M300 S50 (pen up)
G4 P50 (wait 50ms)
M18 (disengage drives)
M01 (Was registration test successful?)
M17 (engage drives if YES, and continue)

(Header end)












G1  X32.211800  Y10.047100

M300 S30 (pen down)
G4 P50 (wait 50ms)

G1  X32.211800  Y10.025900
G1  X32.202200  Y9.962130
G1  X32.174700  Y9.882820
G1  X32.131400  Y9.810990
G1  X32.073900  Y9.748320
G1  X32.004300  Y9.696610
G1  X31.924600  Y9.657500
G1  X31.836400  Y9.632760
G1  X31.765400  Y9.624140
G1  X31.718200  Y9.624140
G1  X31.647200  Y9.632760
G1  X31.559200  Y9.657500
G1  X31.479600  Y9.696610
G1  X31.410300  Y9.748320
G1  X31.352900  Y9.810990
G1  X31.309900  Y9.882820
G1  X31.282500  Y9.962130
G1  X31.273100  Y10.025900
G1  X31.273100  Y10.068400
G1  X31.282500  Y10.132300
G1  X31.309900  Y10.211600
G1  X31.352900  Y10.283500
G1  X31.410300  Y10.346200
G1  X31.479600  Y10.398000
G1  X31.559200  Y10.437100
G1  X31.647200  Y10.461800
G1  X31.718200  Y10.470400
G1  X31.765400  Y10.470400
G1  X31.836400  Y10.461800
G1  X31.924600  Y10.437100
G1  X32.004300  Y10.398000
G1  X32.073900  Y10.346200
G1  X32.131400  Y10.283500
G1  X32.174700  Y10.211600
G1  X32.202200  Y10.132300
G1  X32.211800  Y10.068400
G1  X32.211800  Y10.047100
M300 S50 (pen up)
G4 P50 (wait 50ms)
G1  X32.856700  Y10.047100

M300 S30 (pen down)
G4 P50 (wait 50ms)

G1  X32.856700  Y9.990940
G1  X32.834000  Y9.822380
G1  X32.769200  Y9.613070
G1  X32.666400  Y9.423720
G1  X32.530300  Y9.258790
G1  X32.365300  Y9.122670
G1  X32.175800  Y9.019920
G1  X31.966500  Y8.955030
G1  X31.798100  Y8.932350
G1  X31.685800  Y8.932350
G1  X31.517500  Y8.955030
G1  X31.308500  Y9.019920
G1  X31.119300  Y9.122670
G1  X30.954400  Y9.258790
G1  X30.818300  Y9.423720
G1  X30.715700  Y9.613070
G1  X30.650800  Y9.822380
G1  X30.628200  Y9.990940
G1  X30.628200  Y10.103300
G1  X30.650800  Y10.271500
G1  X30.715700  Y10.480600
G1  X30.818300  Y10.669700
G1  X30.954400  Y10.834600
G1  X31.119300  Y10.970600
G1  X31.308500  Y11.073300
G1  X31.517500  Y11.138200
G1  X31.685800  Y11.160800
G1  X31.798100  Y11.160800
G1  X31.966500  Y11.138200
G1  X32.175800  Y11.073300
G1  X32.365300  Y10.970600
G1  X32.530300  Y10.834600
G1  X32.666400  Y10.669700
G1  X32.769200  Y10.480600
G1  X32.834000  Y10.271500
G1  X32.856700  Y10.103300
G1  X32.856700  Y10.047100
M300 S50 (pen up)
G4 P50 (wait 50ms)
G1  X37.238100  Y19.146100

M300 S30 (pen down)
G4 P50 (wait 50ms)

G1  X37.238100  Y15.729000
G1  X36.312100  Y15.729000
G1  X36.312100  Y19.115700
G1  X36.311800  Y19.209600
G1  X36.291500  Y19.490700
G1  X36.232600  Y19.816900
G1  X36.134700  Y20.093300
G1  X36.037800  Y20.267400
G1  X35.997200  Y20.318900
G1  X35.958300  Y20.366900
G1  X35.818600  Y20.492600
G1  X35.602400  Y20.617500
G1  X35.347400  Y20.692900
G1  X35.126400  Y20.718200
G1  X35.052800  Y20.718200
G1  X34.962800  Y20.718100
G1  X34.692900  Y20.687800
G1  X34.374700  Y20.597800
G1  X34.097200  Y20.447900
G1  X33.912400  Y20.296200
G1  X33.859400  Y20.237900
G1  X33.804700  Y20.178100
G1  X33.666800  Y19.974700
G1  X33.530600  Y19.669400
G1  X33.449400  Y19.321000
G1  X33.422800  Y19.026800
G1  X33.422800  Y15.729000
G1  X32.482900  Y15.729000
G1  X32.482900  Y23.606800
G1  X33.422800  Y23.606800
G1  X33.422800  Y20.511000
G1  X33.463100  Y20.573100
G1  X33.596700  Y20.751100
G1  X33.786300  Y20.959600
G1  X33.991000  Y21.135700
G1  X34.153500  Y21.247400
G1  X34.210600  Y21.279300
G1  X34.267200  Y21.310700
G1  X34.445800  Y21.389400
G1  X34.698800  Y21.469000
G1  X34.969200  Y21.517400
G1  X35.185000  Y21.533800
G1  X35.256900  Y21.533800
G1  X35.316000  Y21.533300
G1  X35.493300  Y21.523100
G1  X35.715300  Y21.494000
G1  X35.922500  Y21.446700
G1  X36.115000  Y21.380600
G1  X36.292600  Y21.295800
G1  X36.455600  Y21.192200
G1  X36.603500  Y21.069700
G1  X36.705400  Y20.965100
G1  X36.736400  Y20.927800
G1  X36.767600  Y20.889400
G1  X36.852600  Y20.767100
G1  X36.954000  Y20.588800
G1  X37.040100  Y20.392600
G1  X37.111000  Y20.179000
G1  X37.166400  Y19.947500
G1  X37.206100  Y19.698200
G1  X37.230000  Y19.431100
G1  X37.238100  Y19.217400
G1  X37.238100  Y19.146100
M300 S50 (pen up)
G4 P50 (wait 50ms)
G1  X30.720700  Y21.243600

M300 S30 (pen down)
G4 P50 (wait 50ms)

G1  X30.720700  Y20.359000
G1  X30.654300  Y20.391900
G1  X30.316500  Y20.533800
G1  X29.969600  Y20.642900
G1  X29.898500  Y20.659600
G1  X29.827100  Y20.676200
G1  X29.464000  Y20.734700
G1  X29.127200  Y20.759900
G1  X29.015000  Y20.759900
G1  X28.933200  Y20.759700
G1  X28.687800  Y20.746100
G1  X28.405400  Y20.706100
G1  X28.167100  Y20.639900
G1  X28.017600  Y20.574900
G1  X27.971800  Y20.546700
G1  X27.930600  Y20.521100
G1  X27.818700  Y20.425300
G1  X27.710100  Y20.279200
G1  X27.645600  Y20.107200
G1  X27.624200  Y19.958100
G1  X27.624200  Y19.908200
G1  X27.623800  Y19.869600
G1  X27.638800  Y19.753100
G1  X27.685700  Y19.617100
G1  X27.764200  Y19.499400
G1  X27.843900  Y19.421000
G1  X27.873500  Y19.398900
G1  X27.909200  Y19.371900
G1  X28.028700  Y19.307100
G1  X28.247900  Y19.218100
G1  X28.530400  Y19.131400
G1  X28.788900  Y19.066000
G1  X28.875700  Y19.046700
G1  X29.196000  Y18.975300
G1  X29.311800  Y18.949700
G1  X29.655300  Y18.856400
G1  X30.044200  Y18.717200
G1  X30.361700  Y18.556800
G1  X30.551400  Y18.426000
G1  X30.607100  Y18.374200
G1  X30.657900  Y18.326400
G1  X30.789400  Y18.160300
G1  X30.920000  Y17.908800
G1  X30.998700  Y17.619300
G1  X31.025000  Y17.373300
G1  X31.025000  Y17.291200
G1  X31.024900  Y17.243100
G1  X31.014700  Y17.098100
G1  X30.985100  Y16.915400
G1  X30.936200  Y16.743300
G1  X30.867800  Y16.581700
G1  X30.779900  Y16.430400
G1  X30.672500  Y16.289600
G1  X30.545400  Y16.159000
G1  X30.436800  Y16.066700
G1  X30.398700  Y16.038500
G1  X30.359200  Y16.009300
G1  X30.234400  Y15.930000
G1  X30.055700  Y15.836000
G1  X29.862500  Y15.756700
G1  X29.654600  Y15.691800
G1  X29.432200  Y15.641500
G1  X29.195100  Y15.605600
G1  X28.943300  Y15.584000
G1  X28.743500  Y15.576900
G1  X28.676900  Y15.576900
G1  X28.600600  Y15.576800
G1  X28.210600  Y15.598500
G1  X27.808500  Y15.649000
G1  X27.726300  Y15.663500
G1  X27.642800  Y15.677600
G1  X27.217100  Y15.771000
G1  X26.775600  Y15.893900
G1  X26.684300  Y15.922600
G1  X26.684300  Y16.890000
G1  X26.769600  Y16.844400
G1  X27.196800  Y16.653200
G1  X27.621000  Y16.508200
G1  X27.704700  Y16.485700
G1  X27.788200  Y16.462800
G1  X28.204400  Y16.383900
G1  X28.576100  Y16.351000
G1  X28.700100  Y16.351000
G1  X28.777400  Y16.350400
G1  X29.009300  Y16.363600
G1  X29.282400  Y16.406300
G1  X29.518200  Y16.477800
G1  X29.669200  Y16.547800
G1  X29.715600  Y16.577400
G1  X29.757200  Y16.603900
G1  X29.870800  Y16.701900
G1  X29.981900  Y16.849900
G1  X30.048800  Y17.021100
G1  X30.071000  Y17.166900
G1  X30.071000  Y17.215600
G1  X30.070400  Y17.260400
G1  X30.053600  Y17.395000
G1  X30.005600  Y17.552400
G1  X29.926000  Y17.687500
G1  X29.845000  Y17.776000
G1  X29.814000  Y17.800400
G1  X29.776000  Y17.830300
G1  X29.646900  Y17.901000
G1  X29.403600  Y17.999900
G1  X29.083900  Y18.096900
G1  X28.786900  Y18.170600
G1  X28.687400  Y18.192100
G1  X28.361800  Y18.268300
G1  X28.259900  Y18.289000
G1  X27.957600  Y18.370000
G1  X27.614900  Y18.497900
G1  X27.332800  Y18.650800
G1  X27.161100  Y18.778300
G1  X27.110700  Y18.827800
G1  X27.063200  Y18.873900
G1  X26.941300  Y19.033800
G1  X26.821100  Y19.275000
G1  X26.749400  Y19.551500
G1  X26.725700  Y19.785300
G1  X26.725700  Y19.863100
G1  X26.725400  Y19.911500
G1  X26.733500  Y20.056500
G1  X26.759700  Y20.239000
G1  X26.803900  Y20.410400
G1  X26.866300  Y20.570700
G1  X26.946500  Y20.719700
G1  X27.044600  Y20.857500
G1  X27.160300  Y20.983700
G1  X27.258600  Y21.071700
G1  X27.293500  Y21.098300
G1  X27.329000  Y21.125700
G1  X27.441900  Y21.199600
G1  X27.605800  Y21.287600
G1  X27.785000  Y21.362500
G1  X27.979300  Y21.423900
G1  X28.188600  Y21.471800
G1  X28.412900  Y21.506100
G1  X28.652100  Y21.526800
G1  X28.842400  Y21.533800
G1  X28.905800  Y21.533800
G1  X28.991100  Y21.532600
G1  X29.406300  Y21.513900
G1  X29.803100  Y21.473200
G1  X29.879200  Y21.461000
G1  X29.954300  Y21.448200
G1  X30.316300  Y21.369200
G1  X30.656500  Y21.267800
G1  X30.720700  Y21.243600
M300 S50 (pen up)
G4 P50 (wait 50ms)
G1  X22.911900  Y21.533800

M300 S30 (pen down)
G4 P50 (wait 50ms)

G1  X22.985600  Y21.533300
G1  X23.206000  Y21.520100
G1  X23.484400  Y21.482500
G1  X23.747100  Y21.420700
G1  X23.993800  Y21.334600
G1  X24.224300  Y21.223900
G1  X24.438700  Y21.088600
G1  X24.636700  Y20.928600
G1  X24.775600  Y20.792200
G1  X24.818200  Y20.743600
G1  X24.861400  Y20.694200
G1  X24.980400  Y20.536500
G1  X25.121000  Y20.310400
G1  X25.240000  Y20.065400
G1  X25.337500  Y19.801400
G1  X25.413300  Y19.518300
G1  X25.467500  Y19.216400
G1  X25.500000  Y18.895400
G1  X25.511000  Y18.640400
G1  X25.511000  Y18.470600
G1  X25.500000  Y18.215800
G1  X25.467500  Y17.895400
G1  X25.413500  Y17.594000
G1  X25.337600  Y17.311500
G1  X25.240300  Y17.048100
G1  X25.121200  Y16.803200
G1  X24.980600  Y16.577100
G1  X24.861500  Y16.419200
G1  X24.818200  Y16.369600
G1  X24.775600  Y16.320800
G1  X24.636700  Y16.183700
G1  X24.439000  Y16.022600
G1  X24.225100  Y15.886400
G1  X23.995000  Y15.774900
G1  X23.748800  Y15.688200
G1  X23.486100  Y15.626400
G1  X23.207200  Y15.589300
G1  X22.985800  Y15.576900
G1  X22.837600  Y15.576900
G1  X22.614400  Y15.589300
G1  X22.334000  Y15.626400
G1  X22.070600  Y15.688200
G1  X21.824000  Y15.775000
G1  X21.594200  Y15.886500
G1  X21.380800  Y16.022800
G1  X21.184000  Y16.183700
G1  X21.045800  Y16.320800
G1  X21.003300  Y16.369600
G1  X20.960000  Y16.419200
G1  X20.841000  Y16.577100
G1  X20.700400  Y16.803300
G1  X20.581800  Y17.048300
G1  X20.484900  Y17.312200
G1  X20.409700  Y17.594900
G1  X20.356000  Y17.896400
G1  X20.323900  Y18.216500
G1  X20.313200  Y18.470700
G1  X20.313200  Y18.555400
G1  X20.312900  Y18.640300
G1  X20.322900  Y18.894700
G1  X20.354700  Y19.215400
G1  X20.408600  Y19.517400
G1  X20.484300  Y19.800600
G1  X20.581800  Y20.064900
G1  X20.700800  Y20.310100
G1  X20.841400  Y20.536400
G1  X20.960100  Y20.694200
G1  X21.003300  Y20.743600
G1  X21.045700  Y20.792200
G1  X21.183500  Y20.928800
G1  X21.380600  Y21.089200
G1  X21.594300  Y21.225000
G1  X21.824700  Y21.336100
G1  X22.071900  Y21.422500
G1  X22.335600  Y21.484300
G1  X22.615600  Y21.521400
G1  X22.837900  Y21.533800
G1  X22.911900  Y21.533800
M300 S50 (pen up)
G4 P50 (wait 50ms)
G1  X23.627900  Y26.824900

M300 S30 (pen down)
G4 P50 (wait 50ms)

G1  X23.627900  Y26.783900
G1  X23.611400  Y26.661000
G1  X23.563900  Y26.508300
G1  X23.488600  Y26.370300
G1  X23.389200  Y26.249900
G1  X23.268500  Y26.150600
G1  X23.130100  Y26.075700
G1  X22.977400  Y26.028300
G1  X22.854400  Y26.011700
G1  X22.772400  Y26.011700
G1  X22.649600  Y26.028300
G1  X22.496900  Y26.075700
G1  X22.358700  Y26.150600
G1  X22.238500  Y26.249900
G1  X22.139200  Y26.370300
G1  X22.064200  Y26.508300
G1  X22.016800  Y26.661000
G1  X22.000300  Y26.783900
G1  X22.000300  Y26.865800
G1  X22.016800  Y26.988700
G1  X22.064200  Y27.141400
G1  X22.139200  Y27.279600
G1  X22.238500  Y27.399900
G1  X22.358700  Y27.499200
G1  X22.496900  Y27.574200
G1  X22.649600  Y27.621500
G1  X22.772400  Y27.638100
G1  X22.854400  Y27.638100
G1  X22.977400  Y27.621500
G1  X23.130100  Y27.574200
G1  X23.268500  Y27.499200
G1  X23.389200  Y27.399900
G1  X23.488600  Y27.279600
G1  X23.563900  Y27.141400
G1  X23.611400  Y26.988700
G1  X23.627900  Y26.865800
G1  X23.627900  Y26.824900
M300 S50 (pen up)
G4 P50 (wait 50ms)
G1  X15.821400  Y26.553600

M300 S30 (pen down)
G4 P50 (wait 50ms)

G1  X22.524200  Y23.494300
G1  X22.562600  Y14.203600
G1  X15.782500  Y17.878800
G1  X15.821400  Y26.553600
M300 S50 (pen up)
G4 P50 (wait 50ms)
G1  X18.776500  Y16.427600

M300 S30 (pen down)
G4 P50 (wait 50ms)

G1  X18.776500  Y16.340000
G1  X18.766400  Y16.077500
G1  X18.736100  Y15.750800
G1  X18.685700  Y15.447400
G1  X18.615100  Y15.167200
G1  X18.524600  Y14.910300
G1  X18.413800  Y14.676400
G1  X18.282900  Y14.465600
G1  X18.172400  Y14.322200
G1  X18.131800  Y14.277800
G1  X18.091500  Y14.233900
G1  X17.959000  Y14.111900
G1  X17.765400  Y13.968500
G1  X17.550600  Y13.847300
G1  X17.314700  Y13.748300
G1  X17.057400  Y13.671500
G1  X16.778700  Y13.616700
G1  X16.478600  Y13.583900
G1  X16.237400  Y13.573000
G1  X16.156900  Y13.573000
G1  X16.074400  Y13.572100
G1  X15.677800  Y13.590400
G1  X15.301000  Y13.635400
G1  X15.228200  Y13.647800
G1  X15.154700  Y13.660100
G1  X14.796900  Y13.742200
G1  X14.449000  Y13.851300
G1  X14.380600  Y13.877000
G1  X14.380600  Y14.789200
G1  X14.448500  Y14.751100
G1  X14.789000  Y14.591900
G1  X15.127500  Y14.472900
G1  X15.194600  Y14.454900
G1  X15.261300  Y14.436700
G1  X15.600000  Y14.373500
G1  X15.910300  Y14.346800
G1  X16.013700  Y14.346800
G1  X16.069400  Y14.346700
G1  X16.236500  Y14.353600
G1  X16.444900  Y14.375700
G1  X16.638900  Y14.412900
G1  X16.818500  Y14.465100
G1  X16.983700  Y14.532400
G1  X17.134400  Y14.614600
G1  X17.270700  Y14.711500
G1  X17.363900  Y14.793500
G1  X17.392500  Y14.823200
G1  X17.421000  Y14.852800
G1  X17.499200  Y14.948800
G1  X17.591900  Y15.090100
G1  X17.670600  Y15.247100
G1  X17.735100  Y15.419600
G1  X17.785400  Y15.607400
G1  X17.821400  Y15.810600
G1  X17.843100  Y16.028600
G1  X17.850400  Y16.203500
G1  X17.850400  Y16.724000
G1  X17.815000  Y16.663100
G1  X17.694700  Y16.488600
G1  X17.519600  Y16.286000
G1  X17.324600  Y16.115600
G1  X17.165100  Y16.007200
G1  X17.109000  Y15.976400
G1  X17.052200  Y15.944600
G1  X16.872100  Y15.866500
G1  X16.612900  Y15.789400
G1  X16.331500  Y15.744000
G1  X16.103700  Y15.729000
G1  X15.964000  Y15.729000
G1  X15.772600  Y15.741400
G1  X15.530000  Y15.778700
G1  X15.300400  Y15.840800
G1  X15.083500  Y15.927600
G1  X14.879200  Y16.039400
G1  X14.687800  Y16.176000
G1  X14.508900  Y16.337400
G1  X14.381800  Y16.475000
G1  X14.342800  Y16.523500
G1  X14.302500  Y16.573100
G1  X14.191700  Y16.730000
G1  X14.061200  Y16.952600
G1  X13.951200  Y17.191700
G1  X13.861600  Y17.446800
G1  X13.792100  Y17.718200
G1  X13.742600  Y18.005600
G1  X13.713100  Y18.309200
G1  X13.703200  Y18.548900
G1  X13.703200  Y18.628800
G1  X13.702800  Y18.708800
G1  X13.712100  Y18.948500
G1  X13.741600  Y19.252500
G1  X13.791400  Y19.540700
G1  X13.861700  Y19.812800
G1  X13.952100  Y20.068900
G1  X14.062400  Y20.308600
G1  X14.192800  Y20.532100
G1  X14.302800  Y20.689300
G1  X14.342800  Y20.739000
G1  X14.381500  Y20.787400
G1  X14.507800  Y20.924300
G1  X14.686300  Y21.085300
G1  X14.877800  Y21.221800
G1  X15.082400  Y21.333800
G1  X15.299700  Y21.421100
G1  X15.529900  Y21.483600
G1  X15.772600  Y21.521100
G1  X15.964000  Y21.533800
G1  X16.027900  Y21.533800
G1  X16.103700  Y21.532900
G1  X16.331100  Y21.516400
G1  X16.612600  Y21.470100
G1  X16.871900  Y21.393900
G1  X17.052100  Y21.317200
G1  X17.109000  Y21.286100
G1  X17.165100  Y21.255300
G1  X17.324700  Y21.146400
G1  X17.520100  Y20.975400
G1  X17.695400  Y20.772800
G1  X17.815300  Y20.599300
G1  X17.850400  Y20.538800
G1  X17.850400  Y21.395400
G1  X18.776500  Y21.395400
G1  X18.776500  Y16.427600
M300 S50 (pen up)
G4 P50 (wait 50ms)
G1  X15.821400  Y26.553600

M300 S30 (pen down)
G4 P50 (wait 50ms)

G1  X22.524200  Y23.494300
G1  X22.562600  Y14.203600
G1  X15.782500  Y17.878800
G1  X15.821400  Y26.553600
M300 S50 (pen up)
G4 P50 (wait 50ms)
G1  X12.549600  Y18.798900

M300 S30 (pen down)
G4 P50 (wait 50ms)

G1  X12.549600  Y18.341200
G1  X8.264260  Y18.341200
G1  X8.267680  Y18.282500
G1  X8.285860  Y18.106900
G1  X8.322210  Y17.887200
G1  X8.373100  Y17.681800
G1  X8.438530  Y17.490700
G1  X8.518330  Y17.314000
G1  X8.612570  Y17.151800
G1  X8.721030  Y17.003900
G1  X8.811250  Y16.901900
G1  X8.843690  Y16.870300
G1  X8.875820  Y16.838800
G1  X8.979490  Y16.751700
G1  X9.128150  Y16.648700
G1  X9.289650  Y16.561900
G1  X9.464030  Y16.491000
G1  X9.651100  Y16.435700
G1  X9.850970  Y16.396400
G1  X10.063500  Y16.372800
G1  X10.232500  Y16.364900
G1  X10.288800  Y16.364900
G1  X10.377900  Y16.364000
G1  X10.816500  Y16.396400
G1  X11.244800  Y16.474300
G1  X11.328700  Y16.496100
G1  X11.412500  Y16.517800
G1  X11.830200  Y16.659900
G1  X12.245800  Y16.846300
G1  X12.328500  Y16.890000
G1  X12.328500  Y16.005400
G1  X12.244900  Y15.969600
G1  X11.821100  Y15.819400
G1  X11.389300  Y15.704700
G1  X11.301600  Y15.686500
G1  X11.213800  Y15.667200
G1  X10.771700  Y15.602600
G1  X10.369000  Y15.576900
G1  X10.152100  Y15.576900
G1  X9.904190  Y15.589200
G1  X9.591530  Y15.626200
G1  X9.296710  Y15.687900
G1  X9.019640  Y15.774300
G1  X8.760250  Y15.885400
G1  X8.518560  Y16.021400
G1  X8.294430  Y16.181800
G1  X8.136830  Y16.318200
G1  X8.087830  Y16.367100
G1  X8.038510  Y16.415600
G1  X7.901320  Y16.572100
G1  X7.740130  Y16.795100
G1  X7.604060  Y17.036200
G1  X7.493000  Y17.295000
G1  X7.406900  Y17.571400
G1  X7.345540  Y17.865300
G1  X7.308810  Y18.176400
G1  X7.296600  Y18.422600
G1  X7.296600  Y18.504600
G1  X7.296220  Y18.589200
G1  X7.307240  Y18.842800
G1  X7.341960  Y19.163500
G1  X7.400610  Y19.466800
G1  X7.483010  Y19.752400
G1  X7.589140  Y20.020300
G1  X7.718750  Y20.270100
G1  X7.871810  Y20.501900
G1  X8.001310  Y20.664700
G1  X8.048130  Y20.715600
G1  X8.094070  Y20.766000
G1  X8.242940  Y20.907200
G1  X8.454750  Y21.073500
G1  X8.683490  Y21.214000
G1  X8.928930  Y21.329200
G1  X9.190920  Y21.418600
G1  X9.469290  Y21.482600
G1  X9.764000  Y21.521000
G1  X9.997070  Y21.533800
G1  X10.074800  Y21.533800
G1  X10.144200  Y21.533300
G1  X10.352200  Y21.521000
G1  X10.615200  Y21.485800
G1  X10.863700  Y21.428300
G1  X11.097600  Y21.348200
G1  X11.316700  Y21.245300
G1  X11.520900  Y21.119300
G1  X11.710100  Y20.970300
G1  X11.843000  Y20.843300
G1  X11.884100  Y20.798100
G1  X11.925400  Y20.751800
G1  X12.039900  Y20.604700
G1  X12.175000  Y20.395400
G1  X12.289400  Y20.170100
G1  X12.383000  Y19.928900
G1  X12.455900  Y19.671200
G1  X12.507900  Y19.397100
G1  X12.539200  Y19.106400
G1  X12.549600  Y18.875700
G1  X12.549600  Y18.798900
M300 S50 (pen up)
G4 P50 (wait 50ms)
G1  X6.935440  Y20.524900

M300 S30 (pen down)
G4 P50 (wait 50ms)

G1  X6.908640  Y20.539900
G1  X6.770830  Y20.604600
G1  X6.625220  Y20.653600
G1  X6.594510  Y20.660800
G1  X6.563750  Y20.668100
G1  X6.400760  Y20.693500
G1  X6.241380  Y20.704400
G1  X6.140190  Y20.704400
G1  X5.996040  Y20.696100
G1  X5.815810  Y20.671900
G1  X5.647460  Y20.631700
G1  X5.490830  Y20.575400
G1  X5.345760  Y20.503200
G1  X5.212240  Y20.414900
G1  X5.090000  Y20.310300
G1  X5.004930  Y20.221400
G1  X4.979060  Y20.189700
G1  X4.952260  Y20.157400
G1  X4.879350  Y20.053900
G1  X4.793290  Y19.904000
G1  X4.720760  Y19.740300
G1  X4.661740  Y19.562500
G1  X4.616000  Y19.370800
G1  X4.583500  Y19.165000
G1  X4.564010  Y18.945300
G1  X4.557610  Y18.769900
G1  X4.557610  Y15.729000
G1  X3.617740  Y15.729000
G1  X3.617740  Y21.395400
G1  X4.557610  Y21.395400
G1  X4.557610  Y20.511000
G1  X4.592890  Y20.573600
G1  X4.714420  Y20.753100
G1  X4.894040  Y20.962500
G1  X5.096030  Y21.138900
G1  X5.261610  Y21.250400
G1  X5.319990  Y21.281800
G1  X5.379500  Y21.313100
G1  X5.566890  Y21.390400
G1  X5.839510  Y21.469300
G1  X6.137640  Y21.517500
G1  X6.379990  Y21.533800
G1  X6.460830  Y21.533800
G1  X6.476350  Y21.532600
G1  X6.561080  Y21.528600
G1  X6.653490  Y21.522100
G1  X6.672850  Y21.519900
G1  X6.691400  Y21.516400
G1  X6.794110  Y21.501000
G1  X6.906850  Y21.483100
G1  X6.930440  Y21.478300
G1  X6.935440  Y20.524900
M300 S50 (pen up)
G4 P50 (wait 50ms)
G1  X4.460890  Y24.161000

M300 S30 (pen down)
G4 P50 (wait 50ms)

G1  X4.460890  Y24.115800
G1  X4.443250  Y23.980000
G1  X4.392850  Y23.811300
G1  X4.313040  Y23.658500
G1  X4.207360  Y23.525300
G1  X4.079260  Y23.415300
G1  X3.932180  Y23.332400
G1  X3.769690  Y23.279700
G1  X3.638780  Y23.261400
G1  X3.551540  Y23.261400
G1  X3.420680  Y23.279700
G1  X3.258250  Y23.332400
G1  X3.111280  Y23.415300
G1  X2.983180  Y23.525300
G1  X2.877560  Y23.658500
G1  X2.797790  Y23.811300
G1  X2.747350  Y23.980000
G1  X2.729820  Y24.115800
G1  X2.729820  Y24.206400
G1  X2.747350  Y24.342500
G1  X2.797790  Y24.511500
G1  X2.877560  Y24.664400
G1  X2.983180  Y24.797600
G1  X3.111280  Y24.907500
G1  X3.258250  Y24.990300
G1  X3.420680  Y25.042800
G1  X3.551540  Y25.061000
G1  X3.638780  Y25.061000
G1  X3.769690  Y25.042800
G1  X3.932180  Y24.990300
G1  X4.079260  Y24.907500
G1  X4.207360  Y24.797600
G1  X4.313040  Y24.664400
G1  X4.392850  Y24.511500
G1  X4.443250  Y24.342500
G1  X4.460890  Y24.206400
G1  X4.460890  Y24.161000
M300 S50 (pen up)
G4 P50 (wait 50ms)
G1  X5.491320  Y24.161000

M300 S30 (pen down)
G4 P50 (wait 50ms)

G1  X5.491320  Y24.108700
G1  X5.481010  Y23.952100
G1  X5.450470  Y23.746700
G1  X5.400220  Y23.546100
G1  X5.330890  Y23.351900
G1  X5.242890  Y23.165600
G1  X5.136830  Y22.988100
G1  X5.013180  Y22.821300
G1  X4.909500  Y22.702900
G1  X4.872560  Y22.666000
G1  X4.835610  Y22.629000
G1  X4.717390  Y22.525400
G1  X4.550290  Y22.401700
G1  X4.372670  Y22.295400
G1  X4.185930  Y22.207100
G1  X3.991490  Y22.137400
G1  X3.790750  Y22.086900
G1  X3.585120  Y22.056300
G1  X3.428330  Y22.045800
G1  X3.323790  Y22.045800
G1  X3.166990  Y22.056300
G1  X2.961430  Y22.086900
G1  X2.760690  Y22.137400
G1  X2.566290  Y22.207100
G1  X2.379560  Y22.295400
G1  X2.201930  Y22.401700
G1  X2.034830  Y22.525400
G1  X1.916560  Y22.629000
G1  X1.879610  Y22.666000
G1  X1.842610  Y22.702900
G1  X1.739040  Y22.821300
G1  X1.615460  Y22.988100
G1  X1.509390  Y23.165600
G1  X1.421390  Y23.351900
G1  X1.351940  Y23.546100
G1  X1.301700  Y23.746700
G1  X1.271160  Y23.952100
G1  X1.260850  Y24.108700
G1  X1.260850  Y24.215100
G1  X1.271760  Y24.377500
G1  X1.303770  Y24.587500
G1  X1.355900  Y24.790300
G1  X1.427030  Y24.984600
G1  X1.516060  Y25.169600
G1  X1.622010  Y25.344000
G1  X1.743760  Y25.506800
G1  X1.880320  Y25.656900
G1  X2.030490  Y25.793500
G1  X2.193310  Y25.915100
G1  X2.367740  Y26.021100
G1  X2.552630  Y26.110100
G1  X2.746960  Y26.181300
G1  X2.949710  Y26.233300
G1  X3.159780  Y26.265400
G1  X3.322000  Y26.276300
G1  X3.430120  Y26.276300
G1  X3.592390  Y26.265400
G1  X3.802510  Y26.233300
G1  X4.005260  Y26.181300
G1  X4.199600  Y26.110100
G1  X4.384560  Y26.021100
G1  X4.558920  Y25.915100
G1  X4.721740  Y25.793500
G1  X4.871960  Y25.656900
G1  X5.008460  Y25.506800
G1  X5.130150  Y25.344000
G1  X5.236110  Y25.169600
G1  X5.325140  Y24.984600
G1  X5.396210  Y24.790300
G1  X5.448350  Y24.587500
G1  X5.480360  Y24.377500
G1  X5.491320  Y24.215100
G1  X5.491320  Y24.161000
M300 S50 (pen up)
G4 P50 (wait 50ms)
G1  X16.073200  Y27.096500

M300 S30 (pen down)
G4 P50 (wait 50ms)

G1  X22.853300  Y23.920100
G1  X29.554700  Y27.096500
G1  X22.736100  Y29.729700
G1  X16.073200  Y27.096500
M300 S50 (pen up)
G4 P50 (wait 50ms)
G1  X29.845700  Y26.558900

M300 S30 (pen down)
G4 P50 (wait 50ms)

G1  X23.065700  Y23.461100
G1  X23.065700  Y14.203600
G1  X29.806900  Y17.766900
G1  X29.845700  Y26.558900
G1  X23.065700  Y23.461100
G1  X23.065700  Y14.203600
G1  X29.806900  Y17.766900
G1  X29.845700  Y26.558900
M300 S50 (pen up)
G4 P50 (wait 50ms)
G1  X22.914600  Y20.746000

M300 S30 (pen down)
G4 P50 (wait 50ms)

G1  X22.868900  Y20.745800
G1  X22.732100  Y20.736500
G1  X22.559400  Y20.708900
G1  X22.396500  Y20.663200
G1  X22.243600  Y20.599200
G1  X22.100600  Y20.516800
G1  X21.967200  Y20.416400
G1  X21.843600  Y20.297500
G1  X21.756400  Y20.196000
G1  X21.729900  Y20.160300
G1  X21.702200  Y20.123300
G1  X21.626800  Y20.006900
G1  X21.537900  Y19.840300
G1  X21.462900  Y19.660000
G1  X21.401900  Y19.466200
G1  X21.354900  Y19.258900
G1  X21.321300  Y19.037900
G1  X21.301200  Y18.803500
G1  X21.294600  Y18.617400
G1  X21.294600  Y18.555400
G1  X21.294400  Y18.493300
G1  X21.300700  Y18.306700
G1  X21.320700  Y18.071900
G1  X21.354400  Y17.851000
G1  X21.402100  Y17.643600
G1  X21.463100  Y17.450000
G1  X21.537800  Y17.270000
G1  X21.626000  Y17.103500
G1  X21.700300  Y16.987200
G1  X21.727500  Y16.950400
G1  X21.753600  Y16.914300
G1  X21.839900  Y16.811900
G1  X21.962800  Y16.692400
G1  X22.096100  Y16.591700
G1  X22.239600  Y16.509600
G1  X22.393300  Y16.446100
G1  X22.557200  Y16.400800
G1  X22.731000  Y16.373900
G1  X22.868600  Y16.364900
G1  X22.914600  Y16.364900
G1  X22.959900  Y16.364600
G1  X23.095700  Y16.373100
G1  X23.267100  Y16.400100
G1  X23.429000  Y16.446000
G1  X23.581400  Y16.510600
G1  X23.724000  Y16.593600
G1  X23.856900  Y16.695100
G1  X23.980400  Y16.815000
G1  X24.067500  Y16.917100
G1  X24.094000  Y16.952900
G1  X24.149300  Y17.027500
G1  X24.284400  Y17.273500
G1  X24.420400  Y17.647500
G1  X24.502200  Y18.074900
G1  X24.529400  Y18.435300
G1  X24.529400  Y18.555400
G1  X24.529000  Y18.674900
G1  X24.501400  Y19.032800
G1  X24.419900  Y19.459000
G1  X24.284200  Y19.833300
G1  X24.149200  Y20.080400
G1  X24.094000  Y20.155300
G1  X24.067500  Y20.191000
G1  X23.980400  Y20.292800
G1  X23.857100  Y20.412400
G1  X23.724000  Y20.513900
G1  X23.581500  Y20.597100
G1  X23.429200  Y20.662100
G1  X23.267400  Y20.708600
G1  X23.095700  Y20.736700
G1  X22.959900  Y20.746000
G1  X22.914600  Y20.746000
M300 S50 (pen up)
G4 P50 (wait 50ms)
G1  X17.850400  Y18.628800

M300 S30 (pen down)
G4 P50 (wait 50ms)

G1  X17.850100  Y18.690100
G1  X17.843200  Y18.874300
G1  X17.823500  Y19.106100
G1  X17.790700  Y19.324000
G1  X17.745000  Y19.528100
G1  X17.686400  Y19.717900
G1  X17.614700  Y19.893600
G1  X17.529900  Y20.054900
G1  X17.458300  Y20.166400
G1  X17.431900  Y20.201700
G1  X17.406300  Y20.235800
G1  X17.321700  Y20.332500
G1  X17.201100  Y20.445800
G1  X17.070100  Y20.541800
G1  X16.928800  Y20.620300
G1  X16.776800  Y20.681300
G1  X16.614400  Y20.725000
G1  X16.441500  Y20.751100
G1  X16.303800  Y20.759900
G1  X16.257900  Y20.759900
G1  X16.212100  Y20.759700
G1  X16.074600  Y20.750800
G1  X15.902100  Y20.724400
G1  X15.740300  Y20.680800
G1  X15.589300  Y20.619900
G1  X15.448800  Y20.541500
G1  X15.318700  Y20.445700
G1  X15.198900  Y20.332500
G1  X15.114900  Y20.235800
G1  X15.089300  Y20.201700
G1  X15.062600  Y20.166400
G1  X14.990400  Y20.055000
G1  X14.905000  Y19.894000
G1  X14.833100  Y19.718800
G1  X14.774400  Y19.529300
G1  X14.728900  Y19.325600
G1  X14.696700  Y19.107600
G1  X14.677400  Y18.875300
G1  X14.670800  Y18.690400
G1  X14.670800  Y18.628800
G1  X14.670700  Y18.567200
G1  X14.676800  Y18.382400
G1  X14.696100  Y18.150700
G1  X14.728600  Y17.933500
G1  X14.774600  Y17.730700
G1  X14.833800  Y17.542200
G1  X14.905800  Y17.367800
G1  X14.991100  Y17.207500
G1  X15.062900  Y17.096300
G1  X15.089300  Y17.061000
G1  X15.114600  Y17.026700
G1  X15.198200  Y16.929000
G1  X15.318100  Y16.815100
G1  X15.448500  Y16.719000
G1  X15.589600  Y16.640800
G1  X15.741100  Y16.580300
G1  X15.903100  Y16.537200
G1  X16.075400  Y16.511400
G1  X16.212400  Y16.502900
G1  X16.257900  Y16.502900
G1  X16.303600  Y16.502600
G1  X16.440600  Y16.510700
G1  X16.613200  Y16.536400
G1  X16.775700  Y16.579900
G1  X16.927900  Y16.641100
G1  X17.069700  Y16.720000
G1  X17.201100  Y16.816400
G1  X17.321900  Y16.930100
G1  X17.406400  Y17.026900
G1  X17.431900  Y17.061000
G1  X17.458300  Y17.096000
G1  X17.529600  Y17.206400
G1  X17.614400  Y17.366500
G1  X17.686300  Y17.541200
G1  X17.745300  Y17.730400
G1  X17.791100  Y17.934000
G1  X17.824000  Y18.151500
G1  X17.843800  Y18.383200
G1  X17.850400  Y18.567400
G1  X17.850400  Y18.628800
M300 S50 (pen up)
G4 P50 (wait 50ms)
G1  X11.623400  Y19.073600

M300 S30 (pen down)
G4 P50 (wait 50ms)

G1  X11.621900  Y19.163900
G1  X11.592100  Y19.434300
G1  X11.510500  Y19.758200
G1  X11.378200  Y20.044200
G1  X11.246400  Y20.235000
G1  X11.194600  Y20.291200
G1  X11.143400  Y20.346000
G1  X10.967400  Y20.489300
G1  X10.707300  Y20.631400
G1  X10.413600  Y20.717200
G1  X10.167800  Y20.746000
G1  X10.085900  Y20.746000
G1  X9.992740  Y20.745800
G1  X9.713370  Y20.718100
G1  X9.381290  Y20.635700
G1  X9.088760  Y20.498500
G1  X8.892740  Y20.360400
G1  X8.835010  Y20.306300
G1  X8.776580  Y20.251500
G1  X8.624140  Y20.063100
G1  X8.464310  Y19.776100
G1  X8.354710  Y19.444900
G1  X8.303060  Y19.163200
G1  X8.294650  Y19.068500
G1  X11.623400  Y19.073600

M300 S50 (pen up)
G4 P50 (wait 50ms)


(Footer begin)
(end of print job)
M300 S50.00 (pen up)
G4 P50 (wait 50ms)
M300 S255 (turn off servo)
G1 X0 Y0 F3000.00
G1 Z0.00 F150.00 (go up to finished level)
G1 X0.00 Y0.00 F3000.00 (go home)
M18 (drives off)
