G21 (metric ftw)
G90 (absolute mode)
G92 X0.00 Y0.00 Z0.00 (you are here)

M300 S30 (pen down)
G4 P50 (wait 50ms)
M300 S50 (pen up)
G4 P50 (wait 50ms)
M18 (disengage drives)
M01 (Was registration test successful?)
M17 (engage drives if YES, and continue)

(Header end)












G1  X34.076585  Y23.133545

M300 S30 (pen down)
G4 P50 (wait 50ms)

G1  X34.066185  Y23.061745
G1  X34.023285  Y22.847845
G1  X33.947585  Y22.570645
G1  X33.850285  Y22.302745
G1  X33.732385  Y22.045345
G1  X33.595185  Y21.799645
G1  X33.439385  Y21.566145
G1  X33.265985  Y21.346345
G1  X33.075985  Y21.141045
G1  X32.870785  Y20.951145
G1  X32.650885  Y20.777845
G1  X32.417585  Y20.622045
G1  X32.171685  Y20.484645
G1  X31.914385  Y20.366845
G1  X31.646485  Y20.269545
G1  X31.369185  Y20.193845
G1  X31.155285  Y20.150945
G1  X31.083485  Y20.140645
G1  X31.093785  Y20.212445
G1  X31.136685  Y20.426345
G1  X31.212385  Y20.703645
G1  X31.309685  Y20.971445
G1  X31.427585  Y21.228845
G1  X31.564885  Y21.474645
G1  X31.720585  Y21.707945
G1  X31.894085  Y21.927845
G1  X32.083985  Y22.133245
G1  X32.289185  Y22.323145
G1  X32.509085  Y22.496445
G1  X32.742385  Y22.652245
G1  X32.988285  Y22.789545
G1  X33.245585  Y22.907445
G1  X33.513485  Y23.004645
G1  X33.790785  Y23.080345
G1  X34.004685  Y23.123245
G1  X34.076585  Y23.133545
M300 S50 (pen up)
G4 P50 (wait 50ms)
G1  X34.076585  Y18.128645

M300 S30 (pen down)
G4 P50 (wait 50ms)

G1  X34.066185  Y18.056845
G1  X34.023285  Y17.842745
G1  X33.947585  Y17.565245
G1  X33.850285  Y17.297145
G1  X33.732385  Y17.039645
G1  X33.595185  Y16.793845
G1  X33.439385  Y16.560245
G1  X33.265985  Y16.340345
G1  X33.075985  Y16.134945
G1  X32.870785  Y15.944945
G1  X32.650885  Y15.771545
G1  X32.417585  Y15.615745
G1  X32.171685  Y15.478345
G1  X31.914385  Y15.360645
G1  X31.646485  Y15.263245
G1  X31.369185  Y15.187545
G1  X31.155285  Y15.144645
G1  X31.083485  Y15.134345
G1  X31.093785  Y15.206345
G1  X31.136685  Y15.420345
G1  X31.212385  Y15.697745
G1  X31.309685  Y15.965645
G1  X31.427585  Y16.222945
G1  X31.564885  Y16.468845
G1  X31.720585  Y16.702245
G1  X31.894085  Y16.922145
G1  X32.083985  Y17.127445
G1  X32.289185  Y17.317445
G1  X32.509085  Y17.490745
G1  X32.742385  Y17.646545
G1  X32.988285  Y17.783945
G1  X33.245585  Y17.901845
G1  X33.513485  Y17.999345
G1  X33.790785  Y18.075245
G1  X34.004685  Y18.118245
G1  X34.076585  Y18.128645
M300 S50 (pen up)
G4 P50 (wait 50ms)
G1  X32.580085  Y8.153245

M300 S30 (pen down)
G4 P50 (wait 50ms)

G1  X32.606685  Y8.153245
G1  X32.687085  Y8.142445
G1  X32.786885  Y8.111345
G1  X32.877285  Y8.062285
G1  X32.955985  Y7.997285
G1  X33.020985  Y7.918565
G1  X33.070085  Y7.828175
G1  X33.101185  Y7.728355
G1  X33.111985  Y7.647995
G1  X33.111985  Y7.594455
G1  X33.101185  Y7.514105
G1  X33.070085  Y7.414265
G1  X33.020985  Y7.323935
G1  X32.955985  Y7.245175
G1  X32.877285  Y7.180175
G1  X32.786885  Y7.131135
G1  X32.687085  Y7.100085
G1  X32.606685  Y7.089245
G1  X32.553285  Y7.089245
G1  X32.472785  Y7.100085
G1  X32.372985  Y7.131135
G1  X32.282685  Y7.180175
G1  X32.203985  Y7.245175
G1  X32.138985  Y7.323935
G1  X32.089885  Y7.414265
G1  X32.058785  Y7.514105
G1  X32.047985  Y7.594455
G1  X32.047985  Y7.647995
G1  X32.058785  Y7.728355
G1  X32.089885  Y7.828175
G1  X32.138985  Y7.918565
G1  X32.203985  Y7.997285
G1  X32.282685  Y8.062285
G1  X32.372985  Y8.111345
G1  X32.472785  Y8.142445
G1  X32.553285  Y8.153245
G1  X32.580085  Y8.153245
M300 S50 (pen up)
G4 P50 (wait 50ms)
G1  X26.573285  Y5.086855

M300 S30 (pen down)
G4 P50 (wait 50ms)

G1  X26.546485  Y5.086855
G1  X26.466185  Y5.097705
G1  X26.366285  Y5.128745
G1  X26.275885  Y5.177835
G1  X26.197085  Y5.242835
G1  X26.132185  Y5.321565
G1  X26.083085  Y5.411935
G1  X26.051985  Y5.511765
G1  X26.041285  Y5.592115
G1  X26.041285  Y5.645655
G1  X26.051985  Y5.726025
G1  X26.083085  Y5.825835
G1  X26.132185  Y5.916175
G1  X26.197085  Y5.994955
G1  X26.275885  Y6.059955
G1  X26.366285  Y6.108995
G1  X26.466185  Y6.140025
G1  X26.546485  Y6.150825
G1  X26.600085  Y6.150825
G1  X26.680285  Y6.140025
G1  X26.780185  Y6.108995
G1  X26.870485  Y6.059955
G1  X26.949085  Y5.994955
G1  X27.014085  Y5.916175
G1  X27.063085  Y5.825835
G1  X27.094085  Y5.726025
G1  X27.104885  Y5.645655
G1  X27.104885  Y5.592115
G1  X27.094085  Y5.511765
G1  X27.063085  Y5.411935
G1  X27.014085  Y5.321565
G1  X26.949085  Y5.242835
G1  X26.870485  Y5.177835
G1  X26.780185  Y5.128745
G1  X26.680285  Y5.097705
G1  X26.600085  Y5.086855
G1  X26.573285  Y5.086855
M300 S50 (pen up)
G4 P50 (wait 50ms)
G1  X22.568485  Y8.153245

M300 S30 (pen down)
G4 P50 (wait 50ms)

G1  X22.595285  Y8.153245
G1  X22.675585  Y8.142445
G1  X22.775485  Y8.111345
G1  X22.865785  Y8.062285
G1  X22.944685  Y7.997285
G1  X23.009585  Y7.918565
G1  X23.058685  Y7.828175
G1  X23.089585  Y7.728355
G1  X23.100485  Y7.647995
G1  X23.100485  Y7.594455
G1  X23.089585  Y7.514105
G1  X23.058685  Y7.414265
G1  X23.009585  Y7.323935
G1  X22.944685  Y7.245175
G1  X22.865785  Y7.180175
G1  X22.775485  Y7.131135
G1  X22.675585  Y7.100085
G1  X22.595285  Y7.089245
G1  X22.541685  Y7.089245
G1  X22.461485  Y7.100085
G1  X22.361585  Y7.131135
G1  X22.271185  Y7.180175
G1  X22.192385  Y7.245175
G1  X22.127385  Y7.323935
G1  X22.078385  Y7.414265
G1  X22.047285  Y7.514105
G1  X22.036585  Y7.594455
G1  X22.036585  Y7.647995
G1  X22.047285  Y7.728355
G1  X22.078385  Y7.828175
G1  X22.127385  Y7.918565
G1  X22.192385  Y7.997285
G1  X22.271185  Y8.062285
G1  X22.361585  Y8.111345
G1  X22.461485  Y8.142445
G1  X22.541685  Y8.153245
G1  X22.568485  Y8.153245
M300 S50 (pen up)
G4 P50 (wait 50ms)
G1  X24.065085  Y18.128645

M300 S30 (pen down)
G4 P50 (wait 50ms)

G1  X24.054785  Y18.056845
G1  X24.011885  Y17.842745
G1  X23.935985  Y17.565245
G1  X23.838785  Y17.297145
G1  X23.720885  Y17.039645
G1  X23.583685  Y16.793845
G1  X23.427685  Y16.560245
G1  X23.254385  Y16.340345
G1  X23.064385  Y16.134945
G1  X22.859085  Y15.944945
G1  X22.639085  Y15.771545
G1  X22.405585  Y15.615745
G1  X22.159685  Y15.478345
G1  X21.902085  Y15.360645
G1  X21.634085  Y15.263245
G1  X21.356585  Y15.187545
G1  X21.142585  Y15.144645
G1  X21.070585  Y15.134345
G1  X21.080985  Y15.206345
G1  X21.124085  Y15.420345
G1  X21.200085  Y15.697745
G1  X21.297385  Y15.965645
G1  X21.415285  Y16.222945
G1  X21.552685  Y16.468845
G1  X21.708485  Y16.702245
G1  X21.881885  Y16.922145
G1  X22.071685  Y17.127445
G1  X22.277085  Y17.317445
G1  X22.496985  Y17.490745
G1  X22.730285  Y17.646545
G1  X22.976185  Y17.783945
G1  X23.233685  Y17.901845
G1  X23.501585  Y17.999345
G1  X23.778985  Y18.075245
G1  X23.993085  Y18.118245
G1  X24.065085  Y18.128645
M300 S50 (pen up)
G4 P50 (wait 50ms)
G1  X27.077385  Y18.128645

M300 S30 (pen down)
G4 P50 (wait 50ms)

G1  X27.149185  Y18.118245
G1  X27.363385  Y18.075245
G1  X27.640885  Y17.999345
G1  X27.908985  Y17.901845
G1  X28.166485  Y17.783945
G1  X28.412385  Y17.646545
G1  X28.645885  Y17.490745
G1  X28.865885  Y17.317445
G1  X29.071285  Y17.127445
G1  X29.261285  Y16.922145
G1  X29.434685  Y16.702245
G1  X29.590585  Y16.468845
G1  X29.727985  Y16.222945
G1  X29.845885  Y15.965645
G1  X29.943085  Y15.697745
G1  X30.018985  Y15.420345
G1  X30.061685  Y15.206345
G1  X30.072085  Y15.134345
G1  X30.000185  Y15.144645
G1  X29.786285  Y15.187545
G1  X29.509085  Y15.263245
G1  X29.241285  Y15.360645
G1  X28.983785  Y15.478345
G1  X28.737985  Y15.615745
G1  X28.504485  Y15.771545
G1  X28.284685  Y15.944945
G1  X28.079185  Y16.134945
G1  X27.889185  Y16.340345
G1  X27.715785  Y16.560245
G1  X27.559785  Y16.793845
G1  X27.422285  Y17.039645
G1  X27.304185  Y17.297145
G1  X27.206685  Y17.565245
G1  X27.130885  Y17.842745
G1  X27.087685  Y18.056845
G1  X27.077385  Y18.128645
M300 S50 (pen up)
G4 P50 (wait 50ms)
G1  X27.077385  Y23.133545

M300 S30 (pen down)
G4 P50 (wait 50ms)

G1  X27.149185  Y23.123245
G1  X27.363385  Y23.080345
G1  X27.640885  Y23.004645
G1  X27.908985  Y22.907445
G1  X28.166485  Y22.789545
G1  X28.412385  Y22.652245
G1  X28.645885  Y22.496445
G1  X28.865885  Y22.323145
G1  X29.071285  Y22.133245
G1  X29.261285  Y21.927845
G1  X29.434685  Y21.707945
G1  X29.590585  Y21.474645
G1  X29.727985  Y21.228845
G1  X29.845885  Y20.971445
G1  X29.943085  Y20.703645
G1  X30.018985  Y20.426345
G1  X30.061685  Y20.212445
G1  X30.072085  Y20.140645
G1  X30.000185  Y20.150945
G1  X29.786285  Y20.193845
G1  X29.509085  Y20.269545
G1  X29.241285  Y20.366845
G1  X28.983785  Y20.484645
G1  X28.737985  Y20.622045
G1  X28.504485  Y20.777845
G1  X28.284685  Y20.951145
G1  X28.079185  Y21.141045
G1  X27.889185  Y21.346345
G1  X27.715785  Y21.566145
G1  X27.559785  Y21.799645
G1  X27.422285  Y22.045345
G1  X27.304185  Y22.302745
G1  X27.206685  Y22.570645
G1  X27.130885  Y22.847845
G1  X27.087685  Y23.061745
G1  X27.077385  Y23.133545
M300 S50 (pen up)
G4 P50 (wait 50ms)
G1  X24.065085  Y23.133545

M300 S30 (pen down)
G4 P50 (wait 50ms)

G1  X24.054785  Y23.061745
G1  X24.011885  Y22.847845
G1  X23.935985  Y22.570645
G1  X23.838785  Y22.302745
G1  X23.720885  Y22.045345
G1  X23.583685  Y21.799645
G1  X23.427685  Y21.566145
G1  X23.254385  Y21.346345
G1  X23.064385  Y21.141045
G1  X22.859085  Y20.951145
G1  X22.639085  Y20.777845
G1  X22.405585  Y20.622045
G1  X22.159685  Y20.484645
G1  X21.902085  Y20.366845
G1  X21.634085  Y20.269545
G1  X21.356585  Y20.193845
G1  X21.142585  Y20.150945
G1  X21.070585  Y20.140645
G1  X21.080985  Y20.212445
G1  X21.124085  Y20.426345
G1  X21.200085  Y20.703645
G1  X21.297385  Y20.971445
G1  X21.415285  Y21.228845
G1  X21.552685  Y21.474645
G1  X21.708485  Y21.707945
G1  X21.881885  Y21.927845
G1  X22.071685  Y22.133245
G1  X22.277085  Y22.323145
G1  X22.496985  Y22.496445
G1  X22.730285  Y22.652245
G1  X22.976185  Y22.789545
G1  X23.233685  Y22.907445
G1  X23.501585  Y23.004645
G1  X23.778985  Y23.080345
G1  X23.993085  Y23.123245
G1  X24.065085  Y23.133545
M300 S50 (pen up)
G4 P50 (wait 50ms)
G1  X17.065885  Y23.133545

M300 S30 (pen down)
G4 P50 (wait 50ms)

G1  X17.137785  Y23.123245
G1  X17.351885  Y23.080345
G1  X17.629385  Y23.004645
G1  X17.897385  Y22.907445
G1  X18.154885  Y22.789545
G1  X18.400885  Y22.652245
G1  X18.634385  Y22.496445
G1  X18.854385  Y22.323145
G1  X19.059885  Y22.133245
G1  X19.249785  Y21.927845
G1  X19.423285  Y21.707945
G1  X19.579085  Y21.474645
G1  X19.716485  Y21.228845
G1  X19.834385  Y20.971445
G1  X19.931585  Y20.703645
G1  X20.007385  Y20.426345
G1  X20.050285  Y20.212445
G1  X20.060585  Y20.140645
G1  X19.988685  Y20.150945
G1  X19.774685  Y20.193845
G1  X19.497185  Y20.269545
G1  X19.229185  Y20.366845
G1  X18.971685  Y20.484645
G1  X18.725885  Y20.622045
G1  X18.492385  Y20.777845
G1  X18.272585  Y20.951145
G1  X18.067085  Y21.141045
G1  X17.877285  Y21.346345
G1  X17.703785  Y21.566145
G1  X17.547985  Y21.799645
G1  X17.410585  Y22.045345
G1  X17.292685  Y22.302745
G1  X17.195185  Y22.570645
G1  X17.119385  Y22.847845
G1  X17.076285  Y23.061745
G1  X17.065885  Y23.133545
M300 S50 (pen up)
G4 P50 (wait 50ms)
G1  X14.053485  Y23.133545

M300 S30 (pen down)
G4 P50 (wait 50ms)

G1  X14.043285  Y23.061745
G1  X14.000285  Y22.847845
G1  X13.924485  Y22.570645
G1  X13.827285  Y22.302745
G1  X13.709485  Y22.045345
G1  X13.572085  Y21.799645
G1  X13.416285  Y21.566145
G1  X13.242785  Y21.346345
G1  X13.052985  Y21.141045
G1  X12.847585  Y20.951145
G1  X12.627585  Y20.777845
G1  X12.394085  Y20.622045
G1  X12.148185  Y20.484645
G1  X11.890685  Y20.366845
G1  X11.622685  Y20.269545
G1  X11.345085  Y20.193845
G1  X11.131085  Y20.150945
G1  X11.059185  Y20.140645
G1  X11.069485  Y20.212445
G1  X11.112585  Y20.426345
G1  X11.188485  Y20.703645
G1  X11.285985  Y20.971445
G1  X11.403785  Y21.228845
G1  X11.541185  Y21.474645
G1  X11.697085  Y21.707945
G1  X11.870485  Y21.927845
G1  X12.060385  Y22.133245
G1  X12.265785  Y22.323145
G1  X12.485585  Y22.496445
G1  X12.718985  Y22.652245
G1  X12.964885  Y22.789545
G1  X13.222285  Y22.907445
G1  X13.490185  Y23.004645
G1  X13.767585  Y23.080345
G1  X13.981585  Y23.123245
G1  X14.053485  Y23.133545
M300 S50 (pen up)
G4 P50 (wait 50ms)
G1  X14.053485  Y18.128645

M300 S30 (pen down)
G4 P50 (wait 50ms)

G1  X14.043285  Y18.056845
G1  X14.000285  Y17.842745
G1  X13.924485  Y17.565245
G1  X13.827285  Y17.297145
G1  X13.709485  Y17.039645
G1  X13.572085  Y16.793845
G1  X13.416285  Y16.560245
G1  X13.242785  Y16.340345
G1  X13.052985  Y16.134945
G1  X12.847585  Y15.944945
G1  X12.627585  Y15.771545
G1  X12.394085  Y15.615745
G1  X12.148185  Y15.478345
G1  X11.890685  Y15.360645
G1  X11.622685  Y15.263245
G1  X11.345085  Y15.187545
G1  X11.131085  Y15.144645
G1  X11.059185  Y15.134345
G1  X11.069485  Y15.206345
G1  X11.112585  Y15.420345
G1  X11.188485  Y15.697745
G1  X11.285985  Y15.965645
G1  X11.403785  Y16.222945
G1  X11.541185  Y16.468845
G1  X11.697085  Y16.702245
G1  X11.870485  Y16.922145
G1  X12.060385  Y17.127445
G1  X12.265785  Y17.317445
G1  X12.485585  Y17.490745
G1  X12.718985  Y17.646545
G1  X12.964885  Y17.783945
G1  X13.222285  Y17.901845
G1  X13.490185  Y17.999345
G1  X13.767585  Y18.075245
G1  X13.981585  Y18.118245
G1  X14.053485  Y18.128645
M300 S50 (pen up)
G4 P50 (wait 50ms)
G1  X17.065885  Y18.128645

M300 S30 (pen down)
G4 P50 (wait 50ms)

G1  X17.137785  Y18.118245
G1  X17.351885  Y18.075245
G1  X17.629385  Y17.999345
G1  X17.897385  Y17.901845
G1  X18.154885  Y17.783945
G1  X18.400885  Y17.646545
G1  X18.634385  Y17.490745
G1  X18.854385  Y17.317445
G1  X19.059885  Y17.127445
G1  X19.249785  Y16.922145
G1  X19.423285  Y16.702245
G1  X19.579085  Y16.468845
G1  X19.716485  Y16.222945
G1  X19.834385  Y15.965645
G1  X19.931585  Y15.697745
G1  X20.007385  Y15.420345
G1  X20.050285  Y15.206345
G1  X20.060585  Y15.134345
G1  X19.988685  Y15.144645
G1  X19.774685  Y15.187545
G1  X19.497185  Y15.263245
G1  X19.229185  Y15.360645
G1  X18.971685  Y15.478345
G1  X18.725885  Y15.615745
G1  X18.492385  Y15.771545
G1  X18.272585  Y15.944945
G1  X18.067085  Y16.134945
G1  X17.877285  Y16.340345
G1  X17.703785  Y16.560245
G1  X17.547985  Y16.793845
G1  X17.410585  Y17.039645
G1  X17.292685  Y17.297145
G1  X17.195185  Y17.565245
G1  X17.119385  Y17.842745
G1  X17.076285  Y18.056845
G1  X17.065885  Y18.128645
M300 S50 (pen up)
G4 P50 (wait 50ms)
G1  X16.561685  Y5.086855

M300 S30 (pen down)
G4 P50 (wait 50ms)

G1  X16.534885  Y5.086855
G1  X16.454585  Y5.097705
G1  X16.354785  Y5.128745
G1  X16.264485  Y5.177835
G1  X16.185785  Y5.242835
G1  X16.120785  Y5.321565
G1  X16.071585  Y5.411935
G1  X16.040585  Y5.511765
G1  X16.029785  Y5.592115
G1  X16.029785  Y5.645655
G1  X16.040585  Y5.726025
G1  X16.071585  Y5.825835
G1  X16.120785  Y5.916175
G1  X16.185785  Y5.994955
G1  X16.264485  Y6.059955
G1  X16.354785  Y6.108995
G1  X16.454585  Y6.140025
G1  X16.534885  Y6.150825
G1  X16.588385  Y6.150825
G1  X16.668485  Y6.140025
G1  X16.768085  Y6.108995
G1  X16.858385  Y6.059955
G1  X16.937285  Y5.994955
G1  X17.002385  Y5.916175
G1  X17.051685  Y5.825835
G1  X17.082785  Y5.726025
G1  X17.093785  Y5.645655
G1  X17.093785  Y5.592115
G1  X17.082785  Y5.511765
G1  X17.051685  Y5.411935
G1  X17.002385  Y5.321565
G1  X16.937285  Y5.242835
G1  X16.858385  Y5.177835
G1  X16.768085  Y5.128745
G1  X16.668485  Y5.097705
G1  X16.588385  Y5.086855
G1  X16.561685  Y5.086855
M300 S50 (pen up)
G4 P50 (wait 50ms)
G1  X12.556985  Y8.153245

M300 S30 (pen down)
G4 P50 (wait 50ms)

G1  X12.583685  Y8.153245
G1  X12.663785  Y8.142445
G1  X12.763385  Y8.111345
G1  X12.853685  Y8.062285
G1  X12.932585  Y7.997285
G1  X12.997685  Y7.918565
G1  X13.046985  Y7.828175
G1  X13.078085  Y7.728355
G1  X13.089085  Y7.647995
G1  X13.089085  Y7.594455
G1  X13.078085  Y7.514105
G1  X13.046985  Y7.414265
G1  X12.997685  Y7.323935
G1  X12.932585  Y7.245175
G1  X12.853685  Y7.180175
G1  X12.763385  Y7.131135
G1  X12.663785  Y7.100085
G1  X12.583685  Y7.089245
G1  X12.530185  Y7.089245
G1  X12.449885  Y7.100085
G1  X12.350085  Y7.131135
G1  X12.259685  Y7.180175
G1  X12.180985  Y7.245175
G1  X12.115985  Y7.323935
G1  X12.066885  Y7.414265
G1  X12.035885  Y7.514105
G1  X12.025085  Y7.594455
G1  X12.025085  Y7.647995
G1  X12.035885  Y7.728355
G1  X12.066885  Y7.828175
G1  X12.115985  Y7.918565
G1  X12.180985  Y7.997285
G1  X12.259685  Y8.062285
G1  X12.350085  Y8.111345
G1  X12.449885  Y8.142445
G1  X12.530185  Y8.153245
G1  X12.556985  Y8.153245
M300 S50 (pen up)
G4 P50 (wait 50ms)
G1  X6.548895  Y5.086855

M300 S30 (pen down)
G4 P50 (wait 50ms)

G1  X6.522205  Y5.086855
G1  X6.442135  Y5.097705
G1  X6.342525  Y5.128745
G1  X6.252195  Y5.177835
G1  X6.173355  Y5.242835
G1  X6.108205  Y5.321565
G1  X6.058945  Y5.411935
G1  X6.027745  Y5.511765
G1  X6.016895  Y5.592115
G1  X6.016895  Y5.645655
G1  X6.027745  Y5.726025
G1  X6.058945  Y5.825835
G1  X6.108205  Y5.916175
G1  X6.173355  Y5.994955
G1  X6.252195  Y6.059955
G1  X6.342525  Y6.108995
G1  X6.442135  Y6.140025
G1  X6.522205  Y6.150825
G1  X6.575645  Y6.150825
G1  X6.655995  Y6.140025
G1  X6.755825  Y6.108995
G1  X6.846165  Y6.059955
G1  X6.924945  Y5.994955
G1  X6.989925  Y5.916175
G1  X7.038985  Y5.825835
G1  X7.070015  Y5.726025
G1  X7.080855  Y5.645655
G1  X7.080855  Y5.592115
G1  X7.070015  Y5.511765
G1  X7.038985  Y5.411935
G1  X6.989925  Y5.321565
G1  X6.924945  Y5.242835
G1  X6.846165  Y5.177835
G1  X6.755825  Y5.128745
G1  X6.655995  Y5.097705
G1  X6.575645  Y5.086855
G1  X6.548895  Y5.086855
M300 S50 (pen up)
G4 P50 (wait 50ms)
G1  X7.054445  Y18.128645

M300 S30 (pen down)
G4 P50 (wait 50ms)

G1  X7.126325  Y18.118245
G1  X7.340415  Y18.075245
G1  X7.617855  Y17.999345
G1  X7.885815  Y17.901845
G1  X8.143245  Y17.783945
G1  X8.389175  Y17.646545
G1  X8.622585  Y17.490745
G1  X8.842485  Y17.317445
G1  X9.047885  Y17.127445
G1  X9.237785  Y16.922145
G1  X9.411185  Y16.702245
G1  X9.566985  Y16.468845
G1  X9.704485  Y16.222945
G1  X9.822385  Y15.965645
G1  X9.919785  Y15.697745
G1  X9.995685  Y15.420345
G1  X10.038785  Y15.206345
G1  X10.049185  Y15.134345
G1  X9.977185  Y15.144645
G1  X9.763185  Y15.187545
G1  X9.485685  Y15.263245
G1  X9.217685  Y15.360645
G1  X8.960085  Y15.478345
G1  X8.714085  Y15.615745
G1  X8.480595  Y15.771545
G1  X8.260605  Y15.944945
G1  X8.055145  Y16.134945
G1  X7.865205  Y16.340345
G1  X7.691805  Y16.560245
G1  X7.535885  Y16.793845
G1  X7.398505  Y17.039645
G1  X7.280675  Y17.297145
G1  X7.183395  Y17.565245
G1  X7.107605  Y17.842745
G1  X7.064745  Y18.056845
G1  X7.054445  Y18.128645
M300 S50 (pen up)
G4 P50 (wait 50ms)
G1  X7.054445  Y23.133545

M300 S30 (pen down)
G4 P50 (wait 50ms)

G1  X7.126325  Y23.123245
G1  X7.340415  Y23.080345
G1  X7.617855  Y23.004645
G1  X7.885815  Y22.907445
G1  X8.143245  Y22.789545
G1  X8.389175  Y22.652245
G1  X8.622585  Y22.496445
G1  X8.842485  Y22.323145
G1  X9.047885  Y22.133245
G1  X9.237785  Y21.927845
G1  X9.411185  Y21.707945
G1  X9.566985  Y21.474645
G1  X9.704485  Y21.228845
G1  X9.822385  Y20.971445
G1  X9.919785  Y20.703645
G1  X9.995685  Y20.426345
G1  X10.038785  Y20.212445
G1  X10.049185  Y20.140645
G1  X9.977185  Y20.150945
G1  X9.763185  Y20.193845
G1  X9.485685  Y20.269545
G1  X9.217685  Y20.366845
G1  X8.960085  Y20.484645
G1  X8.714085  Y20.622045
G1  X8.480595  Y20.777845
G1  X8.260605  Y20.951145
G1  X8.055145  Y21.141045
G1  X7.865205  Y21.346345
G1  X7.691805  Y21.566145
G1  X7.535885  Y21.799645
G1  X7.398505  Y22.045345
G1  X7.280675  Y22.302745
G1  X7.183395  Y22.570645
G1  X7.107605  Y22.847845
G1  X7.064745  Y23.061745
G1  X7.054445  Y23.133545
M300 S50 (pen up)
G4 P50 (wait 50ms)
G1  X7.054445  Y28.140245

M300 S30 (pen down)
G4 P50 (wait 50ms)

G1  X7.126325  Y28.129945
G1  X7.340415  Y28.087045
G1  X7.617855  Y28.011145
G1  X7.885815  Y27.913945
G1  X8.143245  Y27.796145
G1  X8.389175  Y27.658645
G1  X8.622585  Y27.502845
G1  X8.842485  Y27.329345
G1  X9.047885  Y27.139545
G1  X9.237785  Y26.934045
G1  X9.411185  Y26.714045
G1  X9.566985  Y26.480645
G1  X9.704485  Y26.234645
G1  X9.822385  Y25.977145
G1  X9.919785  Y25.709245
G1  X9.995685  Y25.431745
G1  X10.038785  Y25.217745
G1  X10.049185  Y25.145745
G1  X9.977185  Y25.156145
G1  X9.763185  Y25.199245
G1  X9.485685  Y25.275045
G1  X9.217685  Y25.372445
G1  X8.960085  Y25.490345
G1  X8.714085  Y25.627745
G1  X8.480595  Y25.783545
G1  X8.260605  Y25.956845
G1  X8.055145  Y26.146845
G1  X7.865205  Y26.352145
G1  X7.691805  Y26.572045
G1  X7.535885  Y26.805445
G1  X7.398505  Y27.051345
G1  X7.280675  Y27.308845
G1  X7.183395  Y27.576745
G1  X7.107605  Y27.854245
G1  X7.064745  Y28.068245
G1  X7.054445  Y28.140245
M300 S50 (pen up)
G4 P50 (wait 50ms)
G1  X2.256315  Y35.777145

M300 S30 (pen down)
G4 P50 (wait 50ms)

G1  X3.598165  Y35.777145
G1  X3.828745  Y35.757745
G1  X4.091765  Y35.699345
G1  X4.310305  Y35.602145
G1  X4.446205  Y35.504945
G1  X4.484455  Y35.465645
G1  X4.522425  Y35.427745
G1  X4.616605  Y35.293845
G1  X4.710955  Y35.080245
G1  X4.767555  Y34.824645
G1  X4.786425  Y34.601545
G1  X4.786425  Y34.143445
G1  X4.777695  Y33.991745
G1  X4.751485  Y33.809045
G1  X4.707875  Y33.646045
G1  X4.646775  Y33.502445
G1  X4.568275  Y33.378445
G1  X4.472355  Y33.273845
G1  X4.359015  Y33.188845
G1  X4.262125  Y33.136745
G1  X4.228315  Y33.123145
G1  X4.228315  Y33.106545
G1  X4.265215  Y33.095445
G1  X4.371715  Y33.047945
G1  X4.491825  Y32.965045
G1  X4.588675  Y32.857845
G1  X4.647375  Y32.760745
G1  X4.662245  Y32.726345
G1  X4.679555  Y32.688845
G1  X4.720075  Y32.570745
G1  X4.761415  Y32.391045
G1  X4.786205  Y32.187145
G1  X4.794515  Y32.015745
G1  X4.794515  Y30.950745
G1  X4.798525  Y30.791845
G1  X4.807315  Y30.647845
G1  X4.809705  Y30.623345
G1  X4.812415  Y30.599945
G1  X4.876595  Y30.367145
G1  X4.886955  Y30.343645
G1  X4.018785  Y30.343645
G1  X4.010815  Y30.365745
G1  X3.959125  Y30.573445
G1  X3.956675  Y30.592945
G1  X3.953915  Y30.612445
G1  X3.944305  Y30.755445
G1  X3.940125  Y30.947745
G1  X3.940125  Y32.048645
G1  X3.932375  Y32.177545
G1  X3.909145  Y32.321545
G1  X3.870415  Y32.437445
G1  X3.832645  Y32.505445
G1  X3.816265  Y32.524745
G1  X3.801775  Y32.543245
G1  X3.746985  Y32.589245
G1  X3.655245  Y32.635345
G1  X3.541355  Y32.663145
G1  X3.439525  Y32.672245
G1  X3.110705  Y32.672245
G1  X3.110705  Y30.343645
G1  X2.256315  Y30.343645
G1  X2.256315  Y35.777145
M300 S50 (pen up)
G4 P50 (wait 50ms)
G1  X5.378705  Y35.777145

M300 S30 (pen down)
G4 P50 (wait 50ms)

G1  X7.707765  Y35.777145
G1  X7.707765  Y34.999945
G1  X6.233145  Y34.999945
G1  X6.233145  Y33.565445
G1  X7.404745  Y33.565445
G1  X7.404745  Y32.788445
G1  X6.233145  Y32.788445
G1  X6.233145  Y31.119345
G1  X7.707765  Y31.119345
G1  X7.707765  Y30.343645
G1  X5.378705  Y30.343645
G1  X5.378705  Y35.777145
M300 S50 (pen up)
G4 P50 (wait 50ms)
G1  X9.324185  Y30.266345

M300 S30 (pen down)
G4 P50 (wait 50ms)

G1  X9.251185  Y30.266345
G1  X9.032185  Y30.288145
G1  X8.778385  Y30.353345
G1  X8.562465  Y30.462245
G1  X8.423575  Y30.571845
G1  X8.384415  Y30.614945
G1  X8.344425  Y30.659745
G1  X8.245025  Y30.812745
G1  X8.145635  Y31.048145
G1  X8.086005  Y31.321145
G1  X8.066205  Y31.554345
G1  X8.066205  Y31.942045
G1  X8.873685  Y31.942045
G1  X8.873685  Y31.538945
G1  X8.880585  Y31.446345
G1  X8.901285  Y31.339245
G1  X8.935885  Y31.248545
G1  X8.984285  Y31.174245
G1  X9.046485  Y31.116545
G1  X9.122485  Y31.075245
G1  X9.212385  Y31.050445
G1  X9.290185  Y31.042145
G1  X9.341485  Y31.042145
G1  X9.417785  Y31.049945
G1  X9.505985  Y31.073245
G1  X9.580485  Y31.112145
G1  X9.628085  Y31.151045
G1  X9.641385  Y31.166345
G1  X9.656385  Y31.183245
G1  X9.692685  Y31.242045
G1  X9.729285  Y31.337045
G1  X9.751185  Y31.451145
G1  X9.758485  Y31.551545
G1  X9.758485  Y31.626545
G1  X9.748585  Y31.751045
G1  X9.719285  Y31.905945
G1  X9.670485  Y32.049945
G1  X9.621785  Y32.151445
G1  X9.602585  Y32.183445
G1  X9.581385  Y32.219345
G1  X9.508485  Y32.321845
G1  X9.381485  Y32.472845
G1  X9.221685  Y32.636045
G1  X9.078385  Y32.768945
G1  X9.029285  Y32.811745
G1  X8.966685  Y32.866845
G1  X8.784785  Y33.039245
G1  X8.580385  Y33.254645
G1  X8.415715  Y33.458445
G1  X8.318705  Y33.601045
G1  X8.290555  Y33.650845
G1  X8.264565  Y33.698145
G1  X8.199195  Y33.846145
G1  X8.133815  Y34.053645
G1  X8.094485  Y34.272945
G1  X8.081345  Y34.446145
G1  X8.081345  Y34.579945
G1  X8.101695  Y34.807845
G1  X8.162885  Y35.074645
G1  X8.264825  Y35.304345
G1  X8.366945  Y35.453845
G1  X8.407675  Y35.497245
G1  X8.447825  Y35.541345
G1  X8.589385  Y35.653845
G1  X8.807785  Y35.765345
G1  X9.062785  Y35.832145
G1  X9.281585  Y35.854345
G1  X9.426485  Y35.854345
G1  X9.642285  Y35.832145
G1  X9.892085  Y35.765345
G1  X10.103785  Y35.653845
G1  X10.239685  Y35.541145
G1  X10.277785  Y35.497245
G1  X10.317685  Y35.453545
G1  X10.417085  Y35.303345
G1  X10.516685  Y35.070645
G1  X10.576385  Y34.799045
G1  X10.596285  Y34.566345
G1  X10.596285  Y34.262745
G1  X9.788385  Y34.262745
G1  X9.788385  Y34.574945
G1  X9.781685  Y34.672445
G1  X9.761685  Y34.783145
G1  X9.728185  Y34.874545
G1  X9.695085  Y34.930345
G1  X9.681185  Y34.946345
G1  X9.667885  Y34.962445
G1  X9.620185  Y35.004245
G1  X9.546785  Y35.045645
G1  X9.460885  Y35.070345
G1  X9.387185  Y35.078645
G1  X9.337585  Y35.078645
G1  X9.262485  Y35.070445
G1  X9.175685  Y35.046145
G1  X9.102285  Y35.005445
G1  X9.042285  Y34.948445
G1  X8.995685  Y34.875245
G1  X8.962385  Y34.785645
G1  X8.942385  Y34.679745
G1  X8.935785  Y34.588145
G1  X8.935785  Y34.486445
G1  X8.974785  Y34.272945
G1  X9.065485  Y34.050345
G1  X9.091385  Y34.007945
G1  X9.113485  Y33.972845
G1  X9.188185  Y33.872745
G1  X9.317485  Y33.723945
G1  X9.478985  Y33.561745
G1  X9.623385  Y33.429045
G1  X9.672785  Y33.386345
G1  X9.735985  Y33.331345
G1  X9.919585  Y33.158945
G1  X10.124585  Y32.942045
G1  X10.287985  Y32.735645
G1  X10.382985  Y32.590745
G1  X10.410085  Y32.540045
G1  X10.435485  Y32.492245
G1  X10.498485  Y32.341745
G1  X10.561385  Y32.126745
G1  X10.598985  Y31.895345
G1  X10.611485  Y31.709245
G1  X10.611485  Y31.568645
G1  X10.590685  Y31.333545
G1  X10.528385  Y31.058245
G1  X10.424085  Y30.821545
G1  X10.319485  Y30.667945
G1  X10.277785  Y30.623345
G1  X10.237785  Y30.579345
G1  X10.096385  Y30.467045
G1  X9.876985  Y30.355445
G1  X9.619585  Y30.288645
G1  X9.397985  Y30.266345
G1  X9.324185  Y30.266345
M300 S50 (pen up)
G4 P50 (wait 50ms)
G1  X11.093685  Y35.777145

M300 S30 (pen down)
G4 P50 (wait 50ms)

G1  X12.426085  Y35.777145
G1  X12.649385  Y35.755745
G1  X12.907685  Y35.691545
G1  X13.126285  Y35.584645
G1  X13.265885  Y35.477545
G1  X13.305285  Y35.435345
G1  X13.345285  Y35.392545
G1  X13.444685  Y35.244745
G1  X13.544185  Y35.014045
G1  X13.603985  Y34.743845
G1  X13.623785  Y34.511345
G1  X13.623785  Y33.821445
G1  X13.603985  Y33.588945
G1  X13.544185  Y33.318345
G1  X13.444685  Y33.087845
G1  X13.345285  Y32.939945
G1  X13.305285  Y32.897045
G1  X13.265885  Y32.854745
G1  X13.126285  Y32.747845
G1  X12.907685  Y32.640845
G1  X12.649385  Y32.576545
G1  X12.426085  Y32.555245
G1  X11.948185  Y32.555245
G1  X11.948185  Y30.343645
G1  X11.093685  Y30.343645
G1  X11.093685  Y35.777145
M300 S50 (pen up)
G4 P50 (wait 50ms)
G1  X14.095185  Y35.777145

M300 S30 (pen down)
G4 P50 (wait 50ms)

G1  X14.949685  Y35.777145
G1  X14.949685  Y30.343645
G1  X14.095185  Y30.343645
G1  X14.095185  Y35.777145
M300 S50 (pen up)
G4 P50 (wait 50ms)
G1  X15.580285  Y35.777145

M300 S30 (pen down)
G4 P50 (wait 50ms)

G1  X16.922285  Y35.777145
G1  X17.152785  Y35.757745
G1  X17.415985  Y35.699345
G1  X17.634585  Y35.602145
G1  X17.770585  Y35.504945
G1  X17.808785  Y35.465645
G1  X17.846685  Y35.427745
G1  X17.940785  Y35.293845
G1  X18.035085  Y35.080245
G1  X18.091585  Y34.824645
G1  X18.110485  Y34.601545
G1  X18.110485  Y34.143445
G1  X18.101685  Y33.991745
G1  X18.075585  Y33.809045
G1  X18.031985  Y33.646045
G1  X17.970985  Y33.502445
G1  X17.892585  Y33.378445
G1  X17.796585  Y33.273845
G1  X17.683285  Y33.188845
G1  X17.586185  Y33.136745
G1  X17.552385  Y33.123145
G1  X17.552385  Y33.106545
G1  X17.589185  Y33.095445
G1  X17.695785  Y33.047945
G1  X17.815885  Y32.965045
G1  X17.912785  Y32.857845
G1  X17.971685  Y32.760745
G1  X17.986685  Y32.726345
G1  X18.003985  Y32.688845
G1  X18.044485  Y32.570745
G1  X18.085885  Y32.391045
G1  X18.110585  Y32.187145
G1  X18.118985  Y32.015745
G1  X18.118985  Y30.950745
G1  X18.122785  Y30.791845
G1  X18.131585  Y30.647845
G1  X18.134085  Y30.623345
G1  X18.136885  Y30.599945
G1  X18.161185  Y30.483545
G1  X18.200985  Y30.367145
G1  X18.211485  Y30.343645
G1  X17.343085  Y30.343645
G1  X17.335185  Y30.365745
G1  X17.283385  Y30.573445
G1  X17.281185  Y30.592945
G1  X17.278385  Y30.612445
G1  X17.268685  Y30.755445
G1  X17.264485  Y30.947745
G1  X17.264485  Y32.048645
G1  X17.256685  Y32.177545
G1  X17.233485  Y32.321545
G1  X17.194685  Y32.437445
G1  X17.156685  Y32.505445
G1  X17.140285  Y32.524745
G1  X17.125885  Y32.543245
G1  X17.071285  Y32.589245
G1  X16.979685  Y32.635345
G1  X16.865585  Y32.663145
G1  X16.763685  Y32.672245
G1  X16.434785  Y32.672245
G1  X16.434785  Y30.343645
G1  X15.580285  Y30.343645
G1  X15.580285  Y35.777145
M300 S50 (pen up)
G4 P50 (wait 50ms)
G1  X14.053485  Y28.140245

M300 S30 (pen down)
G4 P50 (wait 50ms)

G1  X14.043285  Y28.068245
G1  X14.000285  Y27.854245
G1  X13.924485  Y27.576745
G1  X13.827285  Y27.308645
G1  X13.709485  Y27.051145
G1  X13.572085  Y26.805245
G1  X13.416285  Y26.571745
G1  X13.242785  Y26.351745
G1  X13.052985  Y26.146345
G1  X12.847585  Y25.956345
G1  X12.627585  Y25.782945
G1  X12.394085  Y25.627045
G1  X12.148185  Y25.489745
G1  X11.890685  Y25.371845
G1  X11.622685  Y25.274645
G1  X11.345085  Y25.198945
G1  X11.131085  Y25.156045
G1  X11.059185  Y25.145745
G1  X11.069485  Y25.217745
G1  X11.112585  Y25.431745
G1  X11.188485  Y25.709245
G1  X11.285985  Y25.977145
G1  X11.403785  Y26.234645
G1  X11.541185  Y26.480645
G1  X11.697085  Y26.714045
G1  X11.870485  Y26.934045
G1  X12.060385  Y27.139545
G1  X12.265785  Y27.329345
G1  X12.485585  Y27.502845
G1  X12.718985  Y27.658645
G1  X12.964885  Y27.796145
G1  X13.222285  Y27.913945
G1  X13.490185  Y28.011145
G1  X13.767585  Y28.087045
G1  X13.981585  Y28.129945
G1  X14.053485  Y28.140245
M300 S50 (pen up)
G4 P50 (wait 50ms)
G1  X17.065885  Y28.140245

M300 S30 (pen down)
G4 P50 (wait 50ms)

G1  X17.137785  Y28.129945
G1  X17.351885  Y28.087045
G1  X17.629385  Y28.011145
G1  X17.897385  Y27.913945
G1  X18.154885  Y27.796145
G1  X18.400885  Y27.658645
G1  X18.634385  Y27.502845
G1  X18.854385  Y27.329345
G1  X19.059885  Y27.139545
G1  X19.249785  Y26.934045
G1  X19.423285  Y26.714045
G1  X19.579085  Y26.480645
G1  X19.716485  Y26.234645
G1  X19.834385  Y25.977145
G1  X19.931585  Y25.709245
G1  X20.007385  Y25.431745
G1  X20.050285  Y25.217745
G1  X20.060585  Y25.145745
G1  X19.988685  Y25.156145
G1  X19.774685  Y25.199245
G1  X19.497185  Y25.275045
G1  X19.229185  Y25.372445
G1  X18.971685  Y25.490345
G1  X18.725885  Y25.627745
G1  X18.492385  Y25.783545
G1  X18.272585  Y25.956845
G1  X18.067085  Y26.146845
G1  X17.877285  Y26.352145
G1  X17.703785  Y26.572045
G1  X17.547985  Y26.805445
G1  X17.410585  Y27.051345
G1  X17.292685  Y27.308845
G1  X17.195185  Y27.576745
G1  X17.119385  Y27.854245
G1  X17.076285  Y28.068245
G1  X17.065885  Y28.140245
M300 S50 (pen up)
G4 P50 (wait 50ms)
G1  X19.363285  Y35.777145

M300 S30 (pen down)
G4 P50 (wait 50ms)

G1  X20.519185  Y35.777145
G1  X21.403985  Y30.343645
G1  X20.550985  Y30.343645
G1  X20.395485  Y31.422845
G1  X20.395485  Y31.407545
G1  X19.425285  Y31.407545
G1  X19.269785  Y30.343645
G1  X18.478385  Y30.343645
G1  X19.363285  Y35.777145
M300 S50 (pen up)
G4 P50 (wait 50ms)
G1  X24.065085  Y28.140245

M300 S30 (pen down)
G4 P50 (wait 50ms)

G1  X24.054785  Y28.068245
G1  X24.011885  Y27.854245
G1  X23.935985  Y27.576745
G1  X23.838785  Y27.308645
G1  X23.720885  Y27.051145
G1  X23.583685  Y26.805245
G1  X23.427685  Y26.571745
G1  X23.254385  Y26.351745
G1  X23.064385  Y26.146345
G1  X22.859085  Y25.956345
G1  X22.639085  Y25.782945
G1  X22.405585  Y25.627045
G1  X22.159685  Y25.489745
G1  X21.902085  Y25.371845
G1  X21.634085  Y25.274645
G1  X21.356585  Y25.198945
G1  X21.142585  Y25.156045
G1  X21.070585  Y25.145745
G1  X21.080985  Y25.217745
G1  X21.124085  Y25.431745
G1  X21.200085  Y25.709245
G1  X21.297385  Y25.977145
G1  X21.415285  Y26.234645
G1  X21.552685  Y26.480645
G1  X21.708485  Y26.714045
G1  X21.881885  Y26.934045
G1  X22.071685  Y27.139545
G1  X22.277085  Y27.329345
G1  X22.496985  Y27.502845
G1  X22.730285  Y27.658645
G1  X22.976185  Y27.796145
G1  X23.233685  Y27.913945
G1  X23.501585  Y28.011145
G1  X23.778985  Y28.087045
G1  X23.993085  Y28.129945
G1  X24.065085  Y28.140245
M300 S50 (pen up)
G4 P50 (wait 50ms)
G1  X24.864385  Y30.266345

M300 S30 (pen down)
G4 P50 (wait 50ms)

G1  X24.791285  Y30.266345
G1  X24.572285  Y30.288145
G1  X24.318385  Y30.353345
G1  X24.102585  Y30.462245
G1  X23.963685  Y30.571845
G1  X23.924585  Y30.614945
G1  X23.884585  Y30.659745
G1  X23.785185  Y30.812745
G1  X23.685785  Y31.048145
G1  X23.625885  Y31.321145
G1  X23.605985  Y31.554345
G1  X23.605985  Y31.942045
G1  X24.413985  Y31.942045
G1  X24.413985  Y31.538945
G1  X24.420785  Y31.446345
G1  X24.441585  Y31.339245
G1  X24.476185  Y31.248545
G1  X24.524485  Y31.174245
G1  X24.586585  Y31.116545
G1  X24.662585  Y31.075245
G1  X24.752385  Y31.050445
G1  X24.830085  Y31.042145
G1  X24.881285  Y31.042145
G1  X24.957785  Y31.049945
G1  X25.045985  Y31.073245
G1  X25.120585  Y31.112145
G1  X25.167985  Y31.151045
G1  X25.181185  Y31.166345
G1  X25.196285  Y31.183245
G1  X25.232685  Y31.242045
G1  X25.269185  Y31.337045
G1  X25.290985  Y31.451145
G1  X25.298285  Y31.551545
G1  X25.298285  Y31.626545
G1  X25.288485  Y31.751045
G1  X25.259185  Y31.905945
G1  X25.210585  Y32.049945
G1  X25.161985  Y32.151445
G1  X25.142785  Y32.183445
G1  X25.121685  Y32.219345
G1  X25.048685  Y32.321845
G1  X24.921685  Y32.472845
G1  X24.761885  Y32.636045
G1  X24.618485  Y32.768945
G1  X24.569485  Y32.811745
G1  X24.506885  Y32.866845
G1  X24.325085  Y33.039245
G1  X24.120785  Y33.254645
G1  X23.956585  Y33.458445
G1  X23.860085  Y33.601045
G1  X23.832185  Y33.650845
G1  X23.805985  Y33.697945
G1  X23.739885  Y33.846145
G1  X23.674085  Y34.053645
G1  X23.634385  Y34.272945
G1  X23.621185  Y34.446145
G1  X23.621185  Y34.579945
G1  X23.641585  Y34.807845
G1  X23.702985  Y35.074645
G1  X23.804885  Y35.304345
G1  X23.907085  Y35.453845
G1  X23.947785  Y35.497245
G1  X23.987985  Y35.541345
G1  X24.129485  Y35.653845
G1  X24.347785  Y35.765345
G1  X24.602985  Y35.832145
G1  X24.821885  Y35.854345
G1  X24.966685  Y35.854345
G1  X25.182585  Y35.832145
G1  X25.432285  Y35.765345
G1  X25.644085  Y35.653845
G1  X25.779885  Y35.541145
G1  X25.817985  Y35.497245
G1  X25.857785  Y35.453545
G1  X25.957285  Y35.303345
G1  X26.056685  Y35.070645
G1  X26.116285  Y34.799045
G1  X26.136185  Y34.566345
G1  X26.136185  Y34.262745
G1  X25.328685  Y34.262745
G1  X25.328685  Y34.574945
G1  X25.321985  Y34.672445
G1  X25.301885  Y34.783145
G1  X25.268385  Y34.874545
G1  X25.235285  Y34.930345
G1  X25.221485  Y34.946345
G1  X25.208085  Y34.962445
G1  X25.160285  Y35.004245
G1  X25.086985  Y35.045645
G1  X25.001185  Y35.070345
G1  X24.927385  Y35.078645
G1  X24.877785  Y35.078645
G1  X24.802685  Y35.070445
G1  X24.715885  Y35.046145
G1  X24.642385  Y35.005445
G1  X24.582285  Y34.948445
G1  X24.535585  Y34.875245
G1  X24.502285  Y34.785645
G1  X24.482285  Y34.679745
G1  X24.475585  Y34.588145
G1  X24.475585  Y34.486445
G1  X24.514785  Y34.272945
G1  X24.605785  Y34.050345
G1  X24.631585  Y34.007945
G1  X24.653685  Y33.972845
G1  X24.728385  Y33.872745
G1  X24.857585  Y33.723945
G1  X25.019185  Y33.561745
G1  X25.163685  Y33.429045
G1  X25.212985  Y33.386345
G1  X25.276185  Y33.331345
G1  X25.459785  Y33.158945
G1  X25.664785  Y32.942045
G1  X25.828285  Y32.735645
G1  X25.923285  Y32.590745
G1  X25.950285  Y32.540045
G1  X25.975785  Y32.492245
G1  X26.038685  Y32.341745
G1  X26.101485  Y32.126745
G1  X26.138985  Y31.895345
G1  X26.151285  Y31.709245
G1  X26.151285  Y31.568645
G1  X26.130585  Y31.333545
G1  X26.068385  Y31.058245
G1  X25.964185  Y30.821545
G1  X25.859785  Y30.667945
G1  X25.817985  Y30.623345
G1  X25.777985  Y30.579345
G1  X25.636585  Y30.467045
G1  X25.417185  Y30.355445
G1  X25.159685  Y30.288645
G1  X24.938085  Y30.266345
G1  X24.864385  Y30.266345
M300 S50 (pen up)
G4 P50 (wait 50ms)
G1  X27.077385  Y28.140245

M300 S30 (pen down)
G4 P50 (wait 50ms)

G1  X27.149185  Y28.129945
G1  X27.363385  Y28.087045
G1  X27.640885  Y28.011145
G1  X27.908985  Y27.913945
G1  X28.166485  Y27.796145
G1  X28.412385  Y27.658645
G1  X28.645885  Y27.502845
G1  X28.865885  Y27.329345
G1  X29.071285  Y27.139545
G1  X29.261285  Y26.934045
G1  X29.434685  Y26.714045
G1  X29.590585  Y26.480645
G1  X29.727985  Y26.234645
G1  X29.845885  Y25.977145
G1  X29.943085  Y25.709245
G1  X30.018985  Y25.431745
G1  X30.061685  Y25.217745
G1  X30.072085  Y25.145745
G1  X30.000185  Y25.156145
G1  X29.786285  Y25.199245
G1  X29.509085  Y25.275045
G1  X29.241285  Y25.372445
G1  X28.983785  Y25.490345
G1  X28.737985  Y25.627745
G1  X28.504485  Y25.783545
G1  X28.284685  Y25.956845
G1  X28.079185  Y26.146845
G1  X27.889185  Y26.352145
G1  X27.715785  Y26.572045
G1  X27.559785  Y26.805445
G1  X27.422285  Y27.051345
G1  X27.304185  Y27.308845
G1  X27.206685  Y27.576745
G1  X27.130885  Y27.854245
G1  X27.087685  Y28.068245
G1  X27.077385  Y28.140245
M300 S50 (pen up)
G4 P50 (wait 50ms)
G1  X27.875285  Y30.266345

M300 S30 (pen down)
G4 P50 (wait 50ms)

G1  X27.802385  Y30.266345
G1  X27.583685  Y30.288145
G1  X27.328685  Y30.353345
G1  X27.110285  Y30.462245
G1  X26.968785  Y30.571845
G1  X26.928485  Y30.614945
G1  X26.887785  Y30.659745
G1  X26.786485  Y30.812745
G1  X26.684885  Y31.048145
G1  X26.623985  Y31.321145
G1  X26.603485  Y31.554345
G1  X26.603485  Y35.777145
G1  X27.456585  Y35.777145
G1  X27.456585  Y31.537445
G1  X27.463285  Y31.439945
G1  X27.483485  Y31.329345
G1  X27.517585  Y31.238145
G1  X27.551185  Y31.182245
G1  X27.565285  Y31.166345
G1  X27.584685  Y31.145645
G1  X27.704785  Y31.073245
G1  X27.845185  Y31.042145
G1  X27.916485  Y31.042145
G1  X27.990085  Y31.049945
G1  X28.075585  Y31.073245
G1  X28.148485  Y31.112145
G1  X28.195585  Y31.151145
G1  X28.208785  Y31.166345
G1  X28.223785  Y31.182145
G1  X28.260185  Y31.238145
G1  X28.296885  Y31.329345
G1  X28.318685  Y31.439945
G1  X28.325885  Y31.537445
G1  X28.325885  Y35.777145
G1  X29.148485  Y35.777145
G1  X29.148485  Y31.554345
G1  X29.128085  Y31.321145
G1  X29.066985  Y31.048145
G1  X28.965085  Y30.812745
G1  X28.862985  Y30.659645
G1  X28.822285  Y30.614945
G1  X28.782185  Y30.571845
G1  X28.641185  Y30.462245
G1  X28.423085  Y30.353345
G1  X28.167785  Y30.288145
G1  X27.948385  Y30.266345
G1  X27.875285  Y30.266345
M300 S50 (pen up)
G4 P50 (wait 50ms)
G1  X29.756285  Y35.777145

M300 S30 (pen down)
G4 P50 (wait 50ms)

G1  X32.085485  Y35.777145
G1  X32.085485  Y34.999945
G1  X30.610785  Y34.999945
G1  X30.610785  Y33.565445
G1  X31.781985  Y33.565445
G1  X31.781985  Y32.788445
G1  X30.610785  Y32.788445
G1  X30.610785  Y31.119345
G1  X32.085485  Y31.119345
G1  X32.085485  Y30.343645
G1  X29.756285  Y30.343645
G1  X29.756285  Y35.777145
M300 S50 (pen up)
G4 P50 (wait 50ms)
G1  X32.575785  Y35.777145

M300 S30 (pen down)
G4 P50 (wait 50ms)

G1  X33.430185  Y35.777145
G1  X33.430185  Y31.119345
G1  X34.834685  Y31.119345
G1  X34.834685  Y30.343645
G1  X32.575785  Y30.343645
G1  X32.575785  Y35.777145
M300 S50 (pen up)
G4 P50 (wait 50ms)
G1  X34.076585  Y28.140245

M300 S30 (pen down)
G4 P50 (wait 50ms)

G1  X34.066185  Y28.068245
G1  X34.023285  Y27.854245
G1  X33.947585  Y27.576745
G1  X33.850285  Y27.308645
G1  X33.732385  Y27.051145
G1  X33.595185  Y26.805245
G1  X33.439385  Y26.571745
G1  X33.265985  Y26.351745
G1  X33.075985  Y26.146345
G1  X32.870785  Y25.956345
G1  X32.650885  Y25.782945
G1  X32.417585  Y25.627045
G1  X32.171685  Y25.489745
G1  X31.914385  Y25.371845
G1  X31.646485  Y25.274645
G1  X31.369185  Y25.198945
G1  X31.155285  Y25.156045
G1  X31.083485  Y25.145745
G1  X31.093785  Y25.217745
G1  X31.136685  Y25.431745
G1  X31.212385  Y25.709245
G1  X31.309685  Y25.977145
G1  X31.427585  Y26.234645
G1  X31.564885  Y26.480645
G1  X31.720585  Y26.714045
G1  X31.894085  Y26.934045
G1  X32.083985  Y27.139545
G1  X32.289185  Y27.329345
G1  X32.509085  Y27.502845
G1  X32.742385  Y27.658645
G1  X32.988285  Y27.796145
G1  X33.245585  Y27.913945
G1  X33.513485  Y28.011145
G1  X33.790785  Y28.087045
G1  X34.004685  Y28.129945
G1  X34.076585  Y28.140245
M300 S50 (pen up)
G4 P50 (wait 50ms)
G1  X36.448285  Y30.266345

M300 S30 (pen down)
G4 P50 (wait 50ms)

G1  X36.374185  Y30.266345
G1  X36.152285  Y30.288645
G1  X35.892985  Y30.355445
G1  X35.670585  Y30.467045
G1  X35.525985  Y30.579345
G1  X35.484785  Y30.623345
G1  X35.443285  Y30.667945
G1  X35.339085  Y30.820645
G1  X35.234785  Y31.054345
G1  X35.172285  Y31.324945
G1  X35.151485  Y31.555245
G1  X35.151485  Y34.565645
G1  X35.172285  Y34.795945
G1  X35.234785  Y35.066445
G1  X35.339085  Y35.300245
G1  X35.443285  Y35.452845
G1  X35.484785  Y35.497245
G1  X35.525985  Y35.541345
G1  X35.670585  Y35.653845
G1  X35.892985  Y35.765345
G1  X36.152285  Y35.832145
G1  X36.374185  Y35.854345
G1  X36.522185  Y35.854345
G1  X36.743985  Y35.832145
G1  X37.002785  Y35.765345
G1  X37.224885  Y35.653845
G1  X37.368985  Y35.541445
G1  X37.409885  Y35.497245
G1  X37.451285  Y35.452845
G1  X37.555585  Y35.300245
G1  X37.659885  Y35.066445
G1  X37.722685  Y34.795945
G1  X37.743685  Y34.565645
G1  X37.743685  Y31.555245
G1  X37.722685  Y31.324945
G1  X37.659885  Y31.054345
G1  X37.555585  Y30.820645
G1  X37.451285  Y30.667945
G1  X37.409885  Y30.623345
G1  X37.368985  Y30.579345
G1  X37.224885  Y30.467045
G1  X37.002785  Y30.355445
G1  X36.743985  Y30.288645
G1  X36.522185  Y30.266345
G1  X36.448285  Y30.266345
M300 S50 (pen up)
G4 P50 (wait 50ms)
G1  X31.015785  Y12.563945

M300 S30 (pen down)
G4 P50 (wait 50ms)

G1  X31.015785  Y14.184645
G1  X31.120285  Y14.195645
G1  X31.431885  Y14.248145
G1  X31.834385  Y14.348845
G1  X32.221585  Y14.484945
G1  X32.591485  Y14.654545
G1  X32.942385  Y14.855945
G1  X33.272585  Y15.087145
G1  X33.579785  Y15.346345
G1  X33.862585  Y15.631745
G1  X34.118985  Y15.941345
G1  X34.347185  Y16.273345
G1  X34.545185  Y16.626045
G1  X34.711485  Y16.997445
G1  X34.843985  Y17.385745
G1  X34.940785  Y17.788945
G1  X35.000285  Y18.205445
G1  X35.020485  Y18.526345
G1  X35.020485  Y19.071345
G1  X34.449885  Y19.071345
G1  X34.052685  Y19.041445
G1  X33.542285  Y18.953445
G1  X33.053485  Y18.810245
G1  X32.588685  Y18.614645
G1  X32.150185  Y18.369545
G1  X31.740285  Y18.077745
G1  X31.361485  Y17.742045
G1  X31.097185  Y17.463645
G1  X31.015785  Y17.365345
G1  X31.015785  Y19.189745
G1  X31.120285  Y19.200745
G1  X31.431885  Y19.253245
G1  X31.834385  Y19.354045
G1  X32.221585  Y19.490245
G1  X32.591485  Y19.659945
G1  X32.942385  Y19.861345
G1  X33.272585  Y20.092745
G1  X33.579785  Y20.352045
G1  X33.862585  Y20.637445
G1  X34.118985  Y20.947145
G1  X34.347185  Y21.279345
G1  X34.545185  Y21.632145
G1  X34.711485  Y22.003545
G1  X34.843985  Y22.391845
G1  X34.940785  Y22.795245
G1  X35.000285  Y23.211745
G1  X35.020485  Y23.532545
G1  X35.020485  Y24.077545
G1  X34.449885  Y24.077545
G1  X34.052685  Y24.047545
G1  X33.542285  Y23.959545
G1  X33.053485  Y23.816145
G1  X32.588685  Y23.620445
G1  X32.150185  Y23.375245
G1  X31.740285  Y23.083445
G1  X31.361485  Y22.747945
G1  X31.097185  Y22.469745
G1  X31.015785  Y22.371545
G1  X31.015785  Y24.196145
G1  X31.120285  Y24.207145
G1  X31.431885  Y24.259645
G1  X31.834385  Y24.360345
G1  X32.221585  Y24.496445
G1  X32.591485  Y24.666045
G1  X32.942385  Y24.867445
G1  X33.272585  Y25.098645
G1  X33.579785  Y25.357945
G1  X33.862585  Y25.643445
G1  X34.118985  Y25.952945
G1  X34.347185  Y26.285245
G1  X34.545185  Y26.637845
G1  X34.711485  Y27.009345
G1  X34.843985  Y27.397845
G1  X34.940785  Y27.801145
G1  X35.000285  Y28.217845
G1  X35.020485  Y28.538845
G1  X35.020485  Y29.084245
G1  X34.449885  Y29.084245
G1  X34.052685  Y29.054245
G1  X33.542285  Y28.966045
G1  X33.053485  Y28.822745
G1  X32.588685  Y28.627045
G1  X32.150185  Y28.381845
G1  X31.740285  Y28.090045
G1  X31.361485  Y27.754545
G1  X31.097185  Y27.476445
G1  X31.015785  Y27.378245
G1  X31.015785  Y29.145945
G1  X30.077385  Y29.145945
G1  X30.077385  Y27.378245
G1  X30.001585  Y27.476545
G1  X29.751885  Y27.754545
G1  X29.388285  Y28.090045
G1  X28.989485  Y28.381845
G1  X28.558385  Y28.627045
G1  X28.098285  Y28.822745
G1  X27.611985  Y28.966045
G1  X27.102685  Y29.054245
G1  X26.705585  Y29.084245
G1  X26.073085  Y29.084245
G1  X26.073085  Y28.538845
G1  X26.093985  Y28.217945
G1  X26.155185  Y27.801545
G1  X26.254785  Y27.398145
G1  X26.390585  Y27.009945
G1  X26.560485  Y26.638445
G1  X26.762285  Y26.285645
G1  X26.993985  Y25.953545
G1  X27.253485  Y25.643845
G1  X27.538685  Y25.358245
G1  X27.847385  Y25.098945
G1  X28.177685  Y24.867745
G1  X28.527285  Y24.666145
G1  X28.894185  Y24.496545
G1  X29.276185  Y24.360345
G1  X29.671285  Y24.259645
G1  X29.975285  Y24.207145
G1  X30.077385  Y24.196145
G1  X30.077385  Y22.371545
G1  X30.001585  Y22.469945
G1  X29.751885  Y22.747945
G1  X29.388285  Y23.083445
G1  X28.989485  Y23.375245
G1  X28.558385  Y23.620445
G1  X28.098285  Y23.816145
G1  X27.611985  Y23.959545
G1  X27.102685  Y24.047545
G1  X26.705585  Y24.077545
G1  X26.073085  Y24.077545
G1  X26.073085  Y23.532545
G1  X26.093985  Y23.211745
G1  X26.155185  Y22.795245
G1  X26.254785  Y22.391845
G1  X26.390585  Y22.003545
G1  X26.560485  Y21.632145
G1  X26.762285  Y21.279345
G1  X26.993985  Y20.947145
G1  X27.253485  Y20.637445
G1  X27.538685  Y20.352045
G1  X27.847385  Y20.092745
G1  X28.177685  Y19.861345
G1  X28.527285  Y19.659945
G1  X28.894185  Y19.490245
G1  X29.276185  Y19.354045
G1  X29.671285  Y19.253245
G1  X29.975285  Y19.200945
G1  X30.077385  Y19.189745
G1  X30.077385  Y17.365345
G1  X30.001585  Y17.463845
G1  X29.751885  Y17.742045
G1  X29.388285  Y18.077745
G1  X28.989485  Y18.369545
G1  X28.558385  Y18.614645
G1  X28.098285  Y18.810245
G1  X27.611985  Y18.953445
G1  X27.102685  Y19.041445
G1  X26.705585  Y19.071345
G1  X26.073085  Y19.071345
G1  X26.073085  Y18.526345
G1  X26.093985  Y18.205445
G1  X26.155185  Y17.788945
G1  X26.254785  Y17.385745
G1  X26.390585  Y16.997445
G1  X26.560485  Y16.626045
G1  X26.762285  Y16.273345
G1  X26.993985  Y15.941345
G1  X27.253485  Y15.631745
G1  X27.538685  Y15.346345
G1  X27.847385  Y15.087145
G1  X28.177685  Y14.855945
G1  X28.527285  Y14.654545
G1  X28.894185  Y14.484945
G1  X29.276185  Y14.348845
G1  X29.671285  Y14.248145
G1  X29.975285  Y14.195645
G1  X30.077385  Y14.184645
G1  X30.077385  Y12.563945
G1  X21.004385  Y12.563945
G1  X21.004385  Y14.184645
G1  X21.108785  Y14.195645
G1  X21.420285  Y14.248145
G1  X21.822785  Y14.348845
G1  X22.210085  Y14.484945
G1  X22.580085  Y14.654545
G1  X22.930885  Y14.855945
G1  X23.260985  Y15.087145
G1  X23.568285  Y15.346345
G1  X23.850985  Y15.631745
G1  X24.107385  Y15.941345
G1  X24.335585  Y16.273345
G1  X24.533685  Y16.626045
G1  X24.699885  Y16.997445
G1  X24.832385  Y17.385745
G1  X24.929185  Y17.788945
G1  X24.988785  Y18.205445
G1  X25.009085  Y18.526345
G1  X25.009085  Y19.071345
G1  X24.438385  Y19.071345
G1  X24.040885  Y19.041445
G1  X23.530285  Y18.953445
G1  X23.041585  Y18.810245
G1  X22.576885  Y18.614645
G1  X22.138485  Y18.369545
G1  X21.728685  Y18.077745
G1  X21.349885  Y17.742045
G1  X21.085785  Y17.463545
G1  X21.004385  Y17.365345
G1  X21.004385  Y19.189745
G1  X21.108785  Y19.200745
G1  X21.420285  Y19.253245
G1  X21.822785  Y19.354045
G1  X22.210085  Y19.490245
G1  X22.580085  Y19.659945
G1  X22.930885  Y19.861345
G1  X23.260985  Y20.092745
G1  X23.568285  Y20.352045
G1  X23.850985  Y20.637445
G1  X24.107385  Y20.947145
G1  X24.335585  Y21.279345
G1  X24.533685  Y21.632145
G1  X24.699885  Y22.003545
G1  X24.832385  Y22.391845
G1  X24.929185  Y22.795245
G1  X24.988785  Y23.211745
G1  X25.009085  Y23.532545
G1  X25.009085  Y24.077545
G1  X24.438385  Y24.077545
G1  X24.040885  Y24.047545
G1  X23.530285  Y23.959545
G1  X23.041585  Y23.816145
G1  X22.576885  Y23.620445
G1  X22.138485  Y23.375245
G1  X21.728685  Y23.083445
G1  X21.349885  Y22.747945
G1  X21.085785  Y22.469745
G1  X21.004385  Y22.371545
G1  X21.004385  Y24.196145
G1  X21.108785  Y24.207145
G1  X21.420285  Y24.259645
G1  X21.822785  Y24.360345
G1  X22.210085  Y24.496445
G1  X22.580085  Y24.666045
G1  X22.930885  Y24.867445
G1  X23.260985  Y25.098645
G1  X23.568285  Y25.357945
G1  X23.850985  Y25.643445
G1  X24.107385  Y25.952945
G1  X24.335585  Y26.285245
G1  X24.533685  Y26.637845
G1  X24.699885  Y27.009345
G1  X24.832385  Y27.397845
G1  X24.929185  Y27.801145
G1  X24.988785  Y28.217845
G1  X25.009085  Y28.538845
G1  X25.009085  Y29.084245
G1  X24.438385  Y29.084245
G1  X24.040885  Y29.054245
G1  X23.530285  Y28.966045
G1  X23.041585  Y28.822745
G1  X22.576885  Y28.627045
G1  X22.138485  Y28.381845
G1  X21.728685  Y28.090045
G1  X21.349885  Y27.754545
G1  X21.085785  Y27.476445
G1  X21.004385  Y27.378245
G1  X21.004385  Y29.145945
G1  X20.064485  Y29.145945
G1  X20.064485  Y27.378245
G1  X19.988785  Y27.476545
G1  X19.739485  Y27.754545
G1  X19.376185  Y28.090045
G1  X18.977585  Y28.381845
G1  X18.546685  Y28.627045
G1  X18.086685  Y28.822745
G1  X17.600485  Y28.966045
G1  X17.091185  Y29.054245
G1  X16.694085  Y29.084245
G1  X16.060185  Y29.084245
G1  X16.060185  Y28.538845
G1  X16.080985  Y28.217945
G1  X16.142385  Y27.801545
G1  X16.241985  Y27.398145
G1  X16.377785  Y27.009945
G1  X16.547785  Y26.638445
G1  X16.749785  Y26.285645
G1  X16.981585  Y25.953545
G1  X17.241185  Y25.643845
G1  X17.526485  Y25.358245
G1  X17.835185  Y25.098945
G1  X18.165485  Y24.867745
G1  X18.515085  Y24.666145
G1  X18.881885  Y24.496545
G1  X19.263785  Y24.360345
G1  X19.658685  Y24.259645
G1  X19.962585  Y24.207145
G1  X20.064485  Y24.196145
G1  X20.064485  Y22.371545
G1  X19.988785  Y22.469945
G1  X19.739485  Y22.747945
G1  X19.376185  Y23.083445
G1  X18.977585  Y23.375245
G1  X18.546685  Y23.620445
G1  X18.086685  Y23.816145
G1  X17.600485  Y23.959545
G1  X17.091185  Y24.047545
G1  X16.694085  Y24.077545
G1  X16.060185  Y24.077545
G1  X16.060185  Y23.532545
G1  X16.080985  Y23.211745
G1  X16.142385  Y22.795245
G1  X16.241985  Y22.391845
G1  X16.377785  Y22.003545
G1  X16.547785  Y21.632145
G1  X16.749785  Y21.279345
G1  X16.981585  Y20.947145
G1  X17.241185  Y20.637445
G1  X17.526485  Y20.352045
G1  X17.835185  Y20.092745
G1  X18.165485  Y19.861345
G1  X18.515085  Y19.659945
G1  X18.881885  Y19.490245
G1  X19.263785  Y19.354045
G1  X19.658685  Y19.253245
G1  X19.962585  Y19.200945
G1  X20.064485  Y19.189745
G1  X20.064485  Y17.365345
G1  X19.988785  Y17.463845
G1  X19.739485  Y17.742045
G1  X19.376185  Y18.077745
G1  X18.977585  Y18.369545
G1  X18.546685  Y18.614645
G1  X18.086685  Y18.810245
G1  X17.600485  Y18.953445
G1  X17.091185  Y19.041445
G1  X16.694085  Y19.071345
G1  X16.060185  Y19.071345
G1  X16.060185  Y18.526345
G1  X16.080985  Y18.205445
G1  X16.142385  Y17.788945
G1  X16.241985  Y17.385745
G1  X16.377785  Y16.997445
G1  X16.547785  Y16.626045
G1  X16.749785  Y16.273345
G1  X16.981585  Y15.941345
G1  X17.241185  Y15.631745
G1  X17.526485  Y15.346345
G1  X17.835185  Y15.087145
G1  X18.165485  Y14.855945
G1  X18.515085  Y14.654545
G1  X18.881885  Y14.484945
G1  X19.263785  Y14.348845
G1  X19.658685  Y14.248145
G1  X19.962585  Y14.195645
G1  X20.064485  Y14.184645
G1  X20.064485  Y12.563945
G1  X10.991785  Y12.563945
G1  X10.991785  Y14.184645
G1  X11.096285  Y14.195645
G1  X11.407985  Y14.248145
G1  X11.810585  Y14.348845
G1  X12.197785  Y14.484945
G1  X12.567785  Y14.654545
G1  X12.918785  Y14.855945
G1  X13.248785  Y15.087145
G1  X13.555985  Y15.346345
G1  X13.838785  Y15.631745
G1  X14.095085  Y15.941345
G1  X14.323085  Y16.273345
G1  X14.521185  Y16.626045
G1  X14.687285  Y16.997445
G1  X14.819685  Y17.385745
G1  X14.916485  Y17.788945
G1  X14.975885  Y18.205445
G1  X14.996185  Y18.526345
G1  X14.996185  Y19.071345
G1  X14.426885  Y19.071345
G1  X14.029485  Y19.041445
G1  X13.518785  Y18.953445
G1  X13.030085  Y18.810245
G1  X12.565185  Y18.614645
G1  X12.126685  Y18.369545
G1  X11.716785  Y18.077745
G1  X11.337685  Y17.742045
G1  X11.073285  Y17.463545
G1  X10.991785  Y17.365345
G1  X10.991785  Y19.189745
G1  X11.096285  Y19.200745
G1  X11.407985  Y19.253245
G1  X11.810585  Y19.354045
G1  X12.197785  Y19.490245
G1  X12.567785  Y19.659945
G1  X12.918785  Y19.861345
G1  X13.248785  Y20.092745
G1  X13.555985  Y20.352045
G1  X13.838785  Y20.637445
G1  X14.095085  Y20.947145
G1  X14.323085  Y21.279345
G1  X14.521185  Y21.632145
G1  X14.687285  Y22.003545
G1  X14.819685  Y22.391845
G1  X14.916485  Y22.795245
G1  X14.975885  Y23.211745
G1  X14.996185  Y23.532545
G1  X14.996185  Y24.077545
G1  X14.426885  Y24.077545
G1  X14.029485  Y24.047545
G1  X13.518785  Y23.959545
G1  X13.030085  Y23.816145
G1  X12.565185  Y23.620445
G1  X12.126685  Y23.375245
G1  X11.716785  Y23.083445
G1  X11.337685  Y22.747945
G1  X11.073285  Y22.469745
G1  X10.991785  Y22.371545
G1  X10.991785  Y24.196145
G1  X11.096285  Y24.207145
G1  X11.407985  Y24.259645
G1  X11.810585  Y24.360345
G1  X12.197785  Y24.496445
G1  X12.567785  Y24.666045
G1  X12.918785  Y24.867445
G1  X13.248785  Y25.098645
G1  X13.555985  Y25.357945
G1  X13.838785  Y25.643445
G1  X14.095085  Y25.952945
G1  X14.323085  Y26.285245
G1  X14.521185  Y26.637845
G1  X14.687285  Y27.009345
G1  X14.819685  Y27.397845
G1  X14.916485  Y27.801145
G1  X14.975885  Y28.217845
G1  X14.996185  Y28.538845
G1  X14.996185  Y29.084245
G1  X14.426885  Y29.084245
G1  X14.029485  Y29.054245
G1  X13.518785  Y28.966045
G1  X13.030085  Y28.822745
G1  X12.565185  Y28.627045
G1  X12.126685  Y28.381845
G1  X11.716785  Y28.090045
G1  X11.337685  Y27.754545
G1  X11.073285  Y27.476445
G1  X10.991785  Y27.378245
G1  X10.991785  Y29.145945
G1  X10.052985  Y29.145945
G1  X10.052985  Y27.378245
G1  X9.977285  Y27.476545
G1  X9.728085  Y27.754545
G1  X9.364685  Y28.090045
G1  X8.966085  Y28.381845
G1  X8.535125  Y28.627045
G1  X8.074885  Y28.822745
G1  X7.588455  Y28.966045
G1  X7.078745  Y29.054245
G1  X6.681345  Y29.084245
G1  X6.048635  Y29.084245
G1  X6.048635  Y28.538845
G1  X6.069525  Y28.217945
G1  X6.130885  Y27.801545
G1  X6.230495  Y27.398145
G1  X6.366395  Y27.009945
G1  X6.536315  Y26.638445
G1  X6.738245  Y26.285645
G1  X6.970075  Y25.953545
G1  X7.229675  Y25.643845
G1  X7.514945  Y25.358245
G1  X7.823745  Y25.098945
G1  X8.153995  Y24.867745
G1  X8.503555  Y24.666145
G1  X8.870385  Y24.496545
G1  X9.252285  Y24.360345
G1  X9.647185  Y24.259645
G1  X9.950985  Y24.207145
G1  X10.052985  Y24.196145
G1  X10.052985  Y22.371545
G1  X9.977285  Y22.469945
G1  X9.728085  Y22.747945
G1  X9.364685  Y23.083445
G1  X8.966085  Y23.375245
G1  X8.535125  Y23.620445
G1  X8.074885  Y23.816145
G1  X7.588455  Y23.959545
G1  X7.078745  Y24.047545
G1  X6.681345  Y24.077545
G1  X6.048635  Y24.077545
G1  X6.048635  Y23.532545
G1  X6.069525  Y23.211745
G1  X6.130885  Y22.795245
G1  X6.230495  Y22.391845
G1  X6.366395  Y22.003545
G1  X6.536315  Y21.632145
G1  X6.738245  Y21.279345
G1  X6.970075  Y20.947145
G1  X7.229675  Y20.637445
G1  X7.514945  Y20.352045
G1  X7.823745  Y20.092745
G1  X8.153995  Y19.861345
G1  X8.503555  Y19.659945
G1  X8.870385  Y19.490245
G1  X9.252285  Y19.354045
G1  X9.647185  Y19.253245
G1  X9.950985  Y19.200945
G1  X10.052985  Y19.189745
G1  X10.052985  Y17.365345
G1  X9.977285  Y17.463845
G1  X9.728085  Y17.742045
G1  X9.364685  Y18.077745
G1  X8.966085  Y18.369545
G1  X8.535125  Y18.614645
G1  X8.074885  Y18.810245
G1  X7.588455  Y18.953445
G1  X7.078745  Y19.041445
G1  X6.681345  Y19.071345
G1  X6.048635  Y19.071345
G1  X6.048635  Y18.526345
G1  X6.069525  Y18.205445
G1  X6.130885  Y17.788945
G1  X6.230495  Y17.385745
G1  X6.366395  Y16.997445
G1  X6.536315  Y16.626045
G1  X6.738245  Y16.273345
G1  X6.970075  Y15.941345
G1  X7.229675  Y15.631745
G1  X7.514945  Y15.346345
G1  X7.823745  Y15.087145
G1  X8.153995  Y14.855945
G1  X8.503555  Y14.654545
G1  X8.870385  Y14.484945
G1  X9.252285  Y14.348845
G1  X9.647185  Y14.248145
G1  X9.950985  Y14.195645
G1  X10.052985  Y14.184645
G1  X10.052985  Y12.563945
G1  X4.546515  Y12.563945
G1  X4.546515  Y11.625545
G1  X10.052985  Y11.625545
G1  X10.052985  Y10.061745
G1  X7.050535  Y10.061745
G1  X7.050535  Y9.123345
G1  X9.420885  Y9.123345
G1  X7.201895  Y6.919535
G1  X7.164955  Y6.938085
G1  X7.050535  Y6.986215
G1  X6.890425  Y7.037105
G1  X6.722845  Y7.069655
G1  X6.592355  Y7.081105
G1  X6.511355  Y7.081105
G1  X6.398845  Y7.073565
G1  X6.253065  Y7.051365
G1  X6.112275  Y7.015245
G1  X5.977285  Y6.965925
G1  X5.848765  Y6.904245
G1  X5.727565  Y6.830785
G1  X5.614275  Y6.746405
G1  X5.509845  Y6.651745
G1  X5.414845  Y6.547635
G1  X5.330095  Y6.434785
G1  X5.256315  Y6.313855
G1  X5.194305  Y6.185645
G1  X5.144775  Y6.050885
G1  X5.108425  Y5.910315
G1  X5.086125  Y5.764645
G1  X5.078525  Y5.652175
G1  X5.078525  Y5.577085
G1  X5.086125  Y5.464405
G1  X5.108425  Y5.318465
G1  X5.144775  Y5.177675
G1  X5.194305  Y5.042685
G1  X5.256315  Y4.914275
G1  X5.330095  Y4.793135
G1  X5.414845  Y4.680065
G1  X5.509845  Y4.575785
G1  X5.614275  Y4.481005
G1  X5.727565  Y4.396425
G1  X5.848765  Y4.322905
G1  X5.977285  Y4.261065
G1  X6.112275  Y4.211685
G1  X6.253065  Y4.175505
G1  X6.398845  Y4.153255
G1  X6.511355  Y4.145655
G1  X6.586445  Y4.145655
G1  X6.699195  Y4.153315
G1  X6.845175  Y4.175725
G1  X6.986135  Y4.212075
G1  X7.121275  Y4.261715
G1  X7.249915  Y4.323835
G1  X7.371275  Y4.397725
G1  X7.484605  Y4.482575
G1  X7.589165  Y4.577685
G1  X7.684215  Y4.682335
G1  X7.769015  Y4.795675
G1  X7.842805  Y4.917045
G1  X7.904855  Y5.045675
G1  X7.954395  Y5.180765
G1  X7.990745  Y5.321605
G1  X8.013035  Y5.467395
G1  X8.020695  Y5.579965
G1  X8.020695  Y5.660745
G1  X8.010325  Y5.790635
G1  X7.980165  Y5.958005
G1  X7.931665  Y6.118435
G1  X7.884565  Y6.233715
G1  X7.866175  Y6.270775
G1  X10.554685  Y8.959345
G1  X11.239785  Y8.274145
G1  X11.221285  Y8.237245
G1  X11.174185  Y8.122145
G1  X11.125685  Y7.961745
G1  X11.095585  Y7.794425
G1  X11.085285  Y7.664545
G1  X11.085285  Y7.583655
G1  X11.092885  Y7.470905
G1  X11.115185  Y7.324975
G1  X11.151485  Y7.184075
G1  X11.201085  Y7.049035
G1  X11.263085  Y6.920515
G1  X11.336885  Y6.799255
G1  X11.421685  Y6.686085
G1  X11.516685  Y6.581645
G1  X11.621285  Y6.486705
G1  X11.734585  Y6.402065
G1  X11.855985  Y6.328395
G1  X11.984585  Y6.266435
G1  X12.119785  Y6.216955
G1  X12.260685  Y6.180715
G1  X12.406685  Y6.158405
G1  X12.519485  Y6.150825
G1  X12.594485  Y6.150825
G1  X12.706985  Y6.158405
G1  X12.852785  Y6.180715
G1  X12.993685  Y6.216955
G1  X13.128685  Y6.266435
G1  X13.257185  Y6.328395
G1  X13.378385  Y6.402065
G1  X13.491585  Y6.486705
G1  X13.596185  Y6.581645
G1  X13.690985  Y6.686085
G1  X13.775785  Y6.799255
G1  X13.849685  Y6.920515
G1  X13.911585  Y7.049035
G1  X13.961185  Y7.184075
G1  X13.997385  Y7.324975
G1  X14.019785  Y7.470905
G1  X14.027385  Y7.583655
G1  X14.027385  Y7.658745
G1  X14.019785  Y7.771255
G1  X13.997385  Y7.917045
G1  X13.961185  Y8.057825
G1  X13.911585  Y8.192845
G1  X13.849685  Y8.321345
G1  X13.775785  Y8.442545
G1  X13.690985  Y8.555845
G1  X13.596185  Y8.660245
G1  X13.491585  Y8.755245
G1  X13.378385  Y8.840045
G1  X13.257185  Y8.913745
G1  X13.128685  Y8.975845
G1  X12.993685  Y9.025345
G1  X12.852785  Y9.061645
G1  X12.706985  Y9.083945
G1  X12.594485  Y9.091545
G1  X12.512985  Y9.091545
G1  X12.380685  Y9.081345
G1  X12.207685  Y9.051545
G1  X12.041985  Y9.003045
G1  X11.924985  Y8.955945
G1  X11.887485  Y8.937045
G1  X10.991785  Y9.817545
G1  X10.991785  Y11.625545
G1  X20.064485  Y11.625545
G1  X20.064485  Y9.817545
G1  X17.198285  Y6.934725
G1  X17.161485  Y6.953285
G1  X17.047285  Y7.000865
G1  X16.889785  Y7.049315
G1  X16.725185  Y7.079085
G1  X16.596285  Y7.089245
G1  X16.515785  Y7.089245
G1  X16.403285  Y7.081645
G1  X16.257585  Y7.059355
G1  X16.116985  Y7.022995
G1  X15.982285  Y6.973465
G1  X15.854085  Y6.911455
G1  X15.733285  Y6.837675
G1  X15.620485  Y6.752925
G1  X15.516285  Y6.657925
G1  X15.421685  Y6.553495
G1  X15.337385  Y6.440205
G1  X15.263985  Y6.319005
G1  X15.202285  Y6.190475
G1  X15.152985  Y6.055495
G1  X15.116885  Y5.914715
G1  X15.094585  Y5.768925
G1  X15.087185  Y5.656405
G1  X15.087185  Y5.581325
G1  X15.094785  Y5.468575
G1  X15.117085  Y5.322645
G1  X15.153485  Y5.181745
G1  X15.203085  Y5.046705
G1  X15.265285  Y4.918185
G1  X15.339185  Y4.796925
G1  X15.424085  Y4.683755
G1  X15.519185  Y4.579315
G1  X15.623785  Y4.484365
G1  X15.737085  Y4.399725
G1  X15.858485  Y4.326065
G1  X15.987085  Y4.264105
G1  X16.122185  Y4.214615
G1  X16.263085  Y4.178385
G1  X16.408785  Y4.156075
G1  X16.521485  Y4.148495
G1  X16.596485  Y4.148495
G1  X16.709185  Y4.156075
G1  X16.855185  Y4.178385
G1  X16.996185  Y4.214615
G1  X17.131285  Y4.264105
G1  X17.259885  Y4.326065
G1  X17.381285  Y4.399725
G1  X17.494685  Y4.484365
G1  X17.599185  Y4.579315
G1  X17.694185  Y4.683755
G1  X17.779085  Y4.796925
G1  X17.852785  Y4.918185
G1  X17.914885  Y5.046705
G1  X17.964485  Y5.181745
G1  X18.000785  Y5.322645
G1  X18.023085  Y5.468575
G1  X18.030785  Y5.581325
G1  X18.030785  Y5.662155
G1  X18.020585  Y5.792045
G1  X17.990985  Y5.959405
G1  X17.942785  Y6.119835
G1  X17.895985  Y6.235185
G1  X17.877685  Y6.272185
G1  X20.566185  Y8.959345
G1  X21.251285  Y8.274145
G1  X21.232785  Y8.237245
G1  X21.185885  Y8.122145
G1  X21.137985  Y7.961745
G1  X21.108285  Y7.794425
G1  X21.098085  Y7.664545
G1  X21.098085  Y7.583655
G1  X21.105785  Y7.470905
G1  X21.127985  Y7.324975
G1  X21.164185  Y7.184075
G1  X21.213685  Y7.049035
G1  X21.275785  Y6.920515
G1  X21.349385  Y6.799255
G1  X21.433985  Y6.686085
G1  X21.528985  Y6.581645
G1  X21.633385  Y6.486705
G1  X21.746585  Y6.402065
G1  X21.867785  Y6.328395
G1  X21.996285  Y6.266435
G1  X22.131285  Y6.216955
G1  X22.272285  Y6.180715
G1  X22.418285  Y6.158405
G1  X22.530885  Y6.150825
G1  X22.605985  Y6.150825
G1  X22.718485  Y6.158405
G1  X22.864385  Y6.180715
G1  X23.005085  Y6.216955
G1  X23.140085  Y6.266435
G1  X23.268685  Y6.328395
G1  X23.389785  Y6.402065
G1  X23.503085  Y6.486705
G1  X23.607585  Y6.581645
G1  X23.702585  Y6.686085
G1  X23.787285  Y6.799255
G1  X23.860985  Y6.920515
G1  X23.923085  Y7.049035
G1  X23.972685  Y7.184075
G1  X24.008985  Y7.324975
G1  X24.031285  Y7.470905
G1  X24.038985  Y7.583655
G1  X24.038985  Y7.658745
G1  X24.031285  Y7.771255
G1  X24.008985  Y7.917045
G1  X23.972685  Y8.057825
G1  X23.923085  Y8.192845
G1  X23.860985  Y8.321345
G1  X23.787285  Y8.442545
G1  X23.702585  Y8.555845
G1  X23.607585  Y8.660245
G1  X23.503085  Y8.755245
G1  X23.389785  Y8.840045
G1  X23.268685  Y8.913745
G1  X23.140085  Y8.975845
G1  X23.005085  Y9.025345
G1  X22.864385  Y9.061645
G1  X22.718485  Y9.083945
G1  X22.605985  Y9.091545
G1  X22.524485  Y9.091545
G1  X22.392185  Y9.081345
G1  X22.219185  Y9.051545
G1  X22.053485  Y9.003045
G1  X21.936485  Y8.955945
G1  X21.898985  Y8.937045
G1  X21.004385  Y9.817545
G1  X21.004385  Y11.625545
G1  X30.077385  Y11.625545
G1  X30.077385  Y10.061745
G1  X27.073485  Y10.061745
G1  X27.073485  Y9.123345
G1  X29.444885  Y9.123345
G1  X27.226285  Y6.919535
G1  X27.189185  Y6.938035
G1  X27.074085  Y6.986215
G1  X26.913785  Y7.037105
G1  X26.746485  Y7.069655
G1  X26.616585  Y7.081105
G1  X26.535785  Y7.081105
G1  X26.423285  Y7.073565
G1  X26.277385  Y7.051365
G1  X26.136585  Y7.015245
G1  X26.001585  Y6.965925
G1  X25.873085  Y6.904245
G1  X25.751885  Y6.830785
G1  X25.638685  Y6.746405
G1  X25.534185  Y6.651745
G1  X25.439185  Y6.547635
G1  X25.354485  Y6.434785
G1  X25.280585  Y6.313855
G1  X25.218685  Y6.185645
G1  X25.169085  Y6.050885
G1  X25.132785  Y5.910315
G1  X25.110485  Y5.764645
G1  X25.102785  Y5.652175
G1  X25.102785  Y5.577085
G1  X25.110485  Y5.464405
G1  X25.132785  Y5.318465
G1  X25.169085  Y5.177675
G1  X25.218685  Y5.042685
G1  X25.280585  Y4.914275
G1  X25.354485  Y4.793135
G1  X25.439185  Y4.680065
G1  X25.534185  Y4.575785
G1  X25.638685  Y4.481005
G1  X25.751885  Y4.396425
G1  X25.873085  Y4.322905
G1  X26.001585  Y4.261065
G1  X26.136585  Y4.211685
G1  X26.277385  Y4.175505
G1  X26.423285  Y4.153255
G1  X26.535785  Y4.145655
G1  X26.610785  Y4.145655
G1  X26.723285  Y4.153315
G1  X26.869085  Y4.175725
G1  X27.009785  Y4.212075
G1  X27.144785  Y4.261715
G1  X27.273385  Y4.323835
G1  X27.394485  Y4.397725
G1  X27.507785  Y4.482575
G1  X27.612285  Y4.577685
G1  X27.707285  Y4.682335
G1  X27.791985  Y4.795675
G1  X27.865785  Y4.917045
G1  X27.927785  Y5.045675
G1  X27.977385  Y5.180765
G1  X28.013685  Y5.321605
G1  X28.035985  Y5.467395
G1  X28.043685  Y5.579965
G1  X28.043685  Y5.660745
G1  X28.033385  Y5.790635
G1  X28.003685  Y5.958005
G1  X27.955585  Y6.118435
G1  X27.908985  Y6.233775
G1  X27.890585  Y6.270775
G1  X30.577685  Y8.959345
G1  X31.262685  Y8.274145
G1  X31.244185  Y8.237245
G1  X31.197385  Y8.122145
G1  X31.149385  Y7.961745
G1  X31.119785  Y7.794425
G1  X31.109585  Y7.664545
G1  X31.109585  Y7.583655
G1  X31.117285  Y7.470905
G1  X31.139485  Y7.324975
G1  X31.175885  Y7.184075
G1  X31.225285  Y7.049035
G1  X31.287385  Y6.920515
G1  X31.361185  Y6.799255
G1  X31.445885  Y6.686085
G1  X31.540885  Y6.581645
G1  X31.645285  Y6.486705
G1  X31.758685  Y6.402065
G1  X31.879885  Y6.328395
G1  X32.008385  Y6.266435
G1  X32.143385  Y6.216955
G1  X32.284085  Y6.180715
G1  X32.429885  Y6.158405
G1  X32.542385  Y6.150825
G1  X32.617385  Y6.150825
G1  X32.730085  Y6.158405
G1  X32.875785  Y6.180715
G1  X33.016585  Y6.216955
G1  X33.151585  Y6.266435
G1  X33.280085  Y6.328395
G1  X33.401285  Y6.402065
G1  X33.514485  Y6.486705
G1  X33.619085  Y6.581645
G1  X33.713985  Y6.686085
G1  X33.798785  Y6.799255
G1  X33.872585  Y6.920515
G1  X33.934485  Y7.049035
G1  X33.984085  Y7.184075
G1  X34.020485  Y7.324975
G1  X34.042685  Y7.470905
G1  X34.050285  Y7.583655
G1  X34.050285  Y7.658745
G1  X34.042685  Y7.771255
G1  X34.020485  Y7.917045
G1  X33.984085  Y8.057825
G1  X33.934485  Y8.192845
G1  X33.872585  Y8.321345
G1  X33.798785  Y8.442545
G1  X33.713985  Y8.555845
G1  X33.619085  Y8.660245
G1  X33.514485  Y8.755245
G1  X33.401285  Y8.840045
G1  X33.280085  Y8.913745
G1  X33.151585  Y8.975845
G1  X33.016585  Y9.025345
G1  X32.875785  Y9.061645
G1  X32.730085  Y9.083945
G1  X32.617385  Y9.091545
G1  X32.535985  Y9.091545
G1  X32.404185  Y9.081345
G1  X32.231285  Y9.051545
G1  X32.065585  Y9.003045
G1  X31.948785  Y8.955945
G1  X31.911485  Y8.937045
G1  X31.015785  Y9.817545
G1  X31.015785  Y11.625545
G1  X36.584785  Y11.625545
G1  X36.584785  Y12.563945
G1  X31.015785  Y12.563945
M300 S50 (pen up)
G4 P50 (wait 50ms)
G1  X36.448285  Y31.042145

M300 S30 (pen down)
G4 P50 (wait 50ms)

G1  X36.474085  Y31.042145
G1  X36.551885  Y31.050645
G1  X36.641685  Y31.075745
G1  X36.717685  Y31.117745
G1  X36.779885  Y31.176345
G1  X36.828385  Y31.251845
G1  X36.862985  Y31.343945
G1  X36.883685  Y31.452845
G1  X36.890585  Y31.547045
G1  X36.890585  Y34.573845
G1  X36.883685  Y34.667945
G1  X36.862985  Y34.776745
G1  X36.828385  Y34.868945
G1  X36.779885  Y34.944345
G1  X36.717685  Y35.003145
G1  X36.641685  Y35.045045
G1  X36.551885  Y35.070245
G1  X36.474085  Y35.078645
G1  X36.422285  Y35.078645
G1  X36.344485  Y35.070245
G1  X36.254685  Y35.045045
G1  X36.178685  Y35.003145
G1  X36.116485  Y34.944345
G1  X36.067985  Y34.868945
G1  X36.033385  Y34.776745
G1  X36.012685  Y34.667945
G1  X36.005885  Y34.573845
G1  X36.005885  Y31.547045
G1  X36.012685  Y31.452845
G1  X36.033385  Y31.343945
G1  X36.067985  Y31.251845
G1  X36.116485  Y31.176345
G1  X36.178685  Y31.117745
G1  X36.254685  Y31.075745
G1  X36.344485  Y31.050645
G1  X36.422285  Y31.042145
G1  X36.448285  Y31.042145
M300 S50 (pen up)
G4 P50 (wait 50ms)
G1  X20.294885  Y32.144645

M300 S30 (pen down)
G4 P50 (wait 50ms)

G1  X19.914585  Y34.830645
G1  X19.899485  Y34.830645
G1  X19.525885  Y32.144645
G1  X20.294885  Y32.144645
M300 S50 (pen up)
G4 P50 (wait 50ms)
G1  X16.744885  Y33.448445

M300 S30 (pen down)
G4 P50 (wait 50ms)

G1  X16.774785  Y33.448445
G1  X16.864785  Y33.456745
G1  X16.968285  Y33.481445
G1  X17.054885  Y33.522845
G1  X17.109785  Y33.564245
G1  X17.125185  Y33.580745
G1  X17.141985  Y33.597745
G1  X17.182985  Y33.657945
G1  X17.224385  Y33.757445
G1  X17.249185  Y33.879245
G1  X17.257385  Y33.987145
G1  X17.257385  Y34.476145
G1  X17.250485  Y34.579345
G1  X17.229885  Y34.696345
G1  X17.195885  Y34.792845
G1  X17.162785  Y34.851845
G1  X17.148785  Y34.869045
G1  X17.136285  Y34.885245
G1  X17.090285  Y34.926745
G1  X17.016485  Y34.967545
G1  X16.926985  Y34.991845
G1  X16.848385  Y34.999945
G1  X16.434785  Y34.999945
G1  X16.434785  Y33.448445
G1  X16.744885  Y33.448445
M300 S50 (pen up)
G4 P50 (wait 50ms)
G1  X12.351785  Y33.332745

M300 S30 (pen down)
G4 P50 (wait 50ms)

G1  X12.376185  Y33.332745
G1  X12.449485  Y33.339945
G1  X12.533685  Y33.361545
G1  X12.604485  Y33.397845
G1  X12.649385  Y33.434045
G1  X12.661885  Y33.448445
G1  X12.675785  Y33.463345
G1  X12.708985  Y33.516445
G1  X12.743285  Y33.605245
G1  X12.763785  Y33.714345
G1  X12.770885  Y33.811445
G1  X12.770885  Y34.521145
G1  X12.763785  Y34.618145
G1  X12.743285  Y34.727245
G1  X12.708985  Y34.816045
G1  X12.675785  Y34.869245
G1  X12.661885  Y34.884245
G1  X12.649385  Y34.898545
G1  X12.604485  Y34.934945
G1  X12.533685  Y34.971045
G1  X12.449485  Y34.992745
G1  X12.376185  Y34.999945
G1  X11.948185  Y34.999945
G1  X11.948185  Y33.332745
G1  X12.351785  Y33.332745
M300 S50 (pen up)
G4 P50 (wait 50ms)
G1  X3.420815  Y33.448445

M300 S30 (pen down)
G4 P50 (wait 50ms)

G1  X3.450765  Y33.448445
G1  X3.540605  Y33.456745
G1  X3.643895  Y33.481445
G1  X3.730705  Y33.522845
G1  X3.785605  Y33.564245
G1  X3.801135  Y33.580745
G1  X3.817995  Y33.597745
G1  X3.858965  Y33.657945
G1  X3.900305  Y33.757445
G1  X3.925095  Y33.879245
G1  X3.933395  Y33.987145
G1  X3.933395  Y34.476145
G1  X3.926395  Y34.579345
G1  X3.905735  Y34.696345
G1  X3.871605  Y34.792845
G1  X3.838395  Y34.851845
G1  X3.824395  Y34.869045
G1  X3.812035  Y34.885245
G1  X3.766025  Y34.926745
G1  X3.692135  Y34.967545
G1  X3.602665  Y34.991845
G1  X3.523945  Y34.999945
G1  X3.110705  Y34.999945
G1  X3.110705  Y33.448445
G1  X3.420815  Y33.448445

M300 S50 (pen up)
G4 P50 (wait 50ms)


(Footer begin)
(end of print job)
M300 S50.00 (pen up)
G4 P50 (wait 50ms)
M300 S255 (turn off servo)
G1 X0 Y0 F3000.00
G1 Z0.00 F150.00 (go up to finished level)
G1 X0.00 Y0.00 F3000.00 (go home)
M18 (drives off)
