G21 (metric ftw)
G90 (absolute mode)
G92 X0.00 Y0.00 Z0.00 (you are here)

M300 S30 (pen down)
G4 P50 (wait 50ms)
M300 S50 (pen up)
G4 P50 (wait 50ms)
M18 (disengage drives)
M01 (Was registration test successful?)
M17 (engage drives if YES, and continue)

(Header end)












G1  Y7.489663  X22.000000

M300 S30 (pen down)
G4 P50 (wait 50ms)

G1  Y22.000000  X36.510337
G1  Y22.000000  X36.510337
G1  Y36.510337  X22.000000
G1  Y36.510337  X22.000000
G1  Y22.000000  X7.489663
G1  Y22.000000  X7.489663
G1  Y7.489663  X22.000000
M300 S50 (pen up)
G4 P50 (wait 50ms)
G1  Y12.326442  X22.000000

M300 S30 (pen down)
G4 P50 (wait 50ms)

G1  Y22.000000  X31.673558
G1  Y22.000000  X31.673558
G1  Y31.673558  X22.000000
G1  Y31.673558  X22.000000
G1  Y22.000000  X12.326442
G1  Y22.000000  X12.326442
G1  Y12.326442  X22.000000
M300 S50 (pen up)
G4 P50 (wait 50ms)
G1  Y17.163221  X22.000000

M300 S30 (pen down)
G4 P50 (wait 50ms)

G1  Y22.000000  X26.836779
G1  Y22.000000  X26.836779
G1  Y26.836779  X22.000000
G1  Y26.836779  X22.000000
G1  Y22.000000  X17.163221
G1  Y22.000000  X17.163221
G1  Y17.163221  X22.000000

M300 S50 (pen up)
G4 P50 (wait 50ms)


(Footer begin)
(end of print job)
M300 S50.00 (pen up)
G4 P50 (wait 50ms)
M300 S255 (turn off servo)
G1 X0 Y0 F3000.00
G1 Z0.00 F150.00 (go up to finished level)
G1 X0.00 Y0.00 F3000.00 (go home)
M18 (drives off)
