G40	; disable tool radius compensation
G49	; disable tool length compensation
G80	; cancel modal motion
G54	; select coordinate system 1
G90	; disable incremental moves
G21	; metric
F300	; set feedrate
S1000	; set spindle speed
G61	; exact path mode
M3	; start spindle
G04 P3.0	; wait for 3.0 seconds
G0 X24.596700 Y20.217400 Z25.000000
F100	; set feedrate
G1 Z0.000000
F300	; set feedrate
G1 X15.402200
G0 Z25.000000
  X19.999300 Y24.814400
F100	; set feedrate
G1 Z0.000000
F300	; set feedrate
G1 Y15.620000
G0 Z25.000000
  X34.976100 Y20.217400
F100	; set feedrate
G1 Z0.000000
F300	; set feedrate
G1 Y20.024700
  X34.956700 Y19.446500
  X34.898700 Y18.685800
  X34.803600 Y17.936300
  X34.671900 Y17.198600
  X34.504700 Y16.474000
  X34.302900 Y15.763300
  X34.067500 Y15.067400
  X33.799300 Y14.387200
  X33.499400 Y13.723800
  X33.168700 Y13.078000
  X32.808200 Y12.450800
  X32.418600 Y11.843200
  X32.001100 Y11.256000
  X31.556500 Y10.690200
  X31.085800 Y10.146800
  X30.590000 Y9.626740
  X30.069900 Y9.130860
  X29.526400 Y8.660150
  X28.960700 Y8.215560
  X28.373500 Y7.798010
  X27.765800 Y7.408530
  X27.138600 Y7.047900
  X26.492900 Y6.717240
  X25.829400 Y6.417320
  X25.149300 Y6.149190
  X24.453300 Y5.913740
  X23.742600 Y5.711970
  X23.018100 Y5.544760
  X22.280400 Y5.413080
  X21.530800 Y5.317820
  X20.770100 Y5.260040
  X20.191900 Y5.240500
  X19.806700
  X19.228600 Y5.260040
  X18.468200 Y5.317820
  X17.718800 Y5.413080
  X16.981300 Y5.544760
  X16.256700 Y5.711970
  X15.546100 Y5.913740
  X14.850100 Y6.149190
  X14.170100 Y6.417320
  X13.506800 Y6.717240
  X12.861100 Y7.047900
  X12.234100 Y7.408530
  X11.626500 Y7.798010
  X11.039300 Y8.215560
  X10.473600 Y8.660150
  X9.930280 Y9.130860
  X9.410210 Y9.626740
  X8.914330 Y10.146800
  X8.443680 Y10.690200
  X7.999140 Y11.256000
  X7.581650 Y11.843200
  X7.192110 Y12.450800
  X6.831540 Y13.078000
  X6.500870 Y13.723800
  X6.201010 Y14.387200
  X5.932890 Y15.067400
  X5.697430 Y15.763300
  X5.495670 Y16.474000
  X5.328440 Y17.198600
  X5.196780 Y17.936300
  X5.101510 Y18.685800
  X5.043720 Y19.446500
  X5.024250 Y20.024700
  Y20.410000
  X5.043720 Y20.988100
  X5.101510 Y21.748500
  X5.196780 Y22.498100
  X5.328440 Y23.235400
  X5.495670 Y23.960000
  X5.697430 Y24.670700
  X5.932890 Y25.366400
  X6.201010 Y26.046500
  X6.500870 Y26.709900
  X6.831540 Y27.355600
  X7.192110 Y27.982600
  X7.581650 Y28.590300
  X7.999140 Y29.177400
  X8.443680 Y29.743100
  X8.914330 Y30.286400
  X9.410210 Y30.806500
  X9.930280 Y31.302400
  X10.473600 Y31.772900
  X11.039300 Y32.217500
  X11.626500 Y32.635000
  X12.234100 Y33.024600
  X12.861100 Y33.385100
  X13.506800 Y33.715800
  X14.170100 Y34.015700
  X14.850100 Y34.283700
  X15.546100 Y34.519200
  X16.256700 Y34.721000
  X16.981300 Y34.888200
  X17.718800 Y35.019900
  X18.468200 Y35.115100
  X19.228600 Y35.172900
  X19.806700 Y35.192400
  X20.191900
  X20.770100 Y35.172900
  X21.530800 Y35.115100
  X22.280400 Y35.019900
  X23.018100 Y34.888200
  X23.742600 Y34.721000
  X24.453300 Y34.519200
  X25.149300 Y34.283700
  X25.829400 Y34.015700
  X26.492900 Y33.715800
  X27.138600 Y33.385100
  X27.765800 Y33.024600
  X28.373500 Y32.635000
  X28.960700 Y32.217500
  X29.526400 Y31.772900
  X30.069900 Y31.302400
  X30.590000 Y30.806500
  X31.085800 Y30.286400
  X31.556500 Y29.743100
  X32.001100 Y29.177400
  X32.418600 Y28.590300
  X32.808200 Y27.982600
  X33.168700 Y27.355600
  X33.499400 Y26.709900
  X33.799300 Y26.046500
  X34.067500 Y25.366400
  X34.302900 Y24.670700
  X34.504700 Y23.960000
  X34.671900 Y23.235400
  X34.803600 Y22.498100
  X34.898700 Y21.748500
  X34.956700 Y20.988100
  X34.976100 Y20.410000
  Y20.217400
M5	; stop spindle
G0 Z25.000000
M2	; end program
