G40	; disable tool radius compensation
G49	; disable tool length compensation
G80	; cancel modal motion
G54	; select coordinate system 1
G90	; disable incremental moves
G21	; metric
F300	; set feedrate
S1000	; set spindle speed
G61	; exact path mode
M3	; start spindle
G04 P3.0	; wait for 3.0 seconds
G0 X33.226260 Y17.726160 Z25.000000
F100	; set feedrate
G1 Z0.000000
F300	; set feedrate
G1 X33.221560 Y17.725460
  X33.173360 Y17.716160
  X33.168560 Y17.714760
  X26.241460
  X26.233360 Y17.716160
  X26.155460 Y17.719460
  X26.147560 Y17.719060
  X26.105760 Y17.716760
  X25.980060 Y17.719660
  X25.815760 Y17.739760
  X25.656060 Y17.778360
  X25.502260 Y17.835060
  X25.356160 Y17.909260
  X25.219160 Y18.000060
  X25.092960 Y18.106860
  X25.005360 Y18.197160
  X24.978760 Y18.229260
  X24.952560 Y18.261060
  X24.880760 Y18.362160
  X24.798560 Y18.503960
  X24.732560 Y18.652960
  X24.683260 Y18.807860
  X24.650860 Y18.967160
  X24.635760 Y19.129460
  X24.638360 Y19.293160
  X24.651660 Y19.416460
  X24.659260 Y19.456860
  X24.668760 Y19.509760
  X24.713560 Y19.665460
  X24.796560 Y19.860660
  X24.906060 Y20.039960
  X25.039360 Y20.200860
  X25.194360 Y20.341060
  X25.368660 Y20.458160
  X25.559860 Y20.549660
  X25.713360 Y20.601060
  X25.765860 Y20.612960
  X25.815160 Y20.623660
  X26.065560 Y20.644960
  X26.316060 Y20.623660
  X26.365160 Y20.612960
  X26.384660 Y20.608760
  X26.444360 Y20.604060
  X26.521260 Y20.611060
  X26.594360 Y20.632560
  X26.661260 Y20.667260
  X26.720460 Y20.714060
  X26.769860 Y20.771760
  X26.807860 Y20.839060
  X26.828060 Y20.895660
  X26.832260 Y20.914960
  X26.833260 Y20.919760
  X26.839360 Y20.960560
  Y20.974260
  X26.842360 Y21.051060
  X26.867260 Y21.280760
  X26.924860 Y21.577160
  X27.010560 Y21.861960
  X27.122660 Y22.133960
  X27.259760 Y22.391260
  X27.420160 Y22.632860
  X27.602360 Y22.857160
  X27.804860 Y23.062560
  X28.025860 Y23.247860
  X28.264060 Y23.411460
  X28.517660 Y23.551860
  X28.785160 Y23.667860
  X29.065060 Y23.757660
  X29.355760 Y23.820160
  X29.655560 Y23.853760
  X29.886460 Y23.860160
  X29.963260 Y23.857160
  X30.067860 Y23.852860
  X30.380860 Y23.810860
  X30.782360 Y23.708760
  X31.162860 Y23.553760
  X31.517160 Y23.349660
  X31.840560 Y23.099260
  X32.128060 Y22.805860
  X32.374860 Y22.473160
  X32.532560 Y22.199360
  X32.576160 Y22.104060
  X32.588360 Y22.078160
  X32.640460 Y22.007460
  X32.727960 Y21.934760
  X32.832560 Y21.890360
  X32.919360 Y21.876760
  X32.948060 Y21.877960
  X33.019660 Y21.882160
  X33.072960 Y21.881160
  X33.232660 Y21.867260
  X33.439260 Y21.831760
  X33.638060 Y21.776260
  X33.828360 Y21.702460
  X34.008960 Y21.610860
  X34.178960 Y21.502960
  X34.337160 Y21.379660
  X34.482560 Y21.241960
  X34.614160 Y21.091160
  X34.731160 Y20.928160
  X34.832260 Y20.753960
  X34.916560 Y20.569960
  X34.982960 Y20.376760
  X35.030460 Y20.175760
  X35.057960 Y19.968160
  X35.065560 Y19.807960
  X35.064660 Y19.754660
  X35.063660 Y19.706260
  X35.051960 Y19.561760
  X35.022160 Y19.373660
  X34.975860 Y19.191460
  X34.913960 Y19.015860
  X34.836960 Y18.847560
  X34.746060 Y18.687560
  X34.641660 Y18.536560
  X34.524660 Y18.395660
  X34.395760 Y18.265360
  X34.255560 Y18.146560
  X34.105160 Y18.040360
  X33.945060 Y17.947460
  X33.776160 Y17.868560
  X33.599260 Y17.804460
  X33.414760 Y17.756260
  X33.271860 Y17.730360
  X33.223960 Y17.724660
  X33.226260 Y17.726160
G0 Z25.000000
  X26.939860 Y4.372800
F100	; set feedrate
G1 Z0.000000
F300	; set feedrate
G1 X26.933360 Y4.372110
  X26.904660 Y4.372540
  X26.806260 Y4.372170
  X26.649360 Y4.371780
  X26.437860 Y4.371290
  X26.176060 Y4.370800
  X25.867960 Y4.370260
  X25.517960 Y4.369670
  X25.130160 Y4.369070
  X24.708960 Y4.368420
  X24.258060 Y4.367710
  X23.782160 Y4.367050
  X23.285160 Y4.366360
  X22.771460 Y4.365650
  X22.245060 Y4.364890
  X21.710160 Y4.364180
  X21.171060 Y4.363480
  X20.631960 Y4.362780
  X20.096860 Y4.362070
  X19.570160 Y4.361420
  X19.056060 Y4.360760
  X18.558660 Y4.360110
  X18.081960 Y4.359510
  X17.630560 Y4.358970
  X17.208360 Y4.358430
  X16.819660 Y4.357940
  X16.468560 Y4.357510
  X16.159360 Y4.357140
  X15.896160 Y4.356860
  X15.683260 Y4.356580
  X15.524760 Y4.356370
  X15.424860 Y4.356260
  X15.396960 Y4.356210
  X15.322560
  X15.126860 Y4.369390
  X14.873360 Y4.408080
  X14.628660 Y4.471010
  X14.394060 Y4.556830
  X14.170860 Y4.664320
  X13.960360 Y4.792190
  X13.763760 Y4.939170
  X13.582560 Y5.103930
  X13.417560 Y5.285250
  X13.270560 Y5.481860
  X13.142660 Y5.692420
  X13.035060 Y5.915670
  X12.949260 Y6.150320
  X12.886260 Y6.395110
  X12.847560 Y6.648800
  X12.834460 Y6.844710
  Y6.975240
  X12.847560 Y7.170990
  X12.886260 Y7.424460
  X12.949260 Y7.669060
  X13.035060 Y7.903660
  X13.142660 Y8.126860
  X13.270560 Y8.337360
  X13.417560 Y8.533960
  X13.582560 Y8.715360
  X13.763760 Y8.880160
  X13.960360 Y9.027160
  X14.170860 Y9.155060
  X14.394060 Y9.262660
  X14.628660 Y9.348560
  X14.873360 Y9.411460
  X15.126860 Y9.450160
  X15.322560 Y9.463360
  X15.453960
  X15.652560 Y9.449960
  X15.870760 Y9.418660
  X15.914260 Y9.409760
  X15.933560 Y9.405760
  X15.993260 Y9.401560
  X16.070060 Y9.408860
  X16.142660 Y9.430760
  X16.209360 Y9.465760
  X16.267960 Y9.512960
  X16.316860 Y9.570860
  X16.353760 Y9.638360
  X16.373360 Y9.694860
  X16.377360 Y9.714160
  X16.378360 Y9.719060
  X16.385060 Y9.765860
  X16.385460 Y9.770660
  X16.392960 Y9.900760
  X16.442160 Y10.289560
  X16.548760 Y10.790560
  X16.702660 Y11.271060
  X16.901260 Y11.728760
  X17.141760 Y12.161260
  X17.421260 Y12.566160
  X17.737260 Y12.941060
  X18.086960 Y13.283360
  X18.467860 Y13.590760
  X18.876960 Y13.861060
  X19.311760 Y14.091460
  X19.769360 Y14.279760
  X20.247160 Y14.423560
  X20.742560 Y14.520360
  X21.252660 Y14.567860
  X21.644760 Y14.571160
  X21.774860 Y14.563560
  X21.861660 Y14.558360
  X22.121860 Y14.531260
  X22.462960 Y14.476160
  X22.797360 Y14.398560
  X23.123960 Y14.299260
  X23.441760 Y14.178760
  X23.749860 Y14.037960
  X24.047360 Y13.877260
  X24.333360 Y13.697460
  X24.606760 Y13.499060
  X24.866660 Y13.282860
  X25.112160 Y13.049360
  X25.342260 Y12.799360
  X25.556060 Y12.533260
  X25.752360 Y12.251960
  X25.930760 Y11.956060
  X26.052560 Y11.724760
  X26.089660 Y11.646060
  X26.101860 Y11.620160
  X26.153660 Y11.549660
  X26.240560 Y11.477560
  X26.344360 Y11.433660
  X26.430560 Y11.420360
  X26.459060 Y11.421560
  X26.585760 Y11.428360
  X26.676060
  X26.947360 Y11.410160
  X27.298660 Y11.356560
  X27.637660 Y11.269360
  X27.962660 Y11.150460
  X28.271960 Y11.001660
  X28.563660 Y10.824460
  X28.835860 Y10.620960
  X29.087160 Y10.392660
  X29.315360 Y10.141560
  X29.518960 Y9.869360
  X29.696160 Y9.577860
  X29.845060 Y9.268760
  X29.963960 Y8.943860
  X30.051160 Y8.605060
  X30.104760 Y8.253960
  X30.122960 Y7.982860
  Y7.808260
  X30.106960 Y7.555560
  X30.060360 Y7.227190
  X29.984060 Y6.908720
  X29.879660 Y6.601820
  X29.748560 Y6.307930
  X29.592160 Y6.028570
  X29.411860 Y5.765330
  X29.208960 Y5.519730
  X28.984760 Y5.293280
  X28.740860 Y5.087480
  X28.478660 Y4.903960
  X28.199360 Y4.744120
  X27.904460 Y4.609570
  X27.595360 Y4.501830
  X27.273360 Y4.422400
  X27.023660 Y4.381280
  X26.939860 Y4.372800
G0 Z25.000000
  X7.105420 Y6.173600
F100	; set feedrate
G1 Z0.000000
F300	; set feedrate
G1 X7.037650 Y6.210710
  X6.842400 Y6.336400
  X6.616770 Y6.515870
  X6.428130 Y6.711190
  X6.310070 Y6.866360
  X6.276210 Y6.921420
  X6.242420 Y6.975290
  X6.158210 Y7.147670
  X6.074770 Y7.394260
  X6.025180 Y7.660560
  X6.008850 Y7.874560
  Y7.945960
  X6.008740 Y7.994060
  X6.017100 Y8.138260
  X6.042920 Y8.319260
  X6.086270 Y8.489160
  X6.147030 Y8.647860
  X6.225150 Y8.795260
  X6.320640 Y8.931360
  X6.433450 Y9.056160
  X6.529530 Y9.143060
  X6.563540 Y9.169460
  X6.598420 Y9.196560
  X6.709210 Y9.269960
  X6.869750 Y9.357260
  X7.044990 Y9.431260
  X7.234970 Y9.491960
  X7.439630 Y9.539260
  X7.658970 Y9.573160
  X7.892920 Y9.593460
  X8.079280 Y9.600260
  X11.199360
  Y8.758260
  X8.168360
  X8.083130 Y8.757660
  X7.827590 Y8.740660
  X7.535220 Y8.692460
  X7.290270 Y8.612660
  X7.137380 Y8.533760
  X7.091750 Y8.500160
  X7.049270 Y8.469060
  X6.937560 Y8.353960
  X6.827810 Y8.174160
  X6.762170 Y7.960560
  X6.740400 Y7.774860
  Y7.712860
  X6.739600 Y7.636060
  X6.765310 Y7.405360
  X6.845770 Y7.132790
  X6.980640 Y6.894570
  X7.116650 Y6.735610
  X7.168570 Y6.690080
  X7.221140 Y6.642670
  X7.400560 Y6.524180
  X7.673070 Y6.407040
  X7.985080 Y6.337600
  X8.247960 Y6.314650
  X11.199360
  Y5.472640
  X8.168360
  X8.082700 Y5.472530
  X7.825850 Y5.456190
  X7.532500 Y5.407860
  X7.287450 Y5.327510
  X7.135040 Y5.248400
  X7.089590 Y5.214820
  X7.047380 Y5.183190
  X6.936640 Y5.067150
  X6.827540 Y4.885720
  X6.762170 Y4.669730
  X6.740400 Y4.481260
  Y4.418390
  X6.739600 Y4.342690
  X6.765420 Y4.115260
  X6.846310 Y3.845470
  X6.981840 Y3.608760
  X7.118650 Y3.450180
  X7.170740 Y3.404710
  X7.223580 Y3.357680
  X7.403060 Y3.239890
  X7.675520 Y3.122650
  X7.986770 Y3.052550
  X8.248460 Y3.029280
  X11.199360
  Y2.187040
  X6.119310
  Y3.029280
  X6.919880
  X6.862960 Y3.063400
  X6.699930 Y3.178530
  X6.512600 Y3.342540
  X6.356560 Y3.520930
  X6.258700 Y3.663290
  X6.230860 Y3.713300
  X6.202640 Y3.763110
  X6.133200 Y3.920990
  X6.063860 Y4.148530
  X6.022530 Y4.395220
  X6.008850 Y4.594110
  Y4.660360
  X6.008580 Y4.726540
  X6.025840 Y4.925050
  X6.078630 Y5.170550
  X6.166720 Y5.396030
  X6.254950 Y5.552390
  X6.289890 Y5.600460
  X6.324500 Y5.648580
  X6.445150 Y5.780900
  X6.633250 Y5.936890
  X6.853590 Y6.067960
  X7.041030 Y6.151290
  X7.105420 Y6.173600
G0 Z25.000000
  X6.008850 Y13.267460
F100	; set feedrate
G1 Z0.000000
F300	; set feedrate
G1 X6.008740 Y13.333360
  X6.019490 Y13.531260
  X6.052470 Y13.780860
  X6.107650 Y14.016060
  X6.185070 Y14.236560
  X6.284570 Y14.442660
  X6.406270 Y14.634260
  X6.549920 Y14.811160
  X6.672100 Y14.935460
  X6.715670 Y14.973560
  X6.759780 Y15.012260
  X6.900610 Y15.118760
  X7.102710 Y15.244660
  X7.321890 Y15.351160
  X7.558110 Y15.438360
  X7.811360 Y15.506260
  X8.081650 Y15.554760
  X8.368960 Y15.583960
  X8.597060 Y15.593560
  X8.673160
  X8.748860 Y15.593260
  X8.976060 Y15.582960
  X9.262360 Y15.553360
  X9.531960 Y15.504960
  X9.784760 Y15.437260
  X10.020860 Y15.350460
  X10.240160 Y15.244360
  X10.442760 Y15.118760
  X10.584060 Y15.012260
  X10.628460 Y14.973560
  X10.671760 Y14.935360
  X10.793360 Y14.811160
  X10.936860 Y14.634260
  X11.058560 Y14.442860
  X11.158560 Y14.236860
  X11.236660 Y14.016260
  X11.292460 Y13.781260
  X11.326160 Y13.531760
  X11.337360 Y13.333560
  Y13.267460
  X11.336960 Y13.201060
  X11.325060 Y13.001860
  X11.291260 Y12.751160
  X11.235760 Y12.515460
  X11.158560 Y12.294660
  X11.059260 Y12.088660
  X10.937960 Y11.897460
  X10.794360 Y11.720860
  X10.672060 Y11.597160
  X10.628460 Y11.559060
  X10.583760 Y11.520460
  X10.441560 Y11.413960
  X10.238460 Y11.288360
  X10.019260 Y11.182260
  X9.783460 Y11.095460
  X9.531060 Y11.028060
  X9.261960 Y10.979860
  X8.976060 Y10.951060
  X8.748860 Y10.941460
  X8.673160
  X8.597060 Y10.941060
  X8.368860 Y10.950060
  X8.081560 Y10.978560
  X7.811360 Y11.026760
  X7.558220 Y11.094460
  X7.322110 Y11.181760
  X7.102990 Y11.288360
  X6.900840 Y11.414260
  X6.759840 Y11.520460
  X6.715670 Y11.559060
  X6.672040 Y11.596960
  X6.549770 Y11.720560
  X6.406100 Y11.896960
  X6.284570 Y12.088360
  X6.185220 Y12.294660
  X6.108030 Y12.515760
  X6.052900 Y12.751560
  X6.019810 Y13.002160
  X6.008850 Y13.201160
  Y13.267460
G0 Z25.000000
  X4.145140 Y22.917960
F100	; set feedrate
G1 Z0.000000
F300	; set feedrate
G1 Y23.746160
  X5.194400
  Y22.917960
  X4.145140
G0 Z25.000000
  X6.119310
F100	; set feedrate
G1 Z0.000000
F300	; set feedrate
G1 Y23.746160
  X11.199360
  Y22.917960
  X6.119310
G0 Z25.000000
  X8.141460 Y21.230860
F100	; set feedrate
G1 Z0.000000
F300	; set feedrate
G1 X11.199360
  Y20.402560
  X8.084040
  X7.831280 Y20.384760
  X7.540920 Y20.331960
  X7.296290 Y20.244260
  X7.142040 Y20.157460
  X7.096310 Y20.121260
  X7.052850 Y20.086560
  X6.939460 Y19.961460
  X6.828350 Y19.768260
  X6.762270 Y19.540560
  X6.740400 Y19.343360
  Y19.277560
  X6.739600 Y19.197560
  X6.765310 Y18.957160
  X6.845770 Y18.672860
  X6.980640 Y18.424260
  X7.116380 Y18.258960
  X7.168570 Y18.211260
  X7.221040 Y18.162660
  X7.400560 Y18.039960
  X7.673070 Y17.918160
  X7.985080 Y17.845360
  X8.247960 Y17.821160
  X11.199360
  Y16.978960
  X6.119310
  Y17.821160
  X6.919880
  X6.863890 Y17.856960
  X6.703680 Y17.976760
  X6.518290 Y18.146160
  X6.362590 Y18.329060
  X6.263850 Y18.474360
  X6.235420 Y18.525160
  X6.206500 Y18.575060
  X6.135100 Y18.733760
  X6.064460 Y18.960060
  X6.022580 Y19.202660
  X6.008850 Y19.396060
  Y19.460460
  X6.008740 Y19.513360
  X6.016880 Y19.671860
  X6.042110 Y19.870160
  X6.084320 Y20.055360
  X6.143610 Y20.227260
  X6.219790 Y20.386160
  X6.312950 Y20.531560
  X6.422970 Y20.663760
  X6.516450 Y20.754960
  X6.549860 Y20.782560
  X6.583930 Y20.810660
  X6.692770 Y20.886960
  X6.851740 Y20.977860
  X7.026810 Y21.054760
  X7.217830 Y21.117960
  X7.424860 Y21.167260
  X7.647850 Y21.202560
  X7.886720 Y21.223760
  X8.077750 Y21.230860
  X8.141460
G0 Z25.000000
  X4.683540 Y26.337460
F100	; set feedrate
G1 Z0.000000
F300	; set feedrate
G1 X6.119310
  Y28.049260
  X6.767960
  Y26.337460
  X9.521660
  X9.592160 Y26.337260
  X9.803760 Y26.347560
  X10.030760 Y26.379360
  X10.202560 Y26.432560
  X10.294360 Y26.483360
  X10.318760 Y26.506760
  X10.341760 Y26.528960
  X10.394860 Y26.612560
  X10.450160 Y26.762860
  X10.483960 Y26.957460
  X10.495360 Y27.136060
  Y28.049260
  X11.199360
  Y27.137560
  X11.193660 Y26.963360
  X11.176760 Y26.750060
  X11.148560 Y26.555360
  X11.109060 Y26.379360
  X11.058260 Y26.222160
  X10.996060 Y26.083660
  X10.922660 Y25.963760
  X10.861060 Y25.886060
  X10.838060 Y25.862560
  X10.814660 Y25.839260
  X10.737060 Y25.776460
  X10.618260 Y25.701860
  X10.481460 Y25.638760
  X10.326460 Y25.587160
  X10.153160 Y25.546960
  X9.961360 Y25.518360
  X9.750860 Y25.501160
  X9.578960 Y25.495460
  X6.767960
  Y24.887960
  X6.119310
  Y25.495460
  X4.683540
  Y26.337460
G0 Z25.000000
  X6.008850 Y31.133260
F100	; set feedrate
G1 Z0.000000
F300	; set feedrate
G1 X6.008740 Y31.199260
  X6.019490 Y31.397260
  X6.052470 Y31.646760
  X6.107650 Y31.881860
  X6.185070 Y32.102460
  X6.284570 Y32.308560
  X6.406270 Y32.500160
  X6.549920 Y32.677160
  X6.672100 Y32.801260
  X6.715670 Y32.839460
  X6.759780 Y32.878260
  X6.900610 Y32.984660
  X7.102710 Y33.110660
  X7.321890 Y33.217160
  X7.558110 Y33.304260
  X7.811360 Y33.372160
  X8.081650 Y33.420660
  X8.368960 Y33.449760
  X8.597060 Y33.459460
  X8.673160
  X8.748860 Y33.459260
  X8.976060 Y33.448760
  X9.262360 Y33.419360
  X9.531960 Y33.370760
  X9.784760 Y33.303260
  X10.020860 Y33.216460
  X10.240160 Y33.110160
  X10.442760 Y32.984660
  X10.584060 Y32.878260
  X10.628460 Y32.839460
  X10.671760 Y32.801260
  X10.793360 Y32.676960
  X10.936860 Y32.500160
  X11.058560 Y32.308660
  X11.158560 Y32.102660
  X11.236660 Y31.882260
  X11.292460 Y31.647160
  X11.326160 Y31.397560
  X11.337360 Y31.199360
  Y31.133260
  X11.336960 Y31.066860
  X11.325060 Y30.867660
  X11.291260 Y30.617160
  X11.235760 Y30.381460
  X11.158560 Y30.160460
  X11.059260 Y29.954460
  X10.937960 Y29.763260
  X10.794360 Y29.586760
  X10.672060 Y29.462960
  X10.628460 Y29.424960
  X10.583760 Y29.386260
  X10.441560 Y29.279960
  X10.238460 Y29.154260
  X10.019260 Y29.048160
  X9.783460 Y28.961260
  X9.531060 Y28.893960
  X9.261960 Y28.845760
  X8.976060 Y28.816960
  X8.748860 Y28.807260
  X8.673160
  X8.597060 Y28.806960
  X8.368860 Y28.815860
  X8.081560 Y28.844460
  X7.811360 Y28.892560
  X7.558220 Y28.960360
  X7.322110 Y29.047560
  X7.102990 Y29.154260
  X6.900840 Y29.280060
  X6.759840 Y29.386460
  X6.715670 Y29.424960
  X6.672040 Y29.462960
  X6.549770 Y29.586460
  X6.406100 Y29.762960
  X6.284570 Y29.954360
  X6.185220 Y30.160460
  X6.108030 Y30.381560
  X6.052900 Y30.617460
  X6.019810 Y30.867960
  X6.008850 Y31.066960
  Y31.133260
G0 Z25.000000
  X6.906210 Y37.812960
F100	; set feedrate
G1 Z0.000000
F300	; set feedrate
G1 X6.892150 Y37.789260
  X6.836820 Y37.666160
  X6.797320 Y37.535760
  X6.791180 Y37.508260
  X6.784290 Y37.480360
  X6.762430 Y37.334360
  X6.754290 Y37.192260
  Y37.144960
  X6.753490 Y37.061960
  X6.781100 Y36.812960
  X6.867310 Y36.522260
  X7.011720 Y36.272860
  X7.157400 Y36.109760
  X7.213060 Y36.063960
  X7.270400 Y36.015860
  X7.465390 Y35.898260
  X7.769920 Y35.780660
  X8.125360 Y35.710360
  X8.429060 Y35.686960
  X11.199360
  Y34.844760
  X6.119310
  Y35.686960
  X6.919880
  X6.863290 Y35.718360
  X6.701830 Y35.827260
  X6.515470 Y35.987860
  X6.359650 Y36.168360
  X6.261020 Y36.316460
  X6.233240 Y36.368560
  X6.204430 Y36.421460
  X6.134240 Y36.589060
  X6.064200 Y36.832960
  X6.022580 Y37.099660
  X6.008850 Y37.316460
  Y37.388660
  X6.008530 Y37.402160
  X6.010970 Y37.477660
  X6.017530 Y37.561060
  X6.019270 Y37.578360
  X6.020890 Y37.595160
  X6.046840 Y37.787260
  X6.050310 Y37.808360
  X6.906210 Y37.812960
G0 Z25.000000
  X6.712850 Y31.135460
F100	; set feedrate
G1 Z0.000000
F300	; set feedrate
G1 X6.712030 Y31.056260
  X6.743710 Y30.818060
  X6.842240 Y30.536560
  X7.007110 Y30.290360
  X7.174710 Y30.125160
  X7.237150 Y30.079060
  X7.303070 Y30.029460
  X7.522030 Y29.908560
  X7.856950 Y29.787260
  X8.240960 Y29.714960
  X8.565060 Y29.690760
  X8.673160
  X8.780960 Y29.690460
  X9.104660 Y29.714260
  X9.487860 Y29.786560
  X9.822860 Y29.907560
  X10.042760 Y30.027660
  X10.109360 Y30.076560
  X10.171360 Y30.122560
  X10.337560 Y30.287260
  X10.501460 Y30.534060
  X10.600360 Y30.816860
  X10.633460 Y31.055760
  Y31.135460
  X10.633160 Y31.213960
  X10.599960 Y31.449460
  X10.501360 Y31.729960
  X10.337060 Y31.976160
  X10.169460 Y32.141760
  X10.106960 Y32.187660
  X10.039860 Y32.236860
  X9.819260 Y32.357260
  X9.484660 Y32.478660
  X9.102760 Y32.551560
  X8.780460 Y32.576060
  X8.673160
  X8.566060 Y32.575860
  X8.244760 Y32.551560
  X7.863500 Y32.478660
  X7.529090 Y32.357560
  X7.308450 Y32.236960
  X7.241490 Y32.187660
  X7.178720 Y32.141560
  X7.010150 Y31.976060
  X6.844950 Y31.730360
  X6.745840 Y31.450160
  X6.712850 Y31.214260
  Y31.135460
G0 Z25.000000
  Y13.269460
F100	; set feedrate
G1 Z0.000000
F300	; set feedrate
G1 X6.712030 Y13.190360
  X6.743710 Y12.952160
  X6.842240 Y12.670560
  X7.007110 Y12.424460
  X7.174710 Y12.259360
  X7.237150 Y12.213160
  X7.303070 Y12.163560
  X7.522030 Y12.042660
  X7.856950 Y11.921260
  X8.240960 Y11.848960
  X8.565060 Y11.824960
  X8.673160
  X8.780960 Y11.824660
  X9.104660 Y11.848260
  X9.487860 Y11.920560
  X9.822860 Y12.041760
  X10.042760 Y12.161760
  X10.109360 Y12.210760
  X10.171360 Y12.256760
  X10.337560 Y12.421260
  X10.501460 Y12.668260
  X10.600360 Y12.951060
  X10.633460 Y13.189960
  Y13.269460
  X10.633160 Y13.348160
  X10.599960 Y13.583560
  X10.501360 Y13.863960
  X10.337060 Y14.110360
  X10.169460 Y14.275760
  X10.106960 Y14.321860
  X10.039860 Y14.371060
  X9.819260 Y14.491460
  X9.484660 Y14.612860
  X9.102760 Y14.685760
  X8.780460 Y14.710060
  X8.566060
  X8.244760 Y14.685660
  X7.863500 Y14.612860
  X7.529090 Y14.491560
  X7.308450 Y14.371060
  X7.241490 Y14.321860
  X7.178720 Y14.275660
  X7.010150 Y14.110160
  X6.844950 Y13.864360
  X6.745840 Y13.584360
  X6.712850 Y13.348260
  Y13.269460
G0 Z25.000000
  X26.684760 Y12.213960
F100	; set feedrate
G1 Z0.000000
F300	; set feedrate
G1 X26.614760 Y12.347160
  X26.377860 Y12.732260
  X26.026860 Y13.207860
  X25.635860 Y13.639360
  X25.208960 Y14.025660
  X24.750060 Y14.365460
  X24.263260 Y14.657560
  X23.752360 Y14.900760
  X23.221560 Y15.093660
  X22.674860 Y15.235160
  X22.116160 Y15.323960
  X21.549460 Y15.358760
  X20.978760 Y15.338560
  X20.408060 Y15.261860
  X19.841560 Y15.127460
  X19.282960 Y14.934060
  X18.869460 Y14.750760
  X18.736460 Y14.680660
  X18.657360 Y14.639060
  X18.425760 Y14.504960
  X18.128060 Y14.311960
  X17.844160 Y14.102660
  X17.574460 Y13.877860
  X17.319660 Y13.638160
  X17.079860 Y13.384260
  X16.856060 Y13.116960
  X16.648560 Y12.837460
  X16.457960 Y12.545860
  X16.284760 Y12.243360
  X16.129660 Y11.930760
  X15.993060 Y11.608560
  X15.875460 Y11.277660
  X15.777660 Y10.938860
  X15.699860 Y10.592960
  X15.654360 Y10.328960
  X15.642860 Y10.240560
  X15.621460 Y10.241960
  X15.446160 Y10.248660
  X15.302360
  X15.046460 Y10.231460
  X14.714860 Y10.180860
  X14.394860 Y10.098560
  X14.088060 Y9.986260
  X13.796260 Y9.845660
  X13.521060 Y9.678460
  X13.263960 Y9.486160
  X13.026860 Y9.270660
  X12.811260 Y9.033660
  X12.619060 Y8.776560
  X12.451660 Y8.501260
  X12.311160 Y8.209460
  X12.198960 Y7.902660
  X12.116560 Y7.582760
  X12.066060 Y7.251360
  X12.048760 Y6.995320
  Y6.824580
  X12.066060 Y6.568390
  X12.116560 Y6.236640
  X12.198960 Y5.916490
  X12.311160 Y5.609510
  X12.451660 Y5.317530
  X12.619060 Y5.042080
  X12.811260 Y4.784970
  X13.026860 Y4.547780
  X13.263960 Y4.332180
  X13.521060 Y4.139900
  X13.796260 Y3.972640
  X14.088060 Y3.832010
  X14.394860 Y3.719710
  X14.714860 Y3.637400
  X15.046460 Y3.586790
  X15.302360 Y3.569540
  X26.998360
  X27.058360 Y3.578430
  X27.122160 Y3.598290
  X27.134260 Y3.603710
  X27.243760 Y3.617500
  X27.570060 Y3.680970
  X27.987660 Y3.799510
  X28.385460 Y3.956790
  X28.761260 Y4.150540
  X29.113560 Y4.378180
  X29.440060 Y4.637400
  X29.739160 Y4.925760
  X30.008960 Y5.240760
  X30.247360 Y5.580050
  X30.452860 Y5.941220
  X30.623060 Y6.321820
  X30.756560 Y6.719390
  X30.851260 Y7.131540
  X30.905360 Y7.555760
  X30.916860 Y7.989860
  X30.897660 Y8.321560
  X30.883960 Y8.431160
  X30.871460 Y8.529860
  X30.816160 Y8.823760
  X30.714660 Y9.202760
  X30.580860 Y9.566560
  X30.416560 Y9.913660
  X30.223360 Y10.242460
  X30.003060 Y10.551460
  X29.757560 Y10.839160
  X29.488060 Y11.103860
  X29.196860 Y11.344260
  X28.885160 Y11.558660
  X28.554860 Y11.745560
  X28.207860 Y11.903560
  X27.845560 Y12.030860
  X27.469860 Y12.126060
  X27.082360 Y12.187560
  X26.784160 Y12.211960
  X26.684760 Y12.213960
G0 Z25.000000
  X33.175560 Y22.665060
F100	; set feedrate
G1 Z0.000000
F300	; set feedrate
G1 X33.129460 Y22.750160
  X32.974060 Y22.996260
  X32.744760 Y23.299760
  X32.490060 Y23.574660
  X32.212560 Y23.820160
  X31.914860 Y24.035460
  X31.599660 Y24.219960
  X31.269260 Y24.372660
  X30.926260 Y24.492960
  X30.573560 Y24.580060
  X30.213560 Y24.633260
  X29.848760 Y24.651760
  X29.481760 Y24.634660
  X29.115160 Y24.581260
  X28.751560 Y24.491060
  X28.393560 Y24.362860
  X28.128760 Y24.241960
  X28.043760 Y24.196060
  X27.946560 Y24.143360
  X27.667260 Y23.962860
  X27.323760 Y23.690460
  X27.016160 Y23.382460
  X26.746560 Y23.042260
  X26.517660 Y22.673560
  X26.332160 Y22.279960
  X26.192260 Y21.864760
  X26.117160 Y21.541060
  X26.100560 Y21.431760
  X26.058260 Y21.432460
  X25.846860 Y21.420360
  X25.637560 Y21.388560
  X25.596160 Y21.379260
  X25.515360 Y21.360860
  X25.278060 Y21.281860
  X24.982560 Y21.140860
  X24.713060 Y20.960360
  X24.473560 Y20.743760
  X24.267360 Y20.495060
  X24.098360 Y20.217860
  X23.970060 Y19.916060
  X23.901160 Y19.675160
  X23.886260 Y19.593360
  X23.874860 Y19.531560
  X23.854760 Y19.343660
  X23.850860 Y19.094260
  X23.873960 Y18.847160
  X23.923660 Y18.604660
  X23.999360 Y18.369060
  X24.100460 Y18.142460
  X24.226260 Y17.926860
  X24.336260 Y17.772960
  X24.376560 Y17.724660
  X24.415560 Y17.677860
  X24.542860 Y17.545760
  X24.726060 Y17.387660
  X24.924060 Y17.251460
  X25.135160 Y17.137960
  X25.357260 Y17.048160
  X25.588360 Y16.982860
  X25.826660 Y16.943060
  X26.009360 Y16.929460
  X33.282560
  X33.334760 Y16.935760
  X33.390760 Y16.950060
  X33.401460 Y16.954260
  X33.474060 Y16.965060
  X33.690060 Y17.011860
  X33.966160 Y17.096460
  X34.228560 Y17.206560
  X34.475760 Y17.340560
  X34.706760 Y17.496960
  X34.920360 Y17.673760
  X35.115160 Y17.869660
  X35.290160 Y18.082860
  X35.443960 Y18.311760
  X35.575460 Y18.554660
  X35.683360 Y18.810060
  X35.766460 Y19.076160
  X35.823560 Y19.351560
  X35.853560 Y19.634360
  X35.854860 Y19.923160
  X35.837360 Y20.143360
  X35.826660 Y20.216060
  X35.817560 Y20.278260
  X35.779460 Y20.463260
  X35.711960 Y20.702160
  X35.625160 Y20.931760
  X35.519860 Y21.151160
  X35.397260 Y21.359660
  X35.258060 Y21.556060
  X35.103360 Y21.739460
  X34.934160 Y21.909260
  X34.751560 Y22.064360
  X34.556260 Y22.203960
  X34.349460 Y22.327160
  X34.131960 Y22.432960
  X33.904860 Y22.520660
  X33.669260 Y22.588960
  X33.425760 Y22.637560
  X33.238260 Y22.660860
  X33.175560 Y22.665060
M5	; stop spindle
G0 Z25.000000
M2	; end program
