G40	; disable tool radius compensation
G49	; disable tool length compensation
G80	; cancel modal motion
G54	; select coordinate system 1
G90	; disable incremental moves
G21	; metric
F300	; set feedrate
S1000	; set spindle speed
G61	; exact path mode
M3	; start spindle
G04 P3.0	; wait for 3.0 seconds
G0 X15.443405 Y2.925385 Z25.000000
F100	; set feedrate
G1 Z0.000000
F300	; set feedrate
G1 X12.854105
  X13.918205 Y22.303555
  X14.379805
  X15.443405 Y2.925385
G0 Z25.000000
  X12.159805 Y23.459555
F100	; set feedrate
G1 Z0.000000
F300	; set feedrate
G1 X12.151805 Y23.434755
  X12.116905 Y23.364055
  X12.056405 Y23.285855
  X11.978205 Y23.224955
  X11.907305 Y23.189555
  X11.882605 Y23.181155
  X1.893325 Y20.499655
  X1.893325
  X1.884695
  X1.858925 Y20.501155
  X1.824195 Y20.511355
  X1.789255 Y20.538555
  X1.761435 Y20.577755
  X1.754325 Y20.591755
  Y20.600655
  X1.755035 Y20.626755
  X1.760125 Y20.661455
  X1.773905 Y20.696155
  X1.793175 Y20.723355
  X1.800865 Y20.731155
  X11.512105 Y24.337555
  X11.522705
  X11.554305 Y24.344955
  X11.605105 Y24.360855
  X11.655805 Y24.376855
  X11.687505 Y24.384055
  X11.713505
  X11.760105 Y24.383355
  X11.813305 Y24.378355
  X11.866905 Y24.364555
  X11.914305 Y24.345255
  X11.929605 Y24.337555
  X11.956405 Y24.328855
  X12.031605 Y24.286555
  X12.125405 Y24.205055
  X12.201605 Y24.097455
  X12.243705 Y24.001555
  X12.251905 Y23.968255
  X12.260105 Y23.935855
  X12.276905 Y23.836755
  X12.275505 Y23.713955
  X12.239405 Y23.591055
  X12.182705 Y23.490055
  X12.159805 Y23.459555
G0 Z25.000000
  X12.575805 Y36.917555
F100	; set feedrate
G1 Z0.000000
F300	; set feedrate
G1 Y36.926055
  X12.583905 Y36.951355
  X12.605005 Y36.980855
  X12.634605 Y37.002055
  X12.659705 Y37.010055
  X12.677105
  X12.703305 Y37.002055
  X12.738305 Y36.980855
  X12.773205 Y36.951355
  X12.799005 Y36.926155
  X12.807505 Y36.917555
  X14.564405 Y26.696555
  Y26.670755
  X14.562905 Y26.593255
  X14.552905 Y26.494255
  X14.525405 Y26.403855
  X14.488305 Y26.342455
  X14.471905 Y26.325855
  X14.455005 Y26.300455
  X14.394005 Y26.231155
  X14.298605 Y26.153355
  X14.185805 Y26.092655
  X14.089105 Y26.057255
  X14.056105 Y26.048955
  X14.023305
  X13.925205 Y26.058355
  X13.807505 Y26.089655
  X13.698605 Y26.146755
  X13.618205 Y26.209955
  X13.594305 Y26.233855
  X13.576905 Y26.251055
  X13.532805 Y26.310855
  X13.484105 Y26.401455
  X13.444005 Y26.500655
  X13.417105 Y26.578255
  X13.408305 Y26.604255
  X12.575805 Y36.917555
G0 Z25.000000
  X15.074105 Y24.245155
F100	; set feedrate
G1 Z0.000000
F300	; set feedrate
G1 Y24.198855
  X15.055305 Y24.059555
  X15.001205 Y23.886355
  X14.915705 Y23.729255
  X14.802305 Y23.592155
  X14.665205 Y23.479055
  X14.507905 Y23.393555
  X14.334305 Y23.339355
  X14.194705 Y23.320455
  X14.101605
  X13.962305 Y23.339355
  X13.789105 Y23.393555
  X13.632205 Y23.479055
  X13.495105 Y23.592155
  X13.381905 Y23.729255
  X13.296505 Y23.886355
  X13.242305 Y24.059555
  X13.223405 Y24.198855
  Y24.291555
  X13.242305 Y24.430855
  X13.296505 Y24.604055
  X13.381905 Y24.761155
  X13.495105 Y24.898155
  X13.632205 Y25.011355
  X13.789105 Y25.096855
  X13.962305 Y25.150855
  X14.101605 Y25.169755
  X14.194705
  X14.334305 Y25.150855
  X14.507905 Y25.096855
  X14.665205 Y25.011355
  X14.802305 Y24.898155
  X14.915705 Y24.761155
  X15.001205 Y24.604055
  X15.055305 Y24.430855
  X15.074105 Y24.291555
  Y24.245155
G0 Z25.000000
  X26.542205 Y20.962555
F100	; set feedrate
G1 Z0.000000
F300	; set feedrate
G1 X16.415105 Y23.181155
  X16.390705 Y23.189355
  X16.318705 Y23.217855
  X16.235705 Y23.262955
  X16.161205 Y23.325155
  X16.106805 Y23.389755
  X16.091205 Y23.412955
  X16.073705 Y23.439255
  X16.031205 Y23.524355
  X15.992905 Y23.644355
  X15.980505 Y23.764355
  X15.990005 Y23.849355
  X15.998705 Y23.875755
  X16.006505 Y23.907255
  X16.042505 Y23.998555
  X16.108005 Y24.095255
  X16.200005 Y24.174555
  X16.290905 Y24.229555
  X16.322605 Y24.245155
  X16.347705 Y24.253655
  X16.425505 Y24.272255
  X16.524605 Y24.286155
  X16.614805 Y24.291355
  X16.672605 Y24.292155
  X16.691905
  X26.589105 Y21.192855
  X26.597605
  X26.622705 Y21.177655
  X26.652505 Y21.141055
  X26.673605 Y21.095755
  X26.681605 Y21.065155
  Y21.046455
  X26.666405 Y21.020755
  X26.629405 Y20.991155
  X26.583905 Y20.970455
  X26.552605 Y20.962555
  X26.542205
G0 Z25.000000
  X29.178605 Y28.268955
F100	; set feedrate
G1 Z0.000000
F300	; set feedrate
G1 X29.170105 Y28.260155
  X29.136205 Y28.241855
  X29.080305 Y28.227955
  X29.015705 Y28.222855
  X28.964305 Y28.222055
  X28.947205
  X20.993005 Y29.054555
  X28.993705 Y28.869755
  X29.009105
  X29.055805 Y28.861855
  X29.109605 Y28.841155
  X29.163205 Y28.811755
  X29.209605 Y28.785655
  X29.225405 Y28.777655
  X29.240705 Y28.762255
  X29.278705 Y28.708355
  X29.306105 Y28.639055
  X29.316105 Y28.569655
  X29.317605 Y28.517655
  Y28.489655
  X29.315405 Y28.457555
  X29.300105 Y28.401855
  X29.258905 Y28.337555
  X29.200405 Y28.283555
  X29.178605 Y28.268955
G0 Z25.000000
  X30.843305 Y29.009055
F100	; set feedrate
G1 Z0.000000
F300	; set feedrate
G1 X30.873005
  X30.962105 Y28.996555
  X31.074005 Y28.960755
  X31.176105 Y28.904355
  X31.265805 Y28.830155
  X31.340405 Y28.740755
  X31.396905 Y28.638855
  X31.432905 Y28.527155
  X31.445505 Y28.437955
  Y28.378655
  X31.432905 Y28.289555
  X31.396905 Y28.177555
  X31.340405 Y28.075455
  X31.265805 Y27.985755
  X31.176105 Y27.911355
  X31.074005 Y27.854655
  X30.962105 Y27.818655
  X30.873005 Y27.806055
  X30.813605
  X30.724405 Y27.818655
  X30.612705 Y27.854655
  X30.510805 Y27.911355
  X30.421205 Y27.985755
  X30.346905 Y28.075455
  X30.290505 Y28.177555
  X30.254705 Y28.289555
  X30.242205 Y28.378655
  Y28.441355
  X30.254705 Y28.540255
  X30.290505 Y28.657955
  X30.346905 Y28.760755
  X30.421205 Y28.847155
  X30.510805 Y28.916455
  X30.612705 Y28.967155
  X30.724405 Y28.998355
  X30.813605 Y29.009055
  X30.843305
G0 Z25.000000
  X31.814605 Y29.841355
F100	; set feedrate
G1 Z0.000000
F300	; set feedrate
G1 X31.804705 Y29.851155
  X31.772505 Y29.877755
  X31.721905 Y29.922555
  X31.671505 Y29.984655
  X31.637505 Y30.050055
  X31.630005 Y30.073155
  X31.637505 Y30.088255
  X31.657105 Y30.134955
  X31.675705 Y30.188155
  X31.694605 Y30.241755
  X31.714705 Y30.289055
  X31.722505 Y30.304555
  X35.930805 Y37.102155
  X32.277805 Y29.980655
  X32.269705 Y29.964955
  X32.242105 Y29.919955
  X32.202205 Y29.876355
  X32.153705 Y29.850055
  X32.107205 Y29.841355
  X32.091805
  X32.069005 Y29.833555
  X31.996805 Y29.821555
  X31.919005 Y29.823655
  X31.858205 Y29.834755
  X31.825405 Y29.841355
  X31.814605
G0 Z25.000000
  X32.277805 Y26.927955
F100	; set feedrate
G1 Z0.000000
F300	; set feedrate
G1 X32.268205 Y26.937455
  X32.243405 Y26.969555
  X32.213905 Y27.019955
  X32.193205 Y27.070655
  X32.185205 Y27.102455
  Y27.136855
  X32.193205 Y27.208355
  X32.213905 Y27.286455
  X32.243405 Y27.346855
  X32.267905 Y27.380355
  X32.277805 Y27.389755
  X32.287205 Y27.399655
  X32.320705 Y27.424055
  X32.381105 Y27.453655
  X32.459105 Y27.474355
  X32.530805 Y27.482255
  X32.570005
  X32.616105 Y27.474355
  X32.664705 Y27.453655
  X32.704405 Y27.424055
  X32.730905 Y27.398655
  X32.739605 Y27.389755
  X38.288705 Y21.702755
  X32.277805 Y26.927955
G0 Z25.000000
  X29.965305 Y12.129355
F100	; set feedrate
G1 Z0.000000
F300	; set feedrate
G1 X30.797905 Y26.836055
  X30.935405
  X31.767905 Y12.129355
  X29.965305
G0 Z25.000000
  X26.958605 Y22.118955
F100	; set feedrate
G1 Z0.000000
F300	; set feedrate
G1 X17.015805 Y25.169755
  X16.954605 Y25.187555
  X16.765105 Y25.221155
  X16.501505 Y25.228655
  X16.229105 Y25.183655
  X16.018205 Y25.110455
  X15.952205 Y25.077255
  X15.944605 Y25.069655
  X15.917905 Y25.050355
  X15.883005 Y25.031755
  X15.848005 Y25.012955
  X15.820705 Y24.993155
  X15.812905 Y24.985355
  X15.786405 Y25.038855
  X15.693305 Y25.192455
  X15.547505 Y25.390355
  X15.384105 Y25.570855
  X15.257205 Y25.689255
  X15.212105 Y25.725055
  Y25.732155
  X15.219405 Y25.752955
  X15.235505 Y25.771855
  X15.251605 Y25.790455
  X15.259005 Y25.810755
  Y25.817455
  X15.293205 Y25.877755
  X15.379405 Y26.067755
  X15.460905 Y26.326755
  X15.499405 Y26.585755
  X15.499005 Y26.774355
  X15.490405 Y26.836055
  X13.732205 Y37.055155
  X13.723705 Y37.105855
  X13.678705 Y37.254355
  X13.590505 Y37.432755
  X13.472205 Y37.587255
  X13.327605 Y37.714555
  X13.161505 Y37.811455
  X12.977905 Y37.874955
  X12.781205 Y37.901355
  X12.626205 Y37.896155
  X12.575805 Y37.887855
  X12.525705 Y37.883655
  X12.377105 Y37.849955
  X12.198305 Y37.773355
  X12.042205 Y37.663255
  X11.911605 Y37.524355
  X11.809105 Y37.361555
  X11.737505 Y37.179655
  X11.699605 Y36.983655
  X11.693705 Y36.829255
  X11.698105 Y36.778255
  X12.530305 Y26.465155
  X12.538905 Y26.404055
  X12.581905 Y26.223155
  X12.668605 Y25.985355
  X12.790205 Y25.756355
  X12.903905 Y25.591555
  X12.946505 Y25.540655
  X12.911505 Y25.514055
  X12.816605 Y25.421055
  X12.703905 Y25.279955
  X12.608305 Y25.130355
  X12.548605 Y25.022055
  X12.530305 Y24.985355
  X12.520705 Y24.994755
  X12.488205 Y25.019355
  X12.437605 Y25.048855
  X12.387205 Y25.069555
  X12.356105 Y25.077255
  X12.345805
  X12.285705 Y25.103255
  X12.094805 Y25.155755
  X11.830805 Y25.181855
  X11.558205 Y25.155755
  X11.348705 Y25.102555
  X11.281805 Y25.077255
  X1.523965 Y21.471355
  X1.477315 Y21.454355
  X1.344115 Y21.384955
  X1.188835 Y21.268355
  X1.060745 Y21.126055
  X0.962495 Y20.962055
  X0.896795 Y20.780755
  X0.866295 Y20.586355
  X0.873725 Y20.383355
  X0.905035 Y20.226155
  X0.921745 Y20.175855
  X0.934715 Y20.137055
  X0.986425 Y20.024555
  X1.073765 Y19.884655
  X1.180645 Y19.758855
  X1.303695 Y19.649755
  X1.439695 Y19.560255
  X1.585495 Y19.492855
  X1.737725 Y19.450455
  X1.854425 Y19.435755
  X1.927935
  X2.031765 Y19.441555
  X2.147115 Y19.470855
  X2.170225 Y19.482755
  X12.159805 Y22.164555
  X12.210905 Y22.207055
  X12.366905 Y22.331455
  X12.565005 Y22.493855
  X12.745205 Y22.664755
  X12.865505 Y22.806155
  X12.899605 Y22.857255
  X12.906505 Y22.850655
  X12.927505 Y22.830355
  X12.946405 Y22.811755
  X12.965005 Y22.792955
  X12.985305 Y22.772255
  X12.992105 Y22.765355
  X11.929605 Y2.925385
  Y2.925385
  X10.609105
  X10.534305 Y2.916925
  X10.444305 Y2.892235
  X10.365305 Y2.852415
  X10.298305 Y2.798535
  X10.244305 Y2.731705
  X10.204405 Y2.652925
  X10.179705 Y2.563305
  X10.171205 Y2.488805
  Y2.439055
  X10.179705 Y2.364195
  X10.204405 Y2.274175
  X10.244305 Y2.195135
  X10.298305 Y2.128025
  X10.365305 Y2.073925
  X10.444305 Y2.033995
  X10.534305 Y2.009265
  X10.609105 Y2.000745
  X17.734005
  X17.808905 Y2.009265
  X17.898905 Y2.033995
  X17.977905 Y2.073925
  X18.045005 Y2.128025
  X18.099005 Y2.195135
  X18.139005 Y2.274175
  X18.163705 Y2.364195
  X18.172205 Y2.439055
  Y2.488805
  X18.163705 Y2.563305
  X18.139005 Y2.652925
  X18.099005 Y2.731705
  X18.045005 Y2.798535
  X17.977905 Y2.852415
  X17.898905 Y2.892235
  X17.808905 Y2.916925
  X17.734005 Y2.925385
  X16.415105
  X15.304605 Y22.765355
  X15.311505 Y22.772255
  X15.332305 Y22.792955
  X15.351205 Y22.811755
  X15.369705 Y22.830355
  X15.389805 Y22.850655
  X15.396605 Y22.857255
  X15.438905 Y22.806855
  X15.579805 Y22.667055
  X15.784705 Y22.511355
  X16.015405 Y22.390055
  X16.209605 Y22.320055
  X16.276105 Y22.303555
  X26.404705 Y20.083355
  X26.677305
  X26.805505 Y20.098255
  X26.969605 Y20.141355
  X27.123605 Y20.210255
  X27.265205 Y20.303155
  X27.391605 Y20.417555
  X27.500305 Y20.551555
  X27.588305 Y20.702855
  X27.640205 Y20.826555
  X27.653205 Y20.869055
  X27.665805 Y20.915855
  X27.685505 Y21.061455
  X27.680705 Y21.253255
  X27.640205 Y21.439555
  X27.565705 Y21.615355
  X27.458605 Y21.776055
  X27.320705 Y21.916855
  X27.153405 Y22.032755
  X27.008905 Y22.102155
  X26.958605 Y22.118955
G0 Z25.000000
  X38.890805 Y22.303555
F100	; set feedrate
G1 Z0.000000
F300	; set feedrate
G1 X33.386905 Y28.084555
  X33.345505 Y28.125855
  X33.204705 Y28.233355
  X33.005405 Y28.338855
  X32.788705 Y28.409555
  X32.613605 Y28.445655
  X32.554705 Y28.453855
  X32.370105
  Y28.481755
  X32.362105 Y28.565255
  X32.340905 Y28.685255
  X32.311405 Y28.805155
  X32.286605 Y28.889055
  X32.277805 Y28.916555
  X32.286205
  X32.312105 Y28.917455
  X32.346605 Y28.922255
  X32.381205 Y28.935855
  X32.408005 Y28.954655
  X32.415705 Y28.962155
  X32.467505 Y28.979355
  X32.614705 Y29.056155
  X32.791605 Y29.193555
  X32.942505 Y29.365855
  X33.037505 Y29.512555
  X33.063305 Y29.564355
  X36.716405 Y36.686155
  X36.737505 Y36.724255
  X36.784005 Y36.847855
  X36.814705 Y37.016855
  X36.810905 Y37.188155
  X36.774605 Y37.356155
  X36.707805 Y37.515655
  X36.612905 Y37.660855
  X36.491805 Y37.786755
  X36.385405 Y37.866455
  X36.346905 Y37.887855
  X36.309005 Y37.908955
  X36.187205 Y37.957555
  X36.022605 Y37.994055
  X35.856805 Y37.999255
  X35.693705 Y37.974655
  X35.537205 Y37.921855
  X35.390805 Y37.842555
  X35.258605 Y37.738255
  X35.169705 Y37.644955
  X35.144005 Y37.610855
  X30.935405 Y30.765855
  X30.909705 Y30.722655
  X30.848405 Y30.583855
  X30.791505 Y30.384555
  X30.760405 Y30.167855
  X30.750905 Y29.992255
  Y29.933655
  X30.716205
  X30.612605 Y29.925255
  X30.475805 Y29.900455
  X30.342205 Y29.860655
  X30.213305 Y29.806555
  X30.091105 Y29.739555
  X29.976805 Y29.660455
  X29.872305 Y29.570455
  X29.801105 Y29.496755
  X29.779305 Y29.470455
  X29.738205 Y29.503855
  X29.605805 Y29.592755
  X29.427305 Y29.679755
  X29.240005 Y29.731855
  X29.089405 Y29.749255
  X29.039105
  X21.039705 Y29.933655
  X20.996905
  X20.869005 Y29.916855
  X20.707105 Y29.868655
  X20.558005 Y29.792455
  X20.426505 Y29.691155
  X20.316605 Y29.568255
  X20.232705 Y29.426755
  X20.179305 Y29.270255
  X20.160505 Y29.143655
  Y29.101455
  X20.156405 Y29.059255
  X20.162205 Y28.930655
  X20.199105 Y28.767255
  X20.267305 Y28.614755
  X20.363305 Y28.476555
  X20.482905 Y28.355755
  X20.622805 Y28.255455
  X20.778905 Y28.179255
  X20.904605 Y28.138555
  X20.947605 Y28.129955
  X28.901605 Y27.251855
  X29.082605
  X29.212905 Y27.268555
  X29.386605 Y27.315355
  X29.560205 Y27.388155
  X29.691505 Y27.457055
  X29.733905 Y27.482255
  X29.741905 Y27.465755
  X29.775505 Y27.420355
  X29.826205 Y27.367155
  X29.876805 Y27.313955
  X29.910305 Y27.268555
  X29.918305 Y27.251855
  X29.039105 Y12.129355
  X28.089705
  X28.015205 Y12.120855
  X27.925505 Y12.096055
  X27.846805 Y12.056055
  X27.780005 Y12.001855
  X27.726105 Y11.934655
  X27.686205 Y11.855755
  X27.661605 Y11.765955
  X27.653205 Y11.691355
  Y11.641755
  X27.661605 Y11.567255
  X27.686205 Y11.477555
  X27.726105 Y11.398755
  X27.780005 Y11.331755
  X27.846805 Y11.277855
  X27.925505 Y11.237955
  X28.015205 Y11.213255
  X28.089705 Y11.204755
  X33.596605
  X33.671505 Y11.213255
  X33.761405 Y11.237955
  X33.840405 Y11.277855
  X33.907505 Y11.331755
  X33.961505 Y11.398755
  X34.001405 Y11.477555
  X34.026105 Y11.567255
  X34.034605 Y11.641755
  Y11.691355
  X34.026105 Y11.765955
  X34.001405 Y11.855755
  X33.961505 Y11.934655
  X33.907505 Y12.001855
  X33.840405 Y12.056055
  X33.761405 Y12.096055
  X33.671505 Y12.120855
  X33.596605 Y12.129355
  X32.647105
  X31.861405 Y26.003355
  X37.642305 Y21.008155
  X37.675905 Y20.982855
  X37.781505 Y20.913255
  X37.925105 Y20.840255
  X38.077605 Y20.793355
  X38.201805 Y20.776755
  X38.286405
  X38.415805 Y20.794055
  X38.584105 Y20.846155
  X38.743705 Y20.933155
  X38.857205 Y21.021455
  X38.890805 Y21.055055
  X38.920305 Y21.088555
  X38.997105 Y21.199555
  X39.073005 Y21.353855
  X39.118605 Y21.514655
  X39.133705 Y21.678855
  X39.118605 Y21.842955
  X39.073005 Y22.003955
  X38.997105 Y22.158555
  X38.920305 Y22.269755
  X38.890805 Y22.303555
M5	; stop spindle
G0 Z25.000000
M2	; end program
