G21 (metric ftw)
G90 (absolute mode)
G92 X0.00 Y0.00 Z0.00 (you are here)

M300 S30 (pen down)
G4 P50 (wait 50ms)
M300 S50 (pen up)
G4 P50 (wait 50ms)
M18 (disengage drives)
M01 (Was registration test successful?)
M17 (engage drives if YES, and continue)

(Header end)












G1  X24.596700  Y20.217400

M300 S30 (pen down)
G4 P50 (wait 50ms)

G1  X15.402200  Y20.217400
M300 S50 (pen up)
G4 P50 (wait 50ms)
G1  X19.999300  Y24.814400

M300 S30 (pen down)
G4 P50 (wait 50ms)

G1  X19.999300  Y15.620000
M300 S50 (pen up)
G4 P50 (wait 50ms)
G1  X34.976100  Y20.217400

M300 S30 (pen down)
G4 P50 (wait 50ms)

G1  X34.976100  Y20.024700
G1  X34.956700  Y19.446500
G1  X34.898700  Y18.685800
G1  X34.803600  Y17.936300
G1  X34.671900  Y17.198600
G1  X34.504700  Y16.474000
G1  X34.302900  Y15.763300
G1  X34.067500  Y15.067400
G1  X33.799300  Y14.387200
G1  X33.499400  Y13.723800
G1  X33.168700  Y13.078000
G1  X32.808200  Y12.450800
G1  X32.418600  Y11.843200
G1  X32.001100  Y11.256000
G1  X31.556500  Y10.690200
G1  X31.085800  Y10.146800
G1  X30.590000  Y9.626740
G1  X30.069900  Y9.130860
G1  X29.526400  Y8.660150
G1  X28.960700  Y8.215560
G1  X28.373500  Y7.798010
G1  X27.765800  Y7.408530
G1  X27.138600  Y7.047900
G1  X26.492900  Y6.717240
G1  X25.829400  Y6.417320
G1  X25.149300  Y6.149190
G1  X24.453300  Y5.913740
G1  X23.742600  Y5.711970
G1  X23.018100  Y5.544760
G1  X22.280400  Y5.413080
G1  X21.530800  Y5.317820
G1  X20.770100  Y5.260040
G1  X20.191900  Y5.240500
G1  X19.806700  Y5.240500
G1  X19.228600  Y5.260040
G1  X18.468200  Y5.317820
G1  X17.718800  Y5.413080
G1  X16.981300  Y5.544760
G1  X16.256700  Y5.711970
G1  X15.546100  Y5.913740
G1  X14.850100  Y6.149190
G1  X14.170100  Y6.417320
G1  X13.506800  Y6.717240
G1  X12.861100  Y7.047900
G1  X12.234100  Y7.408530
G1  X11.626500  Y7.798010
G1  X11.039300  Y8.215560
G1  X10.473600  Y8.660150
G1  X9.930280  Y9.130860
G1  X9.410210  Y9.626740
G1  X8.914330  Y10.146800
G1  X8.443680  Y10.690200
G1  X7.999140  Y11.256000
G1  X7.581650  Y11.843200
G1  X7.192110  Y12.450800
G1  X6.831540  Y13.078000
G1  X6.500870  Y13.723800
G1  X6.201010  Y14.387200
G1  X5.932890  Y15.067400
G1  X5.697430  Y15.763300
G1  X5.495670  Y16.474000
G1  X5.328440  Y17.198600
G1  X5.196780  Y17.936300
G1  X5.101510  Y18.685800
G1  X5.043720  Y19.446500
G1  X5.024250  Y20.024700
G1  X5.024250  Y20.410000
G1  X5.043720  Y20.988100
G1  X5.101510  Y21.748500
G1  X5.196780  Y22.498100
G1  X5.328440  Y23.235400
G1  X5.495670  Y23.960000
G1  X5.697430  Y24.670700
G1  X5.932890  Y25.366400
G1  X6.201010  Y26.046500
G1  X6.500870  Y26.709900
G1  X6.831540  Y27.355600
G1  X7.192110  Y27.982600
G1  X7.581650  Y28.590300
G1  X7.999140  Y29.177400
G1  X8.443680  Y29.743100
G1  X8.914330  Y30.286400
G1  X9.410210  Y30.806500
G1  X9.930280  Y31.302400
G1  X10.473600  Y31.772900
G1  X11.039300  Y32.217500
G1  X11.626500  Y32.635000
G1  X12.234100  Y33.024600
G1  X12.861100  Y33.385100
G1  X13.506800  Y33.715800
G1  X14.170100  Y34.015700
G1  X14.850100  Y34.283700
G1  X15.546100  Y34.519200
G1  X16.256700  Y34.721000
G1  X16.981300  Y34.888200
G1  X17.718800  Y35.019900
G1  X18.468200  Y35.115100
G1  X19.228600  Y35.172900
G1  X19.806700  Y35.192400
G1  X20.191900  Y35.192400
G1  X20.770100  Y35.172900
G1  X21.530800  Y35.115100
G1  X22.280400  Y35.019900
G1  X23.018100  Y34.888200
G1  X23.742600  Y34.721000
G1  X24.453300  Y34.519200
G1  X25.149300  Y34.283700
G1  X25.829400  Y34.015700
G1  X26.492900  Y33.715800
G1  X27.138600  Y33.385100
G1  X27.765800  Y33.024600
G1  X28.373500  Y32.635000
G1  X28.960700  Y32.217500
G1  X29.526400  Y31.772900
G1  X30.069900  Y31.302400
G1  X30.590000  Y30.806500
G1  X31.085800  Y30.286400
G1  X31.556500  Y29.743100
G1  X32.001100  Y29.177400
G1  X32.418600  Y28.590300
G1  X32.808200  Y27.982600
G1  X33.168700  Y27.355600
G1  X33.499400  Y26.709900
G1  X33.799300  Y26.046500
G1  X34.067500  Y25.366400
G1  X34.302900  Y24.670700
G1  X34.504700  Y23.960000
G1  X34.671900  Y23.235400
G1  X34.803600  Y22.498100
G1  X34.898700  Y21.748500
G1  X34.956700  Y20.988100
G1  X34.976100  Y20.410000
G1  X34.976100  Y20.217400

M300 S50 (pen up)
G4 P50 (wait 50ms)


(Footer begin)
(end of print job)
M300 S50.00 (pen up)
G4 P50 (wait 50ms)
M300 S255 (turn off servo)
G1 X0 Y0 F3000.00
G1 Z0.00 F150.00 (go up to finished level)
G1 X0.00 Y0.00 F3000.00 (go home)
M18 (drives off)
