G21 (metric ftw)
G90 (absolute mode)
G92 X0.00 Y0.00 Z0.00 (you are here)

M300 S30 (pen down)
G4 P50 (wait 50ms)
M300 S50 (pen up)
G4 P50 (wait 50ms)
M18 (disengage drives)
M01 (Was registration test successful?)
M17 (engage drives if YES, and continue)

(Header end)












G1  X36.339020  Y16.091680

M300 S30 (pen down)
G4 P50 (wait 50ms)

G1  X36.339020  Y15.748280
G1  X33.115620  Y15.748280
G1  X33.120920  Y15.662880
G1  X33.159820  Y15.407880
G1  X33.246920  Y15.109980
G1  X33.376920  Y14.854980
G1  X33.501220  Y14.690580
G1  X33.549820  Y14.643080
G1  X33.598420  Y14.596380
G1  X33.765120  Y14.477780
G1  X34.018320  Y14.359680
G1  X34.309720  Y14.289180
G1  X34.557020  Y14.265480
G1  X34.738720  Y14.265480
G1  X35.036320  Y14.290280
G1  X35.356920  Y14.348180
G1  X35.419520  Y14.364680
G1  X35.483320  Y14.381180
G1  X35.799220  Y14.488680
G1  X36.112620  Y14.629380
G1  X36.174920  Y14.662480
G1  X36.174920  Y13.999580
G1  X36.111720  Y13.972780
G1  X35.792420  Y13.857980
G1  X35.467720  Y13.769380
G1  X35.401920  Y13.755480
G1  X35.335820  Y13.741380
G1  X35.002020  Y13.692380
G1  X34.698120  Y13.671480
G1  X34.534720  Y13.671480
G1  X34.348320  Y13.680780
G1  X34.112720  Y13.708680
G1  X33.890520  Y13.755280
G1  X33.681520  Y13.820280
G1  X33.485620  Y13.903880
G1  X33.303120  Y14.005980
G1  X33.133820  Y14.126480
G1  X33.014920  Y14.228880
G1  X32.978020  Y14.265480
G1  X32.941220  Y14.302480
G1  X32.838820  Y14.420980
G1  X32.718120  Y14.589380
G1  X32.616020  Y14.770780
G1  X32.532620  Y14.965280
G1  X32.467420  Y15.172780
G1  X32.421020  Y15.393280
G1  X32.393320  Y15.626880
G1  X32.384020  Y15.811880
G1  X32.384020  Y15.937380
G1  X32.392720  Y16.128880
G1  X32.419120  Y16.370580
G1  X32.463020  Y16.598580
G1  X32.524720  Y16.813080
G1  X32.603820  Y17.013680
G1  X32.700820  Y17.200780
G1  X32.815320  Y17.374380
G1  X32.912620  Y17.496080
G1  X32.947720  Y17.534180
G1  X32.982720  Y17.572180
G1  X33.095820  Y17.678880
G1  X33.256020  Y17.804380
G1  X33.428720  Y17.910580
G1  X33.613520  Y17.997380
G1  X33.810520  Y18.064880
G1  X34.019920  Y18.112880
G1  X34.241720  Y18.141780
G1  X34.417320  Y18.151380
G1  X34.528120  Y18.151380
G1  X34.685220  Y18.142780
G1  X34.883420  Y18.116780
G1  X35.070220  Y18.073580
G1  X35.245820  Y18.012880
G1  X35.410220  Y17.934880
G1  X35.563320  Y17.839380
G1  X35.705220  Y17.726480
G1  X35.805120  Y17.630480
G1  X35.835920  Y17.596180
G1  X35.867220  Y17.561780
G1  X35.953520  Y17.451480
G1  X36.055820  Y17.294380
G1  X36.142220  Y17.124880
G1  X36.213020  Y16.942980
G1  X36.268020  Y16.748680
G1  X36.307420  Y16.542080
G1  X36.331020  Y16.322980
G1  X36.339020  Y16.149380
G1  X36.339020  Y16.091680
M300 S50 (pen up)
G4 P50 (wait 50ms)
G1  X30.322320  Y19.260980

M300 S30 (pen down)
G4 P50 (wait 50ms)

G1  X30.322320  Y18.049380
G1  X31.766620  Y18.049380
G1  X31.766620  Y17.503680
G1  X30.322320  Y17.503680
G1  X30.322320  Y15.128180
G1  X30.331020  Y14.950280
G1  X30.357420  Y14.759680
G1  X30.401520  Y14.615580
G1  X30.443520  Y14.538480
G1  X30.463020  Y14.517880
G1  X30.482220  Y14.498180
G1  X30.553720  Y14.452580
G1  X30.680920  Y14.406080
G1  X30.845120  Y14.378280
G1  X30.995620  Y14.368980
G1  X31.766620  Y14.368980
G1  X31.766620  Y13.781880
G1  X30.952320  Y13.781880
G1  X30.672020  Y13.800780
G1  X30.360620  Y13.857180
G1  X30.111720  Y13.950980
G1  X29.965920  Y14.043080
G1  X29.925520  Y14.082180
G1  X29.885520  Y14.121780
G1  X29.790820  Y14.265980
G1  X29.694820  Y14.511180
G1  X29.637320  Y14.818480
G1  X29.618120  Y15.095080
G1  X29.618120  Y17.503680
G1  X29.102720  Y17.503680
G1  X29.102720  Y18.049380
G1  X29.618120  Y18.049380
G1  X29.618120  Y19.260980
G1  X30.322320  Y19.260980
M300 S50 (pen up)
G4 P50 (wait 50ms)
G1  X28.230620  Y16.357180

M300 S30 (pen down)
G4 P50 (wait 50ms)

G1  X28.230620  Y13.781880
G1  X27.529020  Y13.781880
G1  X27.529020  Y16.406380
G1  X27.514220  Y16.618980
G1  X27.470220  Y16.864680
G1  X27.396520  Y17.072380
G1  X27.323720  Y17.203180
G1  X27.293320  Y17.241880
G1  X27.264820  Y17.278480
G1  X27.160620  Y17.373280
G1  X26.998120  Y17.467380
G1  X26.806220  Y17.523680
G1  X26.640220  Y17.542480
G1  X26.517620  Y17.542480
G1  X26.315820  Y17.519880
G1  X26.076720  Y17.451780
G1  X25.867920  Y17.338480
G1  X25.729120  Y17.223980
G1  X25.689220  Y17.179980
G1  X25.648420  Y17.134980
G1  X25.545620  Y16.982580
G1  X25.443320  Y16.752380
G1  X25.381920  Y16.489280
G1  X25.361520  Y16.267480
G1  X25.361520  Y13.781880
G1  X24.657420  Y13.781880
G1  X24.657420  Y18.049380
G1  X25.361520  Y18.049380
G1  X25.361520  Y17.386680
G1  X25.392020  Y17.433180
G1  X25.493020  Y17.566780
G1  X25.635420  Y17.722580
G1  X25.788520  Y17.854180
G1  X25.910120  Y17.937480
G1  X25.952820  Y17.961380
G1  X25.995520  Y17.985080
G1  X26.130520  Y18.044580
G1  X26.320920  Y18.103980
G1  X26.524220  Y18.139580
G1  X26.686620  Y18.151380
G1  X26.827220  Y18.151380
G1  X27.086220  Y18.122980
G1  X27.386720  Y18.037780
G1  X27.642320  Y17.895280
G1  X27.807020  Y17.750980
G1  X27.852820  Y17.695280
G1  X27.900920  Y17.637480
G1  X28.018320  Y17.441380
G1  X28.136320  Y17.133880
G1  X28.207020  Y16.772480
G1  X28.230620  Y16.461080
G1  X28.230620  Y16.357180
M300 S50 (pen up)
G4 P50 (wait 50ms)
G1  X23.532720  Y16.091680

M300 S30 (pen down)
G4 P50 (wait 50ms)

G1  X23.532720  Y15.748280
G1  X20.309420  Y15.748280
G1  X20.314820  Y15.662880
G1  X20.353520  Y15.407880
G1  X20.440820  Y15.109980
G1  X20.570920  Y14.854980
G1  X20.695120  Y14.690680
G1  X20.743720  Y14.643080
G1  X20.792320  Y14.596380
G1  X20.959120  Y14.477780
G1  X21.212620  Y14.359680
G1  X21.504220  Y14.289180
G1  X21.751320  Y14.265480
G1  X21.933020  Y14.265480
G1  X22.230520  Y14.290280
G1  X22.552020  Y14.348180
G1  X22.615220  Y14.364680
G1  X22.678420  Y14.381180
G1  X22.994020  Y14.488680
G1  X23.306720  Y14.629380
G1  X23.368720  Y14.662480
G1  X23.368720  Y13.999580
G1  X23.305920  Y13.972780
G1  X22.987320  Y13.857980
G1  X22.661920  Y13.769380
G1  X22.595820  Y13.755480
G1  X22.529520  Y13.741380
G1  X22.196620  Y13.692380
G1  X21.893520  Y13.671480
G1  X21.730220  Y13.671480
G1  X21.543720  Y13.680780
G1  X21.308120  Y13.708680
G1  X21.085920  Y13.755280
G1  X20.876920  Y13.820280
G1  X20.681020  Y13.903880
G1  X20.498420  Y14.005980
G1  X20.329220  Y14.126480
G1  X20.210220  Y14.228880
G1  X20.173320  Y14.265480
G1  X20.136320  Y14.302480
G1  X20.033720  Y14.420980
G1  X19.912720  Y14.589380
G1  X19.810420  Y14.770780
G1  X19.726620  Y14.965280
G1  X19.661520  Y15.172780
G1  X19.614920  Y15.393280
G1  X19.587020  Y15.626880
G1  X19.577720  Y15.811880
G1  X19.577720  Y15.937380
G1  X19.586520  Y16.128880
G1  X19.613020  Y16.370580
G1  X19.657220  Y16.598580
G1  X19.719020  Y16.813080
G1  X19.798320  Y17.013680
G1  X19.895220  Y17.200780
G1  X20.009520  Y17.374380
G1  X20.106520  Y17.496080
G1  X20.141520  Y17.534180
G1  X20.176520  Y17.572180
G1  X20.289720  Y17.678880
G1  X20.450120  Y17.804380
G1  X20.622920  Y17.910580
G1  X20.807820  Y17.997380
G1  X21.004920  Y18.064880
G1  X21.214420  Y18.112880
G1  X21.435920  Y18.141780
G1  X21.611220  Y18.151380
G1  X21.722220  Y18.151380
G1  X21.879520  Y18.142780
G1  X22.078020  Y18.116780
G1  X22.265120  Y18.073580
G1  X22.440620  Y18.012880
G1  X22.604920  Y17.934880
G1  X22.757820  Y17.839380
G1  X22.899520  Y17.726480
G1  X22.999020  Y17.630480
G1  X23.029720  Y17.596180
G1  X23.060920  Y17.561780
G1  X23.147420  Y17.451480
G1  X23.249720  Y17.294380
G1  X23.336020  Y17.124880
G1  X23.406920  Y16.942980
G1  X23.461920  Y16.748680
G1  X23.501220  Y16.542080
G1  X23.524820  Y16.322980
G1  X23.532720  Y16.149380
G1  X23.532720  Y16.091680
M300 S50 (pen up)
G4 P50 (wait 50ms)
G1  X26.173020  Y26.111180

M300 S30 (pen down)
G4 P50 (wait 50ms)

G1  X26.173020  Y23.535480
G1  X25.471620  Y23.535480
G1  X25.471620  Y26.158680
G1  X25.456920  Y26.372180
G1  X25.412720  Y26.618080
G1  X25.339120  Y26.825580
G1  X25.266320  Y26.955980
G1  X25.235920  Y26.994580
G1  X25.207320  Y27.031080
G1  X25.103320  Y27.126480
G1  X24.940820  Y27.220780
G1  X24.748720  Y27.277380
G1  X24.582920  Y27.296180
G1  X24.460220  Y27.296180
G1  X24.258420  Y27.273480
G1  X24.019420  Y27.205380
G1  X23.810520  Y27.092080
G1  X23.671620  Y26.977880
G1  X23.631920  Y26.933880
G1  X23.591020  Y26.888980
G1  X23.488320  Y26.736480
G1  X23.385820  Y26.506080
G1  X23.324520  Y26.243080
G1  X23.304120  Y26.021080
G1  X23.304120  Y23.535480
G1  X22.599920  Y23.535480
G1  X22.599920  Y27.803480
G1  X23.304120  Y27.803480
G1  X23.304120  Y27.140480
G1  X23.334720  Y27.187080
G1  X23.435520  Y27.320480
G1  X23.577920  Y27.476380
G1  X23.731020  Y27.607880
G1  X23.852420  Y27.691380
G1  X23.895120  Y27.715280
G1  X23.937920  Y27.738980
G1  X24.073020  Y27.798480
G1  X24.263420  Y27.857880
G1  X24.466920  Y27.893480
G1  X24.629220  Y27.905380
G1  X24.769820  Y27.905380
G1  X25.028820  Y27.876880
G1  X25.329220  Y27.791380
G1  X25.584820  Y27.648480
G1  X25.749720  Y27.503680
G1  X25.795520  Y27.447880
G1  X25.843520  Y27.390280
G1  X25.960820  Y27.194580
G1  X26.078820  Y26.887480
G1  X26.149420  Y26.526380
G1  X26.173020  Y26.214980
G1  X26.173020  Y26.111180
M300 S50 (pen up)
G4 P50 (wait 50ms)
G1  X21.181920  Y25.970380

M300 S30 (pen down)
G4 P50 (wait 50ms)

G1  X21.181920  Y23.535480
G1  X20.480520  Y23.535480
G1  X20.480520  Y24.183180
G1  X20.451520  Y24.136180
G1  X20.353320  Y24.001680
G1  X20.211320  Y23.845380
G1  X20.054420  Y23.714380
G1  X19.926920  Y23.631780
G1  X19.882220  Y23.608580
G1  X19.836720  Y23.585080
G1  X19.693420  Y23.528180
G1  X19.484520  Y23.470980
G1  X19.255420  Y23.436880
G1  X19.068320  Y23.425380
G1  X18.928120  Y23.425380
G1  X18.695120  Y23.448180
G1  X18.417620  Y23.516480
G1  X18.173520  Y23.630480
G1  X18.010620  Y23.745580
G1  X17.962720  Y23.790580
G1  X17.915820  Y23.835680
G1  X17.794420  Y23.991080
G1  X17.674220  Y24.222480
G1  X17.602220  Y24.484580
G1  X17.578320  Y24.704180
G1  X17.578320  Y24.861880
G1  X17.608120  Y25.115480
G1  X17.698120  Y25.408980
G1  X17.848020  Y25.658180
G1  X18.000120  Y25.818980
G1  X18.058020  Y25.863180
G1  X18.120520  Y25.910380
G1  X18.329520  Y26.023280
G1  X18.660120  Y26.137880
G1  X19.049720  Y26.206780
G1  X19.385920  Y26.229680
G1  X20.480520  Y26.229680
G1  X20.480520  Y26.355480
G1  X20.460520  Y26.526380
G1  X20.400820  Y26.726480
G1  X20.300920  Y26.898980
G1  X20.199520  Y27.012180
G1  X20.160920  Y27.043880
G1  X20.121020  Y27.077480
G1  X19.986620  Y27.160780
G1  X19.780120  Y27.244280
G1  X19.540920  Y27.294580
G1  X19.337020  Y27.311380
G1  X19.178820  Y27.311380
G1  X18.908320  Y27.289380
G1  X18.614720  Y27.237880
G1  X18.556720  Y27.223180
G1  X18.499120  Y27.208680
G1  X18.217020  Y27.113980
G1  X17.943120  Y26.990380
G1  X17.889720  Y26.961380
G1  X17.889720  Y27.608980
G1  X17.954020  Y27.633880
G1  X18.269220  Y27.738280
G1  X18.576320  Y27.817480
G1  X18.636620  Y27.829580
G1  X18.696920  Y27.842380
G1  X18.994020  Y27.886480
G1  X19.255120  Y27.905380
G1  X19.398120  Y27.905380
G1  X19.566220  Y27.897880
G1  X19.775620  Y27.875380
G1  X19.970420  Y27.837980
G1  X20.150520  Y27.785480
G1  X20.315920  Y27.718080
G1  X20.466620  Y27.635580
G1  X20.602720  Y27.538180
G1  X20.695820  Y27.455480
G1  X20.724220  Y27.425680
G1  X20.753020  Y27.395580
G1  X20.831720  Y27.298080
G1  X20.924820  Y27.154880
G1  X21.003420  Y26.996180
G1  X21.067720  Y26.822180
G1  X21.117720  Y26.632480
G1  X21.153420  Y26.427380
G1  X21.174720  Y26.206680
G1  X21.181920  Y26.029580
G1  X21.181920  Y25.970380
M300 S50 (pen up)
G4 P50 (wait 50ms)
G1  X16.446920  Y26.111180

M300 S30 (pen down)
G4 P50 (wait 50ms)

G1  X16.446920  Y23.535480
G1  X15.745520  Y23.535480
G1  X15.745520  Y26.158680
G1  X15.730820  Y26.372180
G1  X15.686520  Y26.618080
G1  X15.612320  Y26.825580
G1  X15.539020  Y26.955980
G1  X15.508420  Y26.994580
G1  X15.479820  Y27.031080
G1  X15.375920  Y27.126480
G1  X15.213720  Y27.220780
G1  X15.021920  Y27.277380
G1  X14.855520  Y27.296180
G1  X14.732920  Y27.296180
G1  X14.531020  Y27.273480
G1  X14.292320  Y27.205380
G1  X14.083520  Y27.092080
G1  X13.944420  Y26.977780
G1  X13.904420  Y26.933880
G1  X13.863820  Y26.888880
G1  X13.761520  Y26.736480
G1  X13.659420  Y26.506080
G1  X13.598120  Y26.243080
G1  X13.577720  Y26.021080
G1  X13.577720  Y23.535480
G1  X12.872220  Y23.535480
G1  X12.872220  Y27.803480
G1  X13.577720  Y27.803480
G1  X13.577720  Y27.140480
G1  X13.608020  Y27.187080
G1  X13.708520  Y27.320480
G1  X13.850520  Y27.476380
G1  X14.003520  Y27.607880
G1  X14.124920  Y27.691380
G1  X14.167620  Y27.715280
G1  X14.210420  Y27.738980
G1  X14.345620  Y27.798480
G1  X14.536520  Y27.857880
G1  X14.739920  Y27.893480
G1  X14.901920  Y27.905380
G1  X15.042320  Y27.905380
G1  X15.301320  Y27.876880
G1  X15.602020  Y27.791380
G1  X15.858020  Y27.648480
G1  X16.023420  Y27.503580
G1  X16.069420  Y27.447880
G1  X16.117320  Y27.390280
G1  X16.234120  Y27.194580
G1  X16.352220  Y26.887480
G1  X16.423120  Y26.526380
G1  X16.446920  Y26.214980
G1  X16.446920  Y26.111180
M300 S50 (pen up)
G4 P50 (wait 50ms)
G1  X11.749220  Y25.843680

M300 S30 (pen down)
G4 P50 (wait 50ms)

G1  X11.749220  Y25.501880
G1  X8.524520  Y25.501880
G1  X8.530120  Y25.416180
G1  X8.569520  Y25.160780
G1  X8.657020  Y24.862980
G1  X8.787120  Y24.608480
G1  X8.911620  Y24.444180
G1  X8.960220  Y24.396680
G1  X9.008720  Y24.349980
G1  X9.175320  Y24.231480
G1  X9.428420  Y24.113480
G1  X9.719420  Y24.042780
G1  X9.966220  Y24.019180
G1  X10.147920  Y24.019180
G1  X10.446420  Y24.043980
G1  X10.767220  Y24.101780
G1  X10.829920  Y24.118280
G1  X10.893720  Y24.134980
G1  X11.209720  Y24.242480
G1  X11.522920  Y24.382980
G1  X11.585220  Y24.416080
G1  X11.585220  Y23.753180
G1  X11.522220  Y23.726380
G1  X11.202720  Y23.611780
G1  X10.877020  Y23.523180
G1  X10.810920  Y23.509380
G1  X10.745120  Y23.495380
G1  X10.412220  Y23.446180
G1  X10.108520  Y23.425380
G1  X9.945120  Y23.425380
G1  X9.758620  Y23.434880
G1  X9.523120  Y23.462580
G1  X9.300820  Y23.508980
G1  X9.091720  Y23.573980
G1  X8.895920  Y23.657580
G1  X8.713320  Y23.759580
G1  X8.544020  Y23.880280
G1  X8.425020  Y23.982480
G1  X8.388020  Y24.019180
G1  X8.351120  Y24.056080
G1  X8.248520  Y24.174580
G1  X8.127820  Y24.343080
G1  X8.025720  Y24.524380
G1  X7.942320  Y24.718980
G1  X7.877420  Y24.926680
G1  X7.831220  Y25.147180
G1  X7.803520  Y25.380780
G1  X7.794320  Y25.565780
G1  X7.794320  Y25.691380
G1  X7.803020  Y25.882780
G1  X7.829320  Y26.124280
G1  X7.873420  Y26.352380
G1  X7.934920  Y26.566780
G1  X8.014120  Y26.767580
G1  X8.110920  Y26.954680
G1  X8.225420  Y27.128280
G1  X8.322520  Y27.249980
G1  X8.357620  Y27.288080
G1  X8.392520  Y27.326080
G1  X8.505520  Y27.432880
G1  X8.665720  Y27.558480
G1  X8.838320  Y27.664580
G1  X9.023220  Y27.751180
G1  X9.220520  Y27.818680
G1  X9.430020  Y27.866880
G1  X9.651920  Y27.895780
G1  X9.827620  Y27.905380
G1  X9.938520  Y27.905380
G1  X10.095520  Y27.896780
G1  X10.293720  Y27.870680
G1  X10.480520  Y27.827380
G1  X10.656220  Y27.766680
G1  X10.820520  Y27.688580
G1  X10.973720  Y27.593180
G1  X11.115520  Y27.480380
G1  X11.215420  Y27.384280
G1  X11.246220  Y27.350080
G1  X11.277420  Y27.315680
G1  X11.364020  Y27.205380
G1  X11.466020  Y27.048280
G1  X11.552420  Y26.878880
G1  X11.623320  Y26.696880
G1  X11.678320  Y26.502580
G1  X11.717720  Y26.295780
G1  X11.741320  Y26.076780
G1  X11.749220  Y25.903080
G1  X11.749220  Y25.843680
M300 S50 (pen up)
G4 P50 (wait 50ms)
G1  X5.754880  Y26.202180

M300 S30 (pen down)
G4 P50 (wait 50ms)

G1  X5.796120  Y26.188280
G1  X5.998700  Y26.071080
G1  X6.196680  Y25.889680
G1  X6.235680  Y25.843680
G1  X6.274900  Y25.798280
G1  X6.471520  Y25.518580
G1  X6.668840  Y25.169980
G1  X6.708420  Y25.089880
G1  X7.488420  Y23.535480
G1  X6.661510  Y23.535480
G1  X5.933700  Y24.994980
G1  X5.901000  Y25.061380
G1  X5.793990  Y25.256380
G1  X5.656040  Y25.470080
G1  X5.519800  Y25.635680
G1  X5.421830  Y25.727480
G1  X5.385520  Y25.752780
G1  X5.352000  Y25.776480
G1  X5.242080  Y25.834380
G1  X5.074380  Y25.892980
G1  X4.882380  Y25.928280
G1  X4.720220  Y25.940080
G1  X3.826940  Y25.940080
G1  X3.826940  Y23.535480
G1  X3.057880  Y23.535480
G1  X3.057880  Y29.223980
G1  X4.854720  Y29.223980
G1  X5.031840  Y29.217780
G1  X5.252500  Y29.198580
G1  X5.457690  Y29.166680
G1  X5.647360  Y29.121880
G1  X5.821450  Y29.064580
G1  X5.980090  Y28.994380
G1  X6.123220  Y28.911680
G1  X6.220540  Y28.842080
G1  X6.250870  Y28.816180
G1  X6.280550  Y28.791080
G1  X6.363230  Y28.707880
G1  X6.460620  Y28.586480
G1  X6.542970  Y28.452180
G1  X6.610410  Y28.304880
G1  X6.662870  Y28.144380
G1  X6.700320  Y27.971080
G1  X6.722820  Y27.784980
G1  X6.730320  Y27.635580
G1  X6.730320  Y27.521480
G1  X6.714620  Y27.328480
G1  X6.667430  Y27.093880
G1  X6.589040  Y26.882380
G1  X6.510800  Y26.738280
G1  X6.479500  Y26.693980
G1  X6.448900  Y26.650380
G1  X6.341310  Y26.530680
G1  X6.174540  Y26.394280
G1  X5.979120  Y26.284880
G1  X5.812120  Y26.218880
G1  X5.754880  Y26.202180
M300 S50 (pen up)
G4 P50 (wait 50ms)
G1  X3.705560  Y14.422580

M300 S30 (pen down)
G4 P50 (wait 50ms)

G1  X3.705560  Y12.158480
G1  X3.000000  Y12.158480
G1  X3.000000  Y18.049380
G1  X3.705560  Y18.049380
G1  X3.705560  Y17.401780
G1  X3.732260  Y17.447780
G1  X3.823130  Y17.579680
G1  X3.954910  Y17.732780
G1  X4.101190  Y17.861380
G1  X4.220270  Y17.942580
G1  X4.262260  Y17.965480
G1  X4.304910  Y17.988980
G1  X4.439790  Y18.046880
G1  X4.633470  Y18.104980
G1  X4.843370  Y18.139880
G1  X5.013130  Y18.151380
G1  X5.117190  Y18.151380
G1  X5.259490  Y18.141780
G1  X5.440050  Y18.112880
G1  X5.611380  Y18.064880
G1  X5.773610  Y17.997380
G1  X5.926590  Y17.910580
G1  X6.070430  Y17.804380
G1  X6.205080  Y17.678880
G1  X6.301110  Y17.571780
G1  X6.330620  Y17.534180
G1  X6.391610  Y17.457080
G1  X6.544050  Y17.201680
G1  X6.696520  Y16.820280
G1  X6.788020  Y16.390480
G1  X6.818420  Y16.031880
G1  X6.818420  Y15.792580
G1  X6.788020  Y15.433280
G1  X6.696520  Y15.002880
G1  X6.544050  Y14.621380
G1  X6.391610  Y14.365980
G1  X6.330620  Y14.288880
G1  X6.301110  Y14.251180
G1  X6.205080  Y14.144180
G1  X6.070430  Y14.018580
G1  X5.926590  Y13.912480
G1  X5.773610  Y13.825680
G1  X5.611380  Y13.758280
G1  X5.440050  Y13.710080
G1  X5.259490  Y13.681180
G1  X5.117190  Y13.671480
G1  X5.013130  Y13.671480
G1  X4.843370  Y13.682880
G1  X4.633470  Y13.717180
G1  X4.439790  Y13.774580
G1  X4.304950  Y13.831780
G1  X4.262260  Y13.854980
G1  X4.220270  Y13.878180
G1  X4.101190  Y13.960080
G1  X3.954910  Y14.089580
G1  X3.823130  Y14.243680
G1  X3.732260  Y14.376380
G1  X3.705560  Y14.422580
M300 S50 (pen up)
G4 P50 (wait 50ms)
G1  X3.206760  Y8.063080

M300 S30 (pen down)
G4 P50 (wait 50ms)

G1  X4.010040  Y8.063080
G1  X4.010040  Y7.095780
G1  X3.206760  Y7.095780
G1  X3.206760  Y8.063080
M300 S50 (pen up)
G4 P50 (wait 50ms)
G1  X3.206760  Y4.995280

M300 S30 (pen down)
G4 P50 (wait 50ms)

G1  X4.010040  Y4.995280
G1  X4.010040  Y4.028000
G1  X3.206760  Y4.028000
G1  X3.206760  Y4.995280
M300 S50 (pen up)
G4 P50 (wait 50ms)
G1  X5.545300  Y9.949380

M300 S30 (pen down)
G4 P50 (wait 50ms)

G1  X6.155610  Y9.949380
G1  X6.225310  Y9.839380
G1  X6.422970  Y9.502180
G1  X6.654470  Y9.059580
G1  X6.849820  Y8.621680
G1  X6.972920  Y8.297980
G1  X7.008620  Y8.188280
G1  X7.043820  Y8.082280
G1  X7.133420  Y7.758980
G1  X7.222620  Y7.330780
G1  X7.276120  Y6.903780
G1  X7.294020  Y6.584780
G1  X7.294020  Y6.371480
G1  X7.276120  Y6.050680
G1  X7.222620  Y5.621480
G1  X7.133420  Y5.191180
G1  X7.043820  Y4.866270
G1  X7.008620  Y4.759650
G1  X6.972920  Y4.649910
G1  X6.849820  Y4.325790
G1  X6.654470  Y3.887810
G1  X6.422970  Y3.445810
G1  X6.225370  Y3.109600
G1  X6.155610  Y3.000000
G1  X5.545300  Y3.000000
G1  X5.607690  Y3.107160
G1  X5.783040  Y3.435500
G1  X5.987950  Y3.869420
G1  X6.160270  Y4.302090
G1  X6.268940  Y4.624680
G1  X6.300240  Y4.733560
G1  X6.331270  Y4.840770
G1  X6.409830  Y5.166680
G1  X6.488230  Y5.601680
G1  X6.535370  Y6.038980
G1  X6.551110  Y6.368580
G1  X6.551110  Y6.588080
G1  X6.535370  Y6.917080
G1  X6.488230  Y7.352780
G1  X6.409830  Y7.785680
G1  X6.331270  Y8.109380
G1  X6.300240  Y8.215780
G1  X6.268880  Y8.324180
G1  X6.160270  Y8.645180
G1  X5.987950  Y9.077480
G1  X5.783040  Y9.512380
G1  X5.607690  Y9.841880
G1  X5.545300  Y9.949380
M300 S50 (pen up)
G4 P50 (wait 50ms)
G1  X10.452520  Y17.393680

M300 S30 (pen down)
G4 P50 (wait 50ms)

G1  X10.432820  Y17.405080
G1  X10.329020  Y17.452580
G1  X10.217220  Y17.487780
G1  X10.193520  Y17.492780
G1  X10.170720  Y17.498680
G1  X10.048920  Y17.518980
G1  X9.928820  Y17.527380
G1  X9.818820  Y17.527380
G1  X9.609120  Y17.503180
G1  X9.363720  Y17.430280
G1  X9.152320  Y17.308680
G1  X9.013820  Y17.185680
G1  X8.975020  Y17.138580
G1  X8.934920  Y17.089880
G1  X8.836620  Y16.925280
G1  X8.737620  Y16.669380
G1  X8.678020  Y16.370780
G1  X8.658220  Y16.114880
G1  X8.658220  Y13.781880
G1  X7.954120  Y13.781880
G1  X7.954120  Y18.049380
G1  X8.658220  Y18.049380
G1  X8.658220  Y17.386680
G1  X8.684920  Y17.433680
G1  X8.777120  Y17.568480
G1  X8.912620  Y17.724880
G1  X9.065020  Y17.855780
G1  X9.190220  Y17.938280
G1  X9.234320  Y17.961380
G1  X9.279120  Y17.985580
G1  X9.420620  Y18.044580
G1  X9.626120  Y18.103980
G1  X9.850920  Y18.139580
G1  X10.034320  Y18.151380
G1  X10.114420  Y18.151380
G1  X10.171220  Y18.149180
G1  X10.240420  Y18.142580
G1  X10.255220  Y18.140480
G1  X10.269720  Y18.139180
G1  X10.347320  Y18.129980
G1  X10.431720  Y18.117480
G1  X10.449620  Y18.114380
G1  X10.452520  Y17.393680
M300 S50 (pen up)
G4 P50 (wait 50ms)
G1  X14.666320  Y16.091680

M300 S30 (pen down)
G4 P50 (wait 50ms)

G1  X14.666320  Y15.748280
G1  X11.443420  Y15.748280
G1  X11.448820  Y15.662880
G1  X11.487720  Y15.407880
G1  X11.575320  Y15.109980
G1  X11.705820  Y14.854980
G1  X11.830220  Y14.690680
G1  X11.878720  Y14.643080
G1  X11.927020  Y14.596180
G1  X12.093320  Y14.477780
G1  X12.346520  Y14.359680
G1  X12.637820  Y14.289180
G1  X12.884920  Y14.265480
G1  X13.066920  Y14.265480
G1  X13.365320  Y14.290280
G1  X13.686020  Y14.348180
G1  X13.748820  Y14.364680
G1  X13.812220  Y14.381180
G1  X14.127620  Y14.488680
G1  X14.440320  Y14.629380
G1  X14.502320  Y14.662480
G1  X14.502320  Y13.999580
G1  X14.439720  Y13.972780
G1  X14.121220  Y13.857980
G1  X13.795520  Y13.769380
G1  X13.729420  Y13.755480
G1  X13.663520  Y13.741380
G1  X13.330820  Y13.692380
G1  X13.027220  Y13.671480
G1  X12.863820  Y13.671480
G1  X12.677320  Y13.680780
G1  X12.441920  Y13.708680
G1  X12.219520  Y13.755280
G1  X12.010520  Y13.820280
G1  X11.814720  Y13.903880
G1  X11.632220  Y14.005980
G1  X11.462820  Y14.126480
G1  X11.343820  Y14.228880
G1  X11.306920  Y14.265480
G1  X11.269920  Y14.302480
G1  X11.167320  Y14.420980
G1  X11.046320  Y14.589380
G1  X10.944020  Y14.770780
G1  X10.860220  Y14.965280
G1  X10.795120  Y15.172780
G1  X10.748520  Y15.393280
G1  X10.720620  Y15.626880
G1  X10.711320  Y15.811880
G1  X10.711320  Y15.937380
G1  X10.720220  Y16.128880
G1  X10.746720  Y16.370580
G1  X10.791020  Y16.598580
G1  X10.852920  Y16.813080
G1  X10.932420  Y17.013680
G1  X11.029520  Y17.200780
G1  X11.144220  Y17.374380
G1  X11.241520  Y17.496080
G1  X11.276520  Y17.534180
G1  X11.311520  Y17.572180
G1  X11.424220  Y17.678880
G1  X11.584420  Y17.804380
G1  X11.756920  Y17.910580
G1  X11.941720  Y17.997380
G1  X12.138820  Y18.064880
G1  X12.348120  Y18.112880
G1  X12.569720  Y18.141780
G1  X12.744920  Y18.151380
G1  X12.855820  Y18.151380
G1  X13.013120  Y18.142780
G1  X13.211620  Y18.116780
G1  X13.398720  Y18.073580
G1  X13.574420  Y18.012880
G1  X13.738720  Y17.934880
G1  X13.891720  Y17.839380
G1  X14.033420  Y17.726480
G1  X14.133020  Y17.630480
G1  X14.163720  Y17.596180
G1  X14.195120  Y17.561780
G1  X14.281720  Y17.451480
G1  X14.384120  Y17.294380
G1  X14.470520  Y17.124880
G1  X14.541020  Y16.942980
G1  X14.595920  Y16.748680
G1  X14.635120  Y16.542080
G1  X14.658520  Y16.322980
G1  X14.666320  Y16.149380
G1  X14.666320  Y16.091680
M300 S50 (pen up)
G4 P50 (wait 50ms)
G1  X18.537420  Y17.922880

M300 S30 (pen down)
G4 P50 (wait 50ms)

G1  X18.537420  Y17.259980
G1  X18.488120  Y17.285580
G1  X18.234920  Y17.393480
G1  X17.974420  Y17.475780
G1  X17.921520  Y17.488580
G1  X17.868020  Y17.501380
G1  X17.594920  Y17.546380
G1  X17.341620  Y17.565780
G1  X17.196020  Y17.565780
G1  X17.012720  Y17.555780
G1  X16.800520  Y17.525680
G1  X16.620520  Y17.475280
G1  X16.507620  Y17.425980
G1  X16.473020  Y17.404580
G1  X16.442420  Y17.385780
G1  X16.359820  Y17.314980
G1  X16.279020  Y17.205080
G1  X16.230220  Y17.075280
G1  X16.214020  Y16.962780
G1  X16.214020  Y16.896380
G1  X16.225620  Y16.809680
G1  X16.260520  Y16.707180
G1  X16.318520  Y16.617480
G1  X16.377720  Y16.557480
G1  X16.399920  Y16.540680
G1  X16.427220  Y16.520680
G1  X16.517320  Y16.472380
G1  X16.681520  Y16.405980
G1  X16.892620  Y16.341080
G1  X17.086020  Y16.292080
G1  X17.150920  Y16.277480
G1  X17.390920  Y16.223580
G1  X17.478120  Y16.204980
G1  X17.737020  Y16.135480
G1  X18.029220  Y16.030680
G1  X18.267220  Y15.908680
G1  X18.409020  Y15.809380
G1  X18.450620  Y15.770280
G1  X18.489220  Y15.734880
G1  X18.588820  Y15.611080
G1  X18.687420  Y15.422880
G1  X18.746320  Y15.205580
G1  X18.766020  Y15.020580
G1  X18.766020  Y14.888480
G1  X18.736520  Y14.677380
G1  X18.648020  Y14.426680
G1  X18.500520  Y14.207080
G1  X18.349820  Y14.059680
G1  X18.293520  Y14.018680
G1  X18.234220  Y13.974580
G1  X18.037620  Y13.866780
G1  X17.736720  Y13.758280
G1  X17.391520  Y13.693180
G1  X17.099420  Y13.671480
G1  X16.914520  Y13.671480
G1  X16.651720  Y13.688980
G1  X16.348020  Y13.728980
G1  X16.285620  Y13.740280
G1  X16.224420  Y13.751080
G1  X15.906620  Y13.822080
G1  X15.574220  Y13.915580
G1  X15.505620  Y13.937480
G1  X15.505620  Y14.662480
G1  X15.570320  Y14.628680
G1  X15.891220  Y14.484880
G1  X16.207720  Y14.374580
G1  X16.270520  Y14.357780
G1  X16.333520  Y14.341180
G1  X16.646020  Y14.283280
G1  X16.924520  Y14.258580
G1  X17.075620  Y14.258580
G1  X17.250920  Y14.268880
G1  X17.455820  Y14.300080
G1  X17.632020  Y14.352180
G1  X17.744920  Y14.403580
G1  X17.779720  Y14.425380
G1  X17.810920  Y14.445580
G1  X17.896220  Y14.519680
G1  X17.979720  Y14.631180
G1  X18.029920  Y14.759980
G1  X18.046720  Y14.869680
G1  X18.046720  Y14.939880
G1  X18.034520  Y15.040680
G1  X17.998120  Y15.158480
G1  X17.937620  Y15.259680
G1  X17.876020  Y15.325980
G1  X17.852620  Y15.344380
G1  X17.824420  Y15.366780
G1  X17.728520  Y15.419380
G1  X17.546720  Y15.493280
G1  X17.307320  Y15.566180
G1  X17.085120  Y15.621680
G1  X17.010620  Y15.637880
G1  X16.766520  Y15.694280
G1  X16.690120  Y15.710380
G1  X16.463420  Y15.771880
G1  X16.205520  Y15.867780
G1  X15.992720  Y15.981780
G1  X15.863320  Y16.076680
G1  X15.825220  Y16.113480
G1  X15.789820  Y16.148480
G1  X15.698820  Y16.269280
G1  X15.608320  Y16.451380
G1  X15.554020  Y16.659980
G1  X15.535920  Y16.836180
G1  X15.535920  Y16.965780
G1  X15.562620  Y17.178580
G1  X15.642320  Y17.428180
G1  X15.775520  Y17.643580
G1  X15.910620  Y17.785680
G1  X15.961720  Y17.825080
G1  X16.016320  Y17.866780
G1  X16.198020  Y17.968080
G1  X16.478820  Y18.069980
G1  X16.804220  Y18.131080
G1  X17.082020  Y18.151380
G1  X17.268820  Y18.151380
G1  X17.551520  Y18.137180
G1  X17.848020  Y18.104380
G1  X17.904920  Y18.094980
G1  X17.962020  Y18.085380
G1  X18.234520  Y18.023480
G1  X18.489120  Y17.942180
G1  X18.537420  Y17.922880
M300 S50 (pen up)
G4 P50 (wait 50ms)
G1  X35.637620  Y16.296880

M300 S30 (pen down)
G4 P50 (wait 50ms)

G1  X35.636620  Y16.365080
G1  X35.614220  Y16.569580
G1  X35.552420  Y16.813480
G1  X35.452320  Y17.028480
G1  X35.352820  Y17.172080
G1  X35.313720  Y17.214380
G1  X35.275920  Y17.256080
G1  X35.144820  Y17.364680
G1  X34.949820  Y17.471880
G1  X34.729120  Y17.536380
G1  X34.544220  Y17.557780
G1  X34.412920  Y17.557780
G1  X34.203820  Y17.537080
G1  X33.954120  Y17.474880
G1  X33.733420  Y17.370980
G1  X33.585120  Y17.266380
G1  X33.541320  Y17.225380
G1  X33.498020  Y17.184380
G1  X33.385120  Y17.043080
G1  X33.265620  Y16.826780
G1  X33.183120  Y16.576680
G1  X33.144120  Y16.364180
G1  X33.137820  Y16.292580
G1  X35.637620  Y16.296880
M300 S50 (pen up)
G4 P50 (wait 50ms)
G1  X22.831520  Y16.296880

M300 S30 (pen down)
G4 P50 (wait 50ms)

G1  X22.830620  Y16.365080
G1  X22.808720  Y16.569580
G1  X22.747020  Y16.813480
G1  X22.646520  Y17.028480
G1  X22.546720  Y17.172080
G1  X22.507620  Y17.214380
G1  X22.469820  Y17.256080
G1  X22.338520  Y17.364680
G1  X22.143820  Y17.471880
G1  X21.923520  Y17.536380
G1  X21.739220  Y17.557780
G1  X21.608020  Y17.557780
G1  X21.398820  Y17.537080
G1  X21.148820  Y17.474880
G1  X20.928020  Y17.370980
G1  X20.780220  Y17.266480
G1  X20.736620  Y17.225380
G1  X20.693020  Y17.184380
G1  X20.579520  Y17.043080
G1  X20.459820  Y16.826780
G1  X20.377620  Y16.576680
G1  X20.339120  Y16.364180
G1  X20.333020  Y16.292580
G1  X22.831520  Y16.296880
M300 S50 (pen up)
G4 P50 (wait 50ms)
G1  X13.966520  Y16.296880

M300 S30 (pen down)
G4 P50 (wait 50ms)

G1  X13.965520  Y16.365080
G1  X13.943120  Y16.569580
G1  X13.881520  Y16.813480
G1  X13.781520  Y17.028480
G1  X13.681720  Y17.172080
G1  X13.642620  Y17.214380
G1  X13.604520  Y17.256080
G1  X13.473020  Y17.364680
G1  X13.278320  Y17.471880
G1  X13.058020  Y17.536380
G1  X12.873420  Y17.557780
G1  X12.742020  Y17.557780
G1  X12.532720  Y17.537080
G1  X12.282720  Y17.474880
G1  X12.062020  Y17.370980
G1  X11.914120  Y17.266480
G1  X11.870620  Y17.225380
G1  X11.827020  Y17.184380
G1  X11.713520  Y17.043080
G1  X11.594120  Y16.826780
G1  X11.511920  Y16.576680
G1  X11.473120  Y16.364180
G1  X11.466720  Y16.292580
G1  X13.966520  Y16.296880
M300 S50 (pen up)
G4 P50 (wait 50ms)
G1  X6.091040  Y15.912380

M300 S30 (pen down)
G4 P50 (wait 50ms)

G1  X6.091040  Y16.003880
G1  X6.070910  Y16.277980
G1  X6.010690  Y16.601680
G1  X5.910650  Y16.883480
G1  X5.811690  Y17.067580
G1  X5.771110  Y17.123480
G1  X5.733560  Y17.175980
G1  X5.597870  Y17.317080
G1  X5.394430  Y17.455280
G1  X5.160860  Y17.538180
G1  X4.963440  Y17.565780
G1  X4.831760  Y17.565780
G1  X4.634270  Y17.538180
G1  X4.400440  Y17.455280
G1  X4.196130  Y17.317080
G1  X4.059300  Y17.175980
G1  X4.021330  Y17.123480
G1  X3.980950  Y17.067580
G1  X3.882930  Y16.883480
G1  X3.784290  Y16.601680
G1  X3.725200  Y16.277980
G1  X3.705560  Y16.003880
G1  X3.705560  Y15.820780
G1  X3.725200  Y15.545680
G1  X3.784290  Y15.220780
G1  X3.882930  Y14.937780
G1  X3.980950  Y14.752880
G1  X4.021330  Y14.696680
G1  X4.059360  Y14.644680
G1  X4.196130  Y14.504980
G1  X4.400440  Y14.367980
G1  X4.634270  Y14.285980
G1  X4.831760  Y14.258580
G1  X4.963440  Y14.258580
G1  X5.160860  Y14.285980
G1  X5.394430  Y14.367980
G1  X5.597870  Y14.504980
G1  X5.733560  Y14.644680
G1  X5.771110  Y14.696680
G1  X5.811690  Y14.752880
G1  X5.910650  Y14.937780
G1  X6.010690  Y15.220780
G1  X6.070910  Y15.545680
G1  X6.091040  Y15.820780
G1  X6.091040  Y15.912380
M300 S50 (pen up)
G4 P50 (wait 50ms)
G1  X3.826940  Y28.591480

M300 S30 (pen down)
G4 P50 (wait 50ms)

G1  X3.826940  Y26.572580
G1  X4.860900  Y26.572580
G1  X5.056650  Y26.588480
G1  X5.283370  Y26.636080
G1  X5.475690  Y26.715780
G1  X5.598040  Y26.795380
G1  X5.633520  Y26.827580
G1  X5.668560  Y26.859380
G1  X5.758250  Y26.972080
G1  X5.847330  Y27.146680
G1  X5.900720  Y27.351380
G1  X5.918560  Y27.527180
G1  X5.918560  Y27.644280
G1  X5.900720  Y27.819580
G1  X5.847330  Y28.022580
G1  X5.758250  Y28.195080
G1  X5.668560  Y28.305580
G1  X5.633520  Y28.336480
G1  X5.597980  Y28.368680
G1  X5.475690  Y28.448080
G1  X5.283370  Y28.527580
G1  X5.056650  Y28.575580
G1  X4.860900  Y28.591480
G1  X3.826940  Y28.591480
M300 S50 (pen up)
G4 P50 (wait 50ms)
G1  X11.048020  Y26.050480

M300 S30 (pen down)
G4 P50 (wait 50ms)

G1  X11.046920  Y26.118880
G1  X11.024520  Y26.323480
G1  X10.962820  Y26.567380
G1  X10.862720  Y26.782380
G1  X10.763120  Y26.925980
G1  X10.724120  Y26.968480
G1  X10.686220  Y27.009980
G1  X10.555020  Y27.118480
G1  X10.360220  Y27.225580
G1  X10.139520  Y27.289880
G1  X9.954620  Y27.311380
G1  X9.823220  Y27.311380
G1  X9.614120  Y27.290680
G1  X9.364520  Y27.228580
G1  X9.143820  Y27.124880
G1  X8.995420  Y27.020280
G1  X8.951720  Y26.979280
G1  X8.908320  Y26.938280
G1  X8.795420  Y26.796880
G1  X8.675920  Y26.580480
G1  X8.593520  Y26.330280
G1  X8.554420  Y26.117780
G1  X8.548220  Y26.046180
G1  X11.048020  Y26.050480
M300 S50 (pen up)
G4 P50 (wait 50ms)
G1  X19.784520  Y25.681180

M300 S30 (pen down)
G4 P50 (wait 50ms)

G1  X19.686320  Y25.681180
G1  X19.391720  Y25.668980
G1  X19.064720  Y25.632580
G1  X18.802820  Y25.571880
G1  X18.651920  Y25.513880
G1  X18.606220  Y25.486780
G1  X18.567220  Y25.463580
G1  X18.463120  Y25.372380
G1  X18.360820  Y25.223580
G1  X18.299020  Y25.040680
G1  X18.278420  Y24.878080
G1  X18.278420  Y24.779580
G1  X18.293720  Y24.646480
G1  X18.339420  Y24.488180
G1  X18.415520  Y24.348880
G1  X18.492620  Y24.255480
G1  X18.522320  Y24.228680
G1  X18.553020  Y24.201780
G1  X18.657220  Y24.133980
G1  X18.814020  Y24.066380
G1  X18.992620  Y24.025980
G1  X19.143020  Y24.012480
G1  X19.262420  Y24.012480
G1  X19.470220  Y24.038080
G1  X19.718120  Y24.114980
G1  X19.936920  Y24.243180
G1  X20.084220  Y24.373580
G1  X20.126320  Y24.423180
G1  X20.170420  Y24.474680
G1  X20.281620  Y24.647580
G1  X20.392320  Y24.905980
G1  X20.458520  Y25.198080
G1  X20.480520  Y25.442580
G1  X20.480520  Y25.681180
G1  X19.784520  Y25.681180

M300 S50 (pen up)
G4 P50 (wait 50ms)


(Footer begin)
(end of print job)
M300 S50.00 (pen up)
G4 P50 (wait 50ms)
M300 S255 (turn off servo)
G1 X0 Y0 F3000.00
G1 Z0.00 F150.00 (go up to finished level)
G1 X0.00 Y0.00 F3000.00 (go home)
M18 (drives off)
