G21 (metric ftw)
G90 (absolute mode)
G92 X0.00 Y0.00 Z0.00 (you are here)

M300 S30 (pen down)
G4 P50 (wait 50ms)
M300 S50 (pen up)
G4 P50 (wait 50ms)
M18 (disengage drives)
M01 (Was registration test successful?)
M17 (engage drives if YES, and continue)

(Header end)












G1  X3.602705  Y33.180310

M300 S30 (pen down)
G4 P50 (wait 50ms)

G1  X4.801705  Y33.180310
G1  X5.004675  Y33.163310
G1  X5.235785  Y33.112010
G1  X5.427585  Y33.026710
G1  X5.546835  Y32.941610
G1  X5.580415  Y32.907310
G1  X5.613885  Y32.873810
G1  X5.696945  Y32.756010
G1  X5.780015  Y32.568110
G1  X5.829765  Y32.343510
G1  X5.846355  Y32.147410
G1  X5.846355  Y31.846710
G1  X5.838555  Y31.715110
G1  X5.815385  Y31.556610
G1  X5.777025  Y31.415210
G1  X5.739315  Y31.320810
G1  X5.723635  Y31.290710
G1  X5.709535  Y31.262710
G1  X5.657665  Y31.183210
G1  X5.575525  Y31.091610
G1  X5.477105  Y31.015910
G1  X5.392035  Y30.968510
G1  X5.362375  Y30.956010
G1  X5.362375  Y30.942310
G1  X5.395995  Y30.930910
G1  X5.493215  Y30.885210
G1  X5.606775  Y30.808810
G1  X5.702915  Y30.713110
G1  X5.781695  Y30.598310
G1  X5.842945  Y30.464410
G1  X5.886775  Y30.311210
G1  X5.913095  Y30.138810
G1  X5.921885  Y29.995310
G1  X5.921885  Y29.473110
G1  X5.903535  Y29.277710
G1  X5.848535  Y29.049910
G1  X5.756785  Y28.854810
G1  X5.664775  Y28.728410
G1  X5.628375  Y28.691910
G1  X5.592625  Y28.656210
G1  X5.467885  Y28.566310
G1  X5.273605  Y28.476910
G1  X5.045205  Y28.423210
G1  X4.848095  Y28.405510
G1  X3.602705  Y28.405510
G1  X3.602705  Y33.180310
M300 S50 (pen up)
G4 P50 (wait 50ms)
G1  X6.360355  Y33.180310

M300 S30 (pen down)
G4 P50 (wait 50ms)

G1  X7.109995  Y33.180310
G1  X7.109995  Y28.405510
G1  X6.360355  Y28.405510
G1  X6.360355  Y33.180310
M300 S50 (pen up)
G4 P50 (wait 50ms)
G1  X8.749695  Y28.337710

M300 S30 (pen down)
G4 P50 (wait 50ms)

G1  X8.684795  Y28.337710
G1  X8.489795  Y28.357110
G1  X8.262195  Y28.415610
G1  X8.067095  Y28.513410
G1  X7.940695  Y28.612010
G1  X7.904895  Y28.650610
G1  X7.868295  Y28.689810
G1  X7.776495  Y28.824110
G1  X7.684795  Y29.029910
G1  X7.629695  Y29.268010
G1  X7.611295  Y29.470610
G1  X7.611295  Y32.115210
G1  X7.629695  Y32.317810
G1  X7.684795  Y32.555910
G1  X7.776495  Y32.761710
G1  X7.868295  Y32.895910
G1  X7.904895  Y32.935110
G1  X7.940795  Y32.973510
G1  X8.067095  Y33.071610
G1  X8.262195  Y33.169410
G1  X8.489795  Y33.228110
G1  X8.684795  Y33.247710
G1  X8.814895  Y33.247710
G1  X9.010295  Y33.228110
G1  X9.237895  Y33.169410
G1  X9.432995  Y33.071610
G1  X9.559595  Y32.973510
G1  X9.595695  Y32.935110
G1  X9.632295  Y32.896010
G1  X9.724095  Y32.761710
G1  X9.815895  Y32.555910
G1  X9.870895  Y32.317810
G1  X9.889195  Y32.115210
G1  X9.889195  Y29.470610
G1  X9.870895  Y29.268010
G1  X9.815895  Y29.029910
G1  X9.724095  Y28.824110
G1  X9.632295  Y28.689810
G1  X9.595695  Y28.650610
G1  X9.559595  Y28.612010
G1  X9.432995  Y28.513410
G1  X9.237895  Y28.415610
G1  X9.010295  Y28.357110
G1  X8.814895  Y28.337710
G1  X8.749695  Y28.337710
M300 S50 (pen up)
G4 P50 (wait 50ms)
G1  X10.396495  Y33.180310

M300 S30 (pen down)
G4 P50 (wait 50ms)

G1  X12.382295  Y33.180310
G1  X12.382295  Y32.498010
G1  X11.147595  Y32.498010
G1  X11.147595  Y31.168410
G1  X12.114995  Y31.168410
G1  X12.114995  Y30.486210
G1  X11.147595  Y30.486210
G1  X11.147595  Y28.405510
G1  X10.396495  Y28.405510
G1  X10.396495  Y33.180310
M300 S50 (pen up)
G4 P50 (wait 50ms)
G1  X13.108295  Y33.180310

M300 S30 (pen down)
G4 P50 (wait 50ms)

G1  X14.123995  Y33.180310
G1  X14.901195  Y28.405510
G1  X14.151795  Y28.405510
G1  X14.015395  Y29.353410
G1  X14.015395  Y29.339610
G1  X13.162295  Y29.339610
G1  X13.025795  Y28.405510
G1  X12.329795  Y28.405510
G1  X13.108295  Y33.180310
M300 S50 (pen up)
G4 P50 (wait 50ms)
G1  X15.259495  Y33.180310

M300 S30 (pen down)
G4 P50 (wait 50ms)

G1  X16.458595  Y33.180310
G1  X16.661795  Y33.163310
G1  X16.893195  Y33.112010
G1  X17.084995  Y33.026710
G1  X17.203895  Y32.941710
G1  X17.237195  Y32.907310
G1  X17.270695  Y32.873810
G1  X17.353795  Y32.756010
G1  X17.436895  Y32.568110
G1  X17.486595  Y32.343510
G1  X17.503195  Y32.147410
G1  X17.503195  Y31.846710
G1  X17.495695  Y31.715110
G1  X17.472695  Y31.556610
G1  X17.434395  Y31.415210
G1  X17.396395  Y31.320610
G1  X17.380395  Y31.290710
G1  X17.366295  Y31.262710
G1  X17.314395  Y31.183210
G1  X17.232295  Y31.091610
G1  X17.133995  Y31.015910
G1  X17.048795  Y30.968510
G1  X17.019295  Y30.956010
G1  X17.019295  Y30.942310
G1  X17.052895  Y30.930910
G1  X17.150095  Y30.885210
G1  X17.263595  Y30.808810
G1  X17.359795  Y30.713110
G1  X17.438595  Y30.598310
G1  X17.499795  Y30.464410
G1  X17.543595  Y30.311210
G1  X17.569995  Y30.138810
G1  X17.578695  Y29.995310
G1  X17.578695  Y29.473110
G1  X17.560395  Y29.277710
G1  X17.505395  Y29.049910
G1  X17.413695  Y28.854810
G1  X17.321595  Y28.728410
G1  X17.285195  Y28.691910
G1  X17.249395  Y28.656210
G1  X17.124695  Y28.566310
G1  X16.930395  Y28.476910
G1  X16.701895  Y28.423210
G1  X16.504995  Y28.405510
G1  X15.259495  Y28.405510
G1  X15.259495  Y33.180310
M300 S50 (pen up)
G4 P50 (wait 50ms)
G1  X18.017195  Y33.180310

M300 S30 (pen down)
G4 P50 (wait 50ms)

G1  X19.196595  Y33.180310
G1  X19.399095  Y33.163310
G1  X19.630095  Y33.112010
G1  X19.822195  Y33.026710
G1  X19.941495  Y32.941610
G1  X19.975095  Y32.907310
G1  X20.008395  Y32.873810
G1  X20.091095  Y32.756010
G1  X20.174295  Y32.568110
G1  X20.224395  Y32.343510
G1  X20.241095  Y32.147410
G1  X20.241095  Y31.744210
G1  X20.233395  Y31.611010
G1  X20.210395  Y31.450710
G1  X20.171895  Y31.307610
G1  X20.118195  Y31.181410
G1  X20.048995  Y31.072410
G1  X19.964395  Y30.980510
G1  X19.864495  Y30.905510
G1  X19.779095  Y30.859510
G1  X19.749395  Y30.847410
G1  X19.749395  Y30.833710
G1  X19.781795  Y30.823910
G1  X19.875495  Y30.782410
G1  X19.981495  Y30.709610
G1  X20.066795  Y30.615510
G1  X20.118195  Y30.530210
G1  X20.131095  Y30.499910
G1  X20.146195  Y30.466910
G1  X20.181795  Y30.363110
G1  X20.218395  Y30.204810
G1  X20.240695  Y30.025210
G1  X20.248195  Y29.874810
G1  X20.248195  Y28.938910
G1  X20.251195  Y28.799510
G1  X20.258395  Y28.672310
G1  X20.260495  Y28.650610
G1  X20.262895  Y28.630310
G1  X20.320395  Y28.425710
G1  X20.329295  Y28.405510
G1  X19.565895  Y28.405510
G1  X19.558995  Y28.424610
G1  X19.531595  Y28.517810
G1  X19.513295  Y28.606310
G1  X19.510895  Y28.623110
G1  X19.508395  Y28.640310
G1  X19.500395  Y28.766910
G1  X19.497195  Y28.936010
G1  X19.497195  Y29.902610
G1  X19.490395  Y30.016410
G1  X19.469995  Y30.143110
G1  X19.435895  Y30.244910
G1  X19.402595  Y30.304910
G1  X19.388195  Y30.322110
G1  X19.375195  Y30.338410
G1  X19.326895  Y30.379110
G1  X19.246495  Y30.419510
G1  X19.146495  Y30.443810
G1  X19.056995  Y30.451910
G1  X18.766895  Y30.451910
G1  X18.766895  Y28.405510
G1  X18.017195  Y28.405510
G1  X18.017195  Y33.180310
M300 S50 (pen up)
G4 P50 (wait 50ms)
G1  X20.760795  Y33.180310

M300 S30 (pen down)
G4 P50 (wait 50ms)

G1  X21.511895  Y33.180310
G1  X21.511895  Y28.405510
G1  X20.760795  Y28.405510
G1  X20.760795  Y33.180310
M300 S50 (pen up)
G4 P50 (wait 50ms)
G1  X23.123995  Y28.337710

M300 S30 (pen down)
G4 P50 (wait 50ms)

G1  X23.060495  Y28.337710
G1  X22.870195  Y28.356910
G1  X22.648295  Y28.414210
G1  X22.457695  Y28.509910
G1  X22.333895  Y28.606310
G1  X22.298595  Y28.643910
G1  X22.263695  Y28.682410
G1  X22.176395  Y28.813510
G1  X22.088995  Y29.014210
G1  X22.036295  Y29.246610
G1  X22.018795  Y29.444610
G1  X22.018795  Y32.141210
G1  X22.036295  Y32.339210
G1  X22.088995  Y32.571610
G1  X22.176395  Y32.772310
G1  X22.263695  Y32.903410
G1  X22.298595  Y32.941710
G1  X22.333895  Y32.979510
G1  X22.457695  Y33.075610
G1  X22.648295  Y33.171210
G1  X22.870195  Y33.228510
G1  X23.060495  Y33.247710
G1  X23.187495  Y33.247710
G1  X23.377595  Y33.228510
G1  X23.598395  Y33.171210
G1  X23.786795  Y33.075610
G1  X23.908195  Y32.979510
G1  X23.942495  Y32.941710
G1  X23.978195  Y32.903510
G1  X24.068195  Y32.772310
G1  X24.157695  Y32.571610
G1  X24.211395  Y32.339210
G1  X24.229295  Y32.141210
G1  X24.229295  Y31.570610
G1  X23.519495  Y31.570610
G1  X23.519495  Y32.171710
G1  X23.495895  Y32.317010
G1  X23.425695  Y32.455210
G1  X23.308595  Y32.538110
G1  X23.185795  Y32.565710
G1  X23.103695  Y32.565710
G1  X22.980395  Y32.538110
G1  X22.863295  Y32.455210
G1  X22.793195  Y32.317010
G1  X22.769795  Y32.171710
G1  X22.769795  Y29.407710
G1  X22.793195  Y29.264610
G1  X22.863295  Y29.128710
G1  X22.980395  Y29.047110
G1  X23.103695  Y29.019910
G1  X23.185795  Y29.019910
G1  X23.308595  Y29.047110
G1  X23.425695  Y29.128710
G1  X23.495895  Y29.264610
G1  X23.519495  Y29.407710
G1  X23.519495  Y30.185910
G1  X24.229295  Y30.185910
G1  X24.229295  Y29.444610
G1  X24.211395  Y29.246610
G1  X24.157695  Y29.014210
G1  X24.068195  Y28.813510
G1  X23.978195  Y28.682310
G1  X23.942495  Y28.643910
G1  X23.908195  Y28.606310
G1  X23.786795  Y28.509910
G1  X23.598395  Y28.414210
G1  X23.377595  Y28.356910
G1  X23.187495  Y28.337710
G1  X23.123995  Y28.337710
M300 S50 (pen up)
G4 P50 (wait 50ms)
G1  X25.257295  Y33.180310

M300 S30 (pen down)
G4 P50 (wait 50ms)

G1  X26.274295  Y33.180310
G1  X27.051495  Y28.405510
G1  X26.301895  Y28.405510
G1  X26.165395  Y29.353410
G1  X26.165395  Y29.339610
G1  X25.312295  Y29.339610
G1  X25.176095  Y28.405510
G1  X24.480095  Y28.405510
G1  X25.257295  Y33.180310
M300 S50 (pen up)
G4 P50 (wait 50ms)
G1  X28.452995  Y28.337710

M300 S30 (pen down)
G4 P50 (wait 50ms)

G1  X28.389495  Y28.337710
G1  X28.199295  Y28.356910
G1  X27.977195  Y28.414210
G1  X27.786795  Y28.509910
G1  X27.662895  Y28.606310
G1  X27.627595  Y28.643910
G1  X27.592695  Y28.682410
G1  X27.505195  Y28.813510
G1  X27.417895  Y29.014210
G1  X27.365195  Y29.246610
G1  X27.347895  Y29.444610
G1  X27.347895  Y32.141210
G1  X27.365195  Y32.339210
G1  X27.417895  Y32.571610
G1  X27.505195  Y32.772310
G1  X27.592695  Y32.903410
G1  X27.627595  Y32.941710
G1  X27.662895  Y32.979510
G1  X27.786795  Y33.075610
G1  X27.977195  Y33.171210
G1  X28.199295  Y33.228510
G1  X28.389495  Y33.247710
G1  X28.516395  Y33.247710
G1  X28.706495  Y33.228510
G1  X28.927295  Y33.171210
G1  X29.115795  Y33.075610
G1  X29.237195  Y32.979510
G1  X29.271495  Y32.941710
G1  X29.307195  Y32.903510
G1  X29.396995  Y32.772310
G1  X29.486595  Y32.571610
G1  X29.540095  Y32.339210
G1  X29.557995  Y32.141210
G1  X29.557995  Y31.570610
G1  X28.848595  Y31.570610
G1  X28.848595  Y32.171710
G1  X28.824995  Y32.317010
G1  X28.754495  Y32.455210
G1  X28.637295  Y32.538110
G1  X28.514395  Y32.565710
G1  X28.432495  Y32.565710
G1  X28.309095  Y32.538110
G1  X28.192195  Y32.455210
G1  X28.122195  Y32.317010
G1  X28.098795  Y32.171710
G1  X28.098795  Y29.407710
G1  X28.122195  Y29.264610
G1  X28.192195  Y29.128710
G1  X28.309095  Y29.047110
G1  X28.432495  Y29.019910
G1  X28.514395  Y29.019910
G1  X28.637295  Y29.047110
G1  X28.754495  Y29.128710
G1  X28.824995  Y29.264610
G1  X28.848595  Y29.407710
G1  X28.848595  Y30.185910
G1  X29.557995  Y30.185910
G1  X29.557995  Y29.444610
G1  X29.540095  Y29.246610
G1  X29.486595  Y29.014210
G1  X29.396995  Y28.813510
G1  X29.307195  Y28.682310
G1  X29.271495  Y28.643910
G1  X29.237195  Y28.606210
G1  X29.115795  Y28.509910
G1  X28.927295  Y28.414210
G1  X28.706495  Y28.356910
G1  X28.516395  Y28.337710
G1  X28.452995  Y28.337710
M300 S50 (pen up)
G4 P50 (wait 50ms)
G1  X30.007495  Y33.180310

M300 S30 (pen down)
G4 P50 (wait 50ms)

G1  X30.756995  Y33.180310
G1  X30.756995  Y28.405510
G1  X30.007495  Y28.405510
G1  X30.007495  Y33.180310
M300 S50 (pen up)
G4 P50 (wait 50ms)
G1  X34.043595  Y33.180310

M300 S30 (pen down)
G4 P50 (wait 50ms)

G1  X34.984795  Y33.180310
G1  X35.714995  Y30.322110
G1  X35.729095  Y30.322110
G1  X35.729095  Y33.180310
G1  X36.397295  Y33.180310
G1  X36.397295  Y28.405510
G1  X35.625795  Y28.405510
G1  X34.725795  Y31.890510
G1  X34.711995  Y31.890510
G1  X34.711995  Y28.405510
G1  X34.043595  Y28.405510
G1  X34.043595  Y33.180310
M300 S50 (pen up)
G4 P50 (wait 50ms)
G1  X32.396795  Y28.337710

M300 S30 (pen down)
G4 P50 (wait 50ms)

G1  X32.331795  Y28.337710
G1  X32.136895  Y28.357110
G1  X31.909095  Y28.415610
G1  X31.713695  Y28.513410
G1  X31.586895  Y28.612010
G1  X31.550795  Y28.650610
G1  X31.514295  Y28.689810
G1  X31.422595  Y28.824110
G1  X31.331295  Y29.029910
G1  X31.276795  Y29.268010
G1  X31.258695  Y29.470610
G1  X31.258695  Y32.115210
G1  X31.276795  Y32.317810
G1  X31.331295  Y32.555910
G1  X31.422595  Y32.761710
G1  X31.514295  Y32.896010
G1  X31.550795  Y32.935110
G1  X31.586995  Y32.973510
G1  X31.713695  Y33.071610
G1  X31.909095  Y33.169410
G1  X32.136895  Y33.228110
G1  X32.331795  Y33.247710
G1  X32.461795  Y33.247710
G1  X32.656795  Y33.228110
G1  X32.884495  Y33.169410
G1  X33.079995  Y33.071610
G1  X33.206895  Y32.973510
G1  X33.243195  Y32.935110
G1  X33.279695  Y32.895910
G1  X33.371395  Y32.761710
G1  X33.463195  Y32.555910
G1  X33.518295  Y32.317810
G1  X33.536595  Y32.115210
G1  X33.536595  Y29.470610
G1  X33.518295  Y29.268010
G1  X33.463195  Y29.029910
G1  X33.371395  Y28.824110
G1  X33.279695  Y28.689810
G1  X33.243195  Y28.650610
G1  X33.206995  Y28.612010
G1  X33.079995  Y28.513410
G1  X32.884495  Y28.415610
G1  X32.656795  Y28.357110
G1  X32.461795  Y28.337710
G1  X32.396795  Y28.337710
M300 S50 (pen up)
G4 P50 (wait 50ms)
G1  X28.622495  Y18.374510

M300 S30 (pen down)
G4 P50 (wait 50ms)

G1  X28.610695  Y18.363110
G1  X28.569095  Y18.335210
G1  X28.483595  Y18.291410
G1  X28.363895  Y18.243810
G1  X28.207595  Y18.193010
G1  X28.012595  Y18.139610
G1  X27.776795  Y18.084410
G1  X27.497995  Y18.027810
G1  X27.173995  Y17.970610
G1  X26.802595  Y17.913410
G1  X26.381595  Y17.856710
G1  X25.908995  Y17.801210
G1  X25.382495  Y17.747610
G1  X24.799995  Y17.696410
G1  X24.159095  Y17.648410
G1  X23.457895  Y17.604210
G1  X22.884995  Y17.573310
G1  X22.693995  Y17.564210
G1  X22.674095  Y17.563310
G1  X22.614995  Y17.550910
G1  X22.542495  Y17.520110
G1  X22.479295  Y17.473010
G1  X22.438795  Y17.428110
G1  X22.427995  Y17.411410
G1  X22.417195  Y17.395110
G1  X22.392295  Y17.340310
G1  X22.374795  Y17.263410
G1  X22.375695  Y17.184410
G1  X22.387995  Y17.125210
G1  X22.395195  Y17.106710
G1  X22.434995  Y17.003010
G1  X22.550195  Y16.690210
G1  X22.708895  Y16.237710
G1  X22.866595  Y15.754510
G1  X23.019295  Y15.245610
G1  X23.162495  Y14.716210
G1  X23.291995  Y14.171210
G1  X23.403395  Y13.615910
G1  X23.492595  Y13.055410
G1  X23.555095  Y12.494810
G1  X23.586595  Y11.939210
G1  X23.582995  Y11.393810
G1  X23.539695  Y10.863510
G1  X23.452695  Y10.353610
G1  X23.317495  Y9.869110
G1  X23.129995  Y9.415270
G1  X22.953995  Y9.096520
G1  X22.885495  Y8.997020
G1  X22.818995  Y8.900290
G1  X22.589695  Y8.630500
G1  X22.239995  Y8.312290
G1  X21.836495  Y8.042650
G1  X21.380095  Y7.821620
G1  X20.870895  Y7.649480
G1  X20.309495  Y7.526270
G1  X19.696195  Y7.452270
G1  X19.197595  Y7.427520
G1  X18.578295  Y7.427520
G1  X18.079295  Y7.452270
G1  X17.465695  Y7.526270
G1  X16.903895  Y7.649480
G1  X16.394495  Y7.821620
G1  X15.937995  Y8.042650
G1  X15.534495  Y8.312290
G1  X15.184695  Y8.630500
G1  X14.955395  Y8.900290
G1  X14.888795  Y8.997020
G1  X14.822595  Y9.093330
G1  X14.651595  Y9.401160
G1  X14.467695  Y9.838910
G1  X14.333195  Y10.305710
G1  X14.243995  Y10.796810
G1  X14.196495  Y11.307510
G1  X14.186495  Y11.833310
G1  X14.210395  Y12.369610
G1  X14.263995  Y12.911610
G1  X14.343695  Y13.454610
G1  X14.445395  Y13.994210
G1  X14.565195  Y14.525610
G1  X14.699395  Y15.044210
G1  X14.843795  Y15.545310
G1  X14.994995  Y16.024410
G1  X15.148595  Y16.476610
G1  X15.261795  Y16.792710
G1  X15.300795  Y16.897410
G1  X15.494495  Y16.890510
G1  X16.075795  Y16.872810
G1  X16.867495  Y16.855110
G1  X17.669795  Y16.844410
G1  X18.275395  Y16.840610
G1  X18.715895  Y16.840610
G1  X19.352995  Y16.844210
G1  X19.432195  Y16.844910
G1  X19.449095  Y16.845210
G1  X19.500095  Y16.852810
G1  X19.562995  Y16.873410
G1  X19.619995  Y16.905310
G1  X19.669295  Y16.947110
G1  X19.709995  Y16.997710
G1  X19.740395  Y17.055310
G1  X19.759495  Y17.118810
G1  X19.766095  Y17.169810
G1  X19.765895  Y17.186710
G1  X19.765695  Y17.203710
G1  X19.758195  Y17.254110
G1  X19.737895  Y17.316710
G1  X19.706495  Y17.373310
G1  X19.665195  Y17.422710
G1  X19.615495  Y17.463410
G1  X19.558395  Y17.494110
G1  X19.495695  Y17.513410
G1  X19.445095  Y17.520210
G1  X19.425495  Y17.520210
G1  X19.325395  Y17.516010
G1  X19.025195  Y17.506410
G1  X18.618295  Y17.497310
G1  X18.205895  Y17.492610
G1  X17.789395  Y17.492110
G1  X17.369695  Y17.495610
G1  X16.948195  Y17.503010
G1  X16.525795  Y17.513910
G1  X16.103995  Y17.528410
G1  X15.683695  Y17.545910
G1  X15.266195  Y17.566610
G1  X14.852595  Y17.590110
G1  X14.444095  Y17.616010
G1  X14.041895  Y17.644510
G1  X13.647295  Y17.675210
G1  X13.261095  Y17.707810
G1  X12.884795  Y17.742310
G1  X12.519495  Y17.778410
G1  X12.166295  Y17.815910
G1  X11.826495  Y17.854510
G1  X11.501095  Y17.894210
G1  X11.191395  Y17.934610
G1  X10.898395  Y17.975810
G1  X10.623495  Y18.017110
G1  X10.367695  Y18.058810
G1  X10.132295  Y18.100510
G1  X9.918395  Y18.141910
G1  X9.727195  Y18.182810
G1  X9.559795  Y18.223210
G1  X9.417395  Y18.262810
G1  X9.301295  Y18.301410
G1  X9.212495  Y18.338710
G1  X9.165995  Y18.363910
G1  X9.152295  Y18.374510
G1  X9.143495  Y18.394210
G1  X9.124895  Y18.456410
G1  X9.107395  Y18.557810
G1  X9.100095  Y18.678010
G1  X9.103195  Y18.815710
G1  X9.117295  Y18.970210
G1  X9.142595  Y19.140110
G1  X9.179695  Y19.324410
G1  X9.228795  Y19.522110
G1  X9.290295  Y19.732310
G1  X9.364595  Y19.953810
G1  X9.452095  Y20.185510
G1  X9.553095  Y20.426410
G1  X9.667995  Y20.675610
G1  X9.797295  Y20.931710
G1  X9.941195  Y21.194110
G1  X10.059295  Y21.395310
G1  X10.100195  Y21.461310
G1  X10.121195  Y21.495510
G1  X10.185595  Y21.596710
G1  X10.281095  Y21.742010
G1  X10.387095  Y21.896210
G1  X10.503595  Y22.058210
G1  X10.630795  Y22.227410
G1  X10.768995  Y22.402810
G1  X10.918295  Y22.583410
G1  X11.078895  Y22.768110
G1  X11.250895  Y22.956410
G1  X11.434695  Y23.147110
G1  X11.630095  Y23.339210
G1  X11.837695  Y23.532010
G1  X12.057495  Y23.724410
G1  X12.289695  Y23.915510
G1  X12.534395  Y24.104210
G1  X12.791995  Y24.290110
G1  X13.062495  Y24.471710
G1  X13.346095  Y24.648410
G1  X13.642995  Y24.819210
G1  X13.953295  Y24.983110
G1  X14.277495  Y25.139210
G1  X14.615395  Y25.286610
G1  X14.967495  Y25.424410
G1  X15.333695  Y25.551610
G1  X15.714395  Y25.667410
G1  X16.109695  Y25.770810
G1  X16.519695  Y25.860610
G1  X16.944695  Y25.936310
G1  X17.384995  Y25.996910
G1  X17.840495  Y26.041210
G1  X18.311495  Y26.068510
G1  X18.676595  Y26.077810
G1  X19.099095  Y26.077810
G1  X19.464295  Y26.068510
G1  X19.935195  Y26.041210
G1  X20.390795  Y25.996910
G1  X20.831095  Y25.936310
G1  X21.256095  Y25.860610
G1  X21.666095  Y25.770810
G1  X22.061395  Y25.667410
G1  X22.441995  Y25.551610
G1  X22.808295  Y25.424410
G1  X23.160395  Y25.286610
G1  X23.498295  Y25.139210
G1  X23.822495  Y24.983110
G1  X24.132895  Y24.819210
G1  X24.429795  Y24.648410
G1  X24.713395  Y24.471710
G1  X24.983895  Y24.290110
G1  X25.241295  Y24.104210
G1  X25.486195  Y23.915510
G1  X25.718295  Y23.724410
G1  X25.938195  Y23.532010
G1  X26.145695  Y23.339210
G1  X26.341195  Y23.147110
G1  X26.524995  Y22.956410
G1  X26.696995  Y22.768110
G1  X26.857595  Y22.583410
G1  X27.006795  Y22.402810
G1  X27.144995  Y22.227410
G1  X27.272195  Y22.058210
G1  X27.388695  Y21.896210
G1  X27.494695  Y21.742010
G1  X27.590195  Y21.596710
G1  X27.654495  Y21.495510
G1  X27.675495  Y21.461310
G1  X27.716295  Y21.395310
G1  X27.834295  Y21.194110
G1  X27.978195  Y20.931710
G1  X28.107195  Y20.675610
G1  X28.221895  Y20.426410
G1  X28.322895  Y20.185510
G1  X28.410195  Y19.953810
G1  X28.484395  Y19.732310
G1  X28.545795  Y19.522110
G1  X28.594995  Y19.324410
G1  X28.631895  Y19.140110
G1  X28.657195  Y18.970210
G1  X28.671295  Y18.815710
G1  X28.674495  Y18.678010
G1  X28.667195  Y18.557810
G1  X28.649695  Y18.456410
G1  X28.631195  Y18.394210
G1  X28.622495  Y18.374510
M300 S50 (pen up)
G4 P50 (wait 50ms)
G1  X28.248895  Y21.817010

M300 S30 (pen down)
G4 P50 (wait 50ms)

G1  X28.190695  Y21.911210
G1  X28.007595  Y22.188510
G1  X27.719495  Y22.589910
G1  X27.382495  Y23.012810
G1  X26.993795  Y23.449210
G1  X26.551795  Y23.891210
G1  X26.053695  Y24.330510
G1  X25.497695  Y24.758810
G1  X25.038695  Y25.071710
G1  X24.881195  Y25.168410
G1  X24.720895  Y25.266710
G1  X24.225695  Y25.538310
G1  X23.545395  Y25.859510
G1  X22.840795  Y26.131710
G1  X22.112695  Y26.354910
G1  X21.361795  Y26.528810
G1  X20.588395  Y26.653310
G1  X19.793395  Y26.728110
G1  X19.181495  Y26.753010
G1  X18.592995  Y26.753010
G1  X17.981395  Y26.728110
G1  X17.186495  Y26.653310
G1  X16.413295  Y26.528810
G1  X15.662195  Y26.354910
G1  X14.933995  Y26.131710
G1  X14.229395  Y25.859510
G1  X13.548995  Y25.538310
G1  X13.053695  Y25.266710
G1  X12.893395  Y25.168410
G1  X12.735795  Y25.071710
G1  X12.276995  Y24.758810
G1  X11.720895  Y24.330510
G1  X11.223195  Y23.891210
G1  X10.781095  Y23.449210
G1  X10.392595  Y23.012810
G1  X10.055395  Y22.589910
G1  X9.767095  Y22.188510
G1  X9.583795  Y21.911210
G1  X9.525495  Y21.817010
G1  X9.482995  Y21.748310
G1  X9.360395  Y21.538910
G1  X9.207495  Y21.260110
G1  X9.067195  Y20.981610
G1  X8.939895  Y20.704910
G1  X8.825795  Y20.431710
G1  X8.725295  Y20.163310
G1  X8.638995  Y19.901010
G1  X8.567095  Y19.646410
G1  X8.509895  Y19.401010
G1  X8.467895  Y19.166210
G1  X8.441495  Y18.943310
G1  X8.430995  Y18.733910
G1  X8.436795  Y18.539210
G1  X8.459095  Y18.361010
G1  X8.498495  Y18.200510
G1  X8.538395  Y18.093110
G1  X8.555395  Y18.059210
G1  X8.561595  Y18.046610
G1  X8.582795  Y18.009810
G1  X8.617395  Y17.959910
G1  X8.660595  Y17.909810
G1  X8.714195  Y17.859510
G1  X8.779695  Y17.809110
G1  X8.859095  Y17.758510
G1  X8.953695  Y17.708110
G1  X9.065295  Y17.657610
G1  X9.195595  Y17.607110
G1  X9.346195  Y17.556910
G1  X9.518795  Y17.506710
G1  X9.715095  Y17.456910
G1  X9.936695  Y17.407410
G1  X10.185295  Y17.358310
G1  X10.462495  Y17.309510
G1  X10.693095  Y17.272710
G1  X10.770095  Y17.261210
G1  X10.865895  Y17.246910
G1  X11.154295  Y17.207310
G1  X11.567895  Y17.156210
G1  X12.009395  Y17.108010
G1  X12.477695  Y17.062810
G1  X12.971195  Y17.020610
G1  X13.488395  Y16.981910
G1  X14.027995  Y16.946310
G1  X14.448395  Y16.921610
G1  X14.588595  Y16.914110
G1  X14.540895  Y16.783010
G1  X14.403695  Y16.387610
G1  X14.236195  Y15.870910
G1  X14.085795  Y15.364410
G1  X13.952495  Y14.868410
G1  X13.836495  Y14.383210
G1  X13.737695  Y13.909610
G1  X13.656295  Y13.447610
G1  X13.606395  Y13.110310
G1  X13.592295  Y12.997510
G1  X13.571295  Y12.828510
G1  X13.528395  Y12.319010
G1  X13.509395  Y11.676810
G1  X13.535195  Y11.071510
G1  X13.605795  Y10.503610
G1  X13.720895  Y9.973610
G1  X13.880695  Y9.481910
G1  X14.084795  Y9.028980
G1  X14.265195  Y8.714520
G1  X14.333595  Y8.615300
G1  X14.373195  Y8.557730
G1  X14.500395  Y8.390690
G1  X14.681895  Y8.180340
G1  X14.878295  Y7.984380
G1  X15.089395  Y7.802750
G1  X15.314995  Y7.635480
G1  X15.555195  Y7.482650
G1  X15.809995  Y7.344250
G1  X16.079095  Y7.220270
G1  X16.362595  Y7.110800
G1  X16.660395  Y7.015860
G1  X16.972495  Y6.935450
G1  X17.298795  Y6.869580
G1  X17.639295  Y6.818320
G1  X17.993695  Y6.781690
G1  X18.362195  Y6.759660
G1  X18.648995  Y6.752290
G1  X19.126995  Y6.752290
G1  X19.413895  Y6.759660
G1  X19.782295  Y6.781690
G1  X20.136795  Y6.818320
G1  X20.476995  Y6.869580
G1  X20.803295  Y6.935450
G1  X21.115395  Y7.015860
G1  X21.413195  Y7.110800
G1  X21.696595  Y7.220270
G1  X21.965795  Y7.344250
G1  X22.220495  Y7.482650
G1  X22.460695  Y7.635480
G1  X22.686395  Y7.802750
G1  X22.897295  Y7.984380
G1  X23.093695  Y8.180340
G1  X23.275395  Y8.390690
G1  X23.402595  Y8.557730
G1  X23.442195  Y8.615300
G1  X23.510395  Y8.714580
G1  X23.690395  Y9.028980
G1  X23.894295  Y9.481910
G1  X24.053695  Y9.973610
G1  X24.168895  Y10.503610
G1  X24.239295  Y11.071510
G1  X24.265095  Y11.676810
G1  X24.246195  Y12.319010
G1  X24.203295  Y12.828510
G1  X24.182295  Y12.997510
G1  X24.168395  Y13.110310
G1  X24.118695  Y13.447610
G1  X24.037595  Y13.909610
G1  X23.938995  Y14.383210
G1  X23.822895  Y14.868410
G1  X23.689695  Y15.364410
G1  X23.539295  Y15.870910
G1  X23.371795  Y16.387610
G1  X23.235095  Y16.783010
G1  X23.187495  Y16.914110
G1  X23.327595  Y16.921610
G1  X23.747895  Y16.946310
G1  X24.287295  Y16.981910
G1  X24.804395  Y17.020610
G1  X25.297695  Y17.062810
G1  X25.765795  Y17.108010
G1  X26.207595  Y17.156210
G1  X26.621395  Y17.207310
G1  X26.909995  Y17.246910
G1  X27.005895  Y17.261210
G1  X27.082895  Y17.272710
G1  X27.313295  Y17.309510
G1  X27.590195  Y17.358310
G1  X27.838695  Y17.407410
G1  X28.060095  Y17.456910
G1  X28.256195  Y17.506710
G1  X28.428695  Y17.556910
G1  X28.579095  Y17.607110
G1  X28.709395  Y17.657610
G1  X28.820895  Y17.708110
G1  X28.915395  Y17.758510
G1  X28.994695  Y17.809110
G1  X29.060195  Y17.859510
G1  X29.113695  Y17.909810
G1  X29.156895  Y17.959910
G1  X29.191495  Y18.009810
G1  X29.212695  Y18.046610
G1  X29.218995  Y18.059210
G1  X29.236095  Y18.093110
G1  X29.276095  Y18.200510
G1  X29.315695  Y18.361010
G1  X29.338295  Y18.539210
G1  X29.344295  Y18.733910
G1  X29.333795  Y18.943310
G1  X29.307495  Y19.166210
G1  X29.265495  Y19.401010
G1  X29.208395  Y19.646410
G1  X29.136495  Y19.901010
G1  X29.050095  Y20.163310
G1  X28.949495  Y20.431710
G1  X28.835195  Y20.704910
G1  X28.707695  Y20.981610
G1  X28.567195  Y21.260110
G1  X28.414095  Y21.538910
G1  X28.291395  Y21.748310
G1  X28.248895  Y21.817010
M300 S50 (pen up)
G4 P50 (wait 50ms)
G1  X32.396795  Y29.019910

M300 S30 (pen down)
G4 P50 (wait 50ms)

G1  X32.439295  Y29.019910
G1  X32.566895  Y29.049210
G1  X32.688395  Y29.137110
G1  X32.761195  Y29.283810
G1  X32.785495  Y29.438410
G1  X32.785495  Y32.147410
G1  X32.761195  Y32.301710
G1  X32.688395  Y32.448510
G1  X32.566895  Y32.536610
G1  X32.439295  Y32.565710
G1  X32.354295  Y32.565710
G1  X32.226895  Y32.536610
G1  X32.105495  Y32.448510
G1  X32.032595  Y32.301710
G1  X32.008395  Y32.147410
G1  X32.008395  Y29.438410
G1  X32.032595  Y29.283810
G1  X32.105495  Y29.137110
G1  X32.226895  Y29.049210
G1  X32.354295  Y29.019910
G1  X32.396795  Y29.019910
M300 S50 (pen up)
G4 P50 (wait 50ms)
G1  X26.075795  Y29.987310

M300 S30 (pen down)
G4 P50 (wait 50ms)

G1  X25.742295  Y32.348110
G1  X25.728595  Y32.348110
G1  X25.400495  Y29.987310
G1  X26.075795  Y29.987310
M300 S50 (pen up)
G4 P50 (wait 50ms)
G1  X19.039495  Y31.133810

M300 S30 (pen down)
G4 P50 (wait 50ms)

G1  X19.065895  Y31.133810
G1  X19.144995  Y31.141210
G1  X19.235895  Y31.162810
G1  X19.312295  Y31.199110
G1  X19.360695  Y31.235210
G1  X19.374395  Y31.249510
G1  X19.389095  Y31.264410
G1  X19.425095  Y31.317310
G1  X19.461195  Y31.404610
G1  X19.482895  Y31.511710
G1  X19.490095  Y31.606710
G1  X19.490095  Y32.037710
G1  X19.484095  Y32.128010
G1  X19.466395  Y32.230610
G1  X19.436595  Y32.315510
G1  X19.407495  Y32.367310
G1  X19.395195  Y32.382310
G1  X19.384295  Y32.396410
G1  X19.343995  Y32.433010
G1  X19.279095  Y32.469110
G1  X19.200695  Y32.490910
G1  X19.131395  Y32.498010
G1  X18.766895  Y32.498010
G1  X18.766895  Y31.133810
G1  X19.039495  Y31.133810
M300 S50 (pen up)
G4 P50 (wait 50ms)
G1  X16.302695  Y31.235710

M300 S30 (pen down)
G4 P50 (wait 50ms)

G1  X16.329095  Y31.235710
G1  X16.408195  Y31.243110
G1  X16.499095  Y31.264810
G1  X16.575495  Y31.301010
G1  X16.623895  Y31.337110
G1  X16.637495  Y31.351410
G1  X16.652195  Y31.366310
G1  X16.688195  Y31.419210
G1  X16.724295  Y31.506610
G1  X16.745895  Y31.613710
G1  X16.753195  Y31.708710
G1  X16.753195  Y32.037710
G1  X16.747195  Y32.128010
G1  X16.729395  Y32.230610
G1  X16.699295  Y32.315510
G1  X16.669495  Y32.367410
G1  X16.656895  Y32.382310
G1  X16.646395  Y32.396610
G1  X16.606395  Y32.433010
G1  X16.541795  Y32.469110
G1  X16.463295  Y32.490910
G1  X16.394495  Y32.498010
G1  X16.009295  Y32.498010
G1  X16.009295  Y31.235710
G1  X16.302695  Y31.235710
M300 S50 (pen up)
G4 P50 (wait 50ms)
G1  X16.439295  Y29.087410

M300 S30 (pen down)
G4 P50 (wait 50ms)

G1  X16.482295  Y29.087410
G1  X16.611795  Y29.113110
G1  X16.716895  Y29.172410
G1  X16.732695  Y29.189410
G1  X16.745095  Y29.203510
G1  X16.774295  Y29.253410
G1  X16.803995  Y29.336310
G1  X16.821795  Y29.438010
G1  X16.827595  Y29.528510
G1  X16.827595  Y30.011410
G1  X16.820395  Y30.124910
G1  X16.798695  Y30.250610
G1  X16.762595  Y30.350210
G1  X16.727195  Y30.408110
G1  X16.711895  Y30.424110
G1  X16.698295  Y30.440310
G1  X16.647895  Y30.481010
G1  X16.565195  Y30.521610
G1  X16.463995  Y30.545810
G1  X16.373995  Y30.553910
G1  X16.009295  Y30.553910
G1  X16.009295  Y29.087410
G1  X16.439295  Y29.087410
M300 S50 (pen up)
G4 P50 (wait 50ms)
G1  X13.926995  Y29.987310

M300 S30 (pen down)
G4 P50 (wait 50ms)

G1  X13.592295  Y32.348110
G1  X13.578295  Y32.348110
G1  X13.251895  Y29.987310
G1  X13.926995  Y29.987310
M300 S50 (pen up)
G4 P50 (wait 50ms)
G1  X8.749695  Y29.019910

M300 S30 (pen down)
G4 P50 (wait 50ms)

G1  X8.792195  Y29.019910
G1  X8.919695  Y29.049210
G1  X9.041195  Y29.137110
G1  X9.114195  Y29.283810
G1  X9.138495  Y29.438410
G1  X9.138495  Y32.147410
G1  X9.114195  Y32.301710
G1  X9.041195  Y32.448510
G1  X8.919695  Y32.536610
G1  X8.792195  Y32.565710
G1  X8.707195  Y32.565710
G1  X8.579695  Y32.536610
G1  X8.458195  Y32.448510
G1  X8.385295  Y32.301710
G1  X8.360995  Y32.147410
G1  X8.360995  Y29.438410
G1  X8.385295  Y29.283810
G1  X8.458195  Y29.137110
G1  X8.579695  Y29.049210
G1  X8.707195  Y29.019910
G1  X8.749695  Y29.019910
M300 S50 (pen up)
G4 P50 (wait 50ms)
G1  X4.782405  Y29.087410

M300 S30 (pen down)
G4 P50 (wait 50ms)

G1  X4.825525  Y29.087410
G1  X4.954925  Y29.113110
G1  X5.060015  Y29.172410
G1  X5.075915  Y29.189410
G1  X5.088275  Y29.203510
G1  X5.117525  Y29.253410
G1  X5.147155  Y29.336310
G1  X5.164885  Y29.438010
G1  X5.170805  Y29.528510
G1  X5.170805  Y30.011410
G1  X5.163585  Y30.124910
G1  X5.141945  Y30.250610
G1  X5.105745  Y30.350210
G1  X5.070315  Y30.408110
G1  X5.055135  Y30.424110
G1  X5.041455  Y30.440310
G1  X4.991055  Y30.481010
G1  X4.908425  Y30.521610
G1  X4.807135  Y30.545810
G1  X4.717135  Y30.553910
G1  X4.352385  Y30.553910
G1  X4.352385  Y29.087410
G1  X4.782405  Y29.087410
M300 S50 (pen up)
G4 P50 (wait 50ms)
G1  X4.645905  Y31.235710

M300 S30 (pen down)
G4 P50 (wait 50ms)

G1  X4.672205  Y31.235710
G1  X4.751315  Y31.243110
G1  X4.842235  Y31.264810
G1  X4.918675  Y31.301010
G1  X4.967025  Y31.337110
G1  X4.980695  Y31.351410
G1  X4.995455  Y31.366310
G1  X5.031375  Y31.419210
G1  X5.067665  Y31.506610
G1  X5.089465  Y31.613710
G1  X5.096745  Y31.708710
G1  X5.096745  Y32.037710
G1  X5.090725  Y32.128010
G1  X5.072705  Y32.230610
G1  X5.042535  Y32.315510
G1  X5.012655  Y32.367310
G1  X5.000065  Y32.382310
G1  X4.989205  Y32.396410
G1  X4.948905  Y32.433010
G1  X4.884235  Y32.469110
G1  X4.805835  Y32.490910
G1  X4.736665  Y32.498010
G1  X4.352385  Y32.498010
G1  X4.352385  Y31.235710
G1  X4.645905  Y31.235710

M300 S50 (pen up)
G4 P50 (wait 50ms)


(Footer begin)
(end of print job)
M300 S50.00 (pen up)
G4 P50 (wait 50ms)
M300 S255 (turn off servo)
G1 X0 Y0 F3000.00
G1 Z0.00 F150.00 (go up to finished level)
G1 X0.00 Y0.00 F3000.00 (go home)
M18 (drives off)
