<?xml version="1.0" encoding="UTF-8" standalone="no"?>
<!-- Created with Inkscape (http://www.inkscape.org/) -->

<svg
   xmlns:dc="http://purl.org/dc/elements/1.1/"
   xmlns:cc="http://creativecommons.org/ns#"
   xmlns:rdf="http://www.w3.org/1999/02/22-rdf-syntax-ns#"
   xmlns:svg="http://www.w3.org/2000/svg"
   xmlns="http://www.w3.org/2000/svg"
   xmlns:sodipodi="http://sodipodi.sourceforge.net/DTD/sodipodi-0.dtd"
   xmlns:inkscape="http://www.inkscape.org/namespaces/inkscape"
   width="44mm"
   height="44mm"
   viewBox="0 0 44 44"
   version="1.1"
   id="svg8"
   inkscape:version="0.92.4 5da689c313, 2019-01-14"
   sodipodi:docname="expo_microaerogenerador.svg">
  <defs
     id="defs2" />
  <sodipodi:namedview
     id="base"
     pagecolor="#ffffff"
     bordercolor="#666666"
     borderopacity="1.0"
     inkscape:pageopacity="0.0"
     inkscape:pageshadow="2"
     inkscape:zoom="1.979899"
     inkscape:cx="-32.878535"
     inkscape:cy="95.31218"
     inkscape:document-units="mm"
     inkscape:current-layer="layer1"
     showgrid="true"
     units="mm"
     objecttolerance="1"
     guidetolerance="1"
     inkscape:window-width="1920"
     inkscape:window-height="1051"
     inkscape:window-x="0"
     inkscape:window-y="0"
     inkscape:window-maximized="1" />
  <metadata
     id="metadata5">
    <rdf:RDF>
      <cc:Work
         rdf:about="">
        <dc:format>image/svg+xml</dc:format>
        <dc:type
           rdf:resource="http://purl.org/dc/dcmitype/StillImage" />
        <dc:title />
      </cc:Work>
    </rdf:RDF>
  </metadata>
  <g
     inkscape:label="Layer 1"
     inkscape:groupmode="layer"
     id="layer1"
     transform="translate(0,-253)">
    <g
       id="g5741"
       transform="matrix(0.09032436,0,0,0.09032436,2.8658046,255.86585)"
       style="fill:none;stroke:#000000;stroke-width:1.10712106;stroke-miterlimit:4;stroke-dasharray:none">
      <g
         id="g5675"
         style="fill:none;stroke:#000000;stroke-width:1.10712106;stroke-miterlimit:4;stroke-dasharray:none">
        <g
           id="g5673"
           style="fill:none;stroke:#000000;stroke-width:1.10712106;stroke-miterlimit:4;stroke-dasharray:none">
          <path
             id="path5671"
             d="m 288.893,188.4 -110.08,-33.792 c -3.584,-1.024 -7.68,-1.024 -11.776,1.024 -0.512,0.512 -1.024,0.512 -1.536,1.024 -1.536,-3.072 -4.096,-6.144 -6.656,-8.192 0,-0.512 0.512,-0.512 0.512,-1.024 2.048,-3.584 3.072,-7.68 2.56,-11.264 L 142.461,23.024 c -1.024,-6.144 -6.656,-10.24 -12.8,-9.216 -6.144,0.512 -10.24,6.144 -9.728,12.288 l 9.216,114.176 c 0.512,3.584 2.048,7.168 4.608,10.24 -2.048,1.536 -3.584,4.096 -4.608,6.144 -0.512,-0.512 -1.536,-1.024 -2.048,-1.024 -3.584,-1.536 -7.68,-1.536 -11.776,0 L 7.293,195.568 c -5.632,2.048 -8.704,8.192 -6.656,14.336 1.536,4.608 6.144,8.192 10.752,8.192 1.024,0 2.048,0 3.072,-0.512 l 110.592,-29.696 c 3.072,-2.56 6.144,-4.608 8.192,-7.68 0.512,0.512 0.512,0.512 1.024,1.024 L 122.493,400.88 h -14.336 c -3.072,0 -5.12,2.048 -5.12,5.12 0,3.072 2.048,5.12 5.12,5.12 h 78.336 c 3.072,0 5.12,-2.048 5.12,-5.12 0,-3.072 -2.048,-5.12 -5.12,-5.12 H 172.157 L 159.869,181.232 c 0.512,-0.512 0.512,-0.512 1.024,-1.024 2.56,3.072 5.632,5.12 9.728,6.144 l 112.128,24.576 c 1.024,0 1.536,0 2.56,0 5.12,0 9.728,-3.584 11.264,-8.704 1.536,-5.632 -1.536,-11.776 -7.68,-13.824 z m -163.84,-14.848 c -0.512,1.536 -1.536,2.56 -3.072,3.072 L 11.389,206.32 c -0.512,0 -1.024,0 -1.536,-1.024 0,-0.512 0,-1.024 0.512,-1.536 l 107.52,-39.936 c 0.512,0 1.536,-0.512 2.048,-0.512 1.024,0 1.536,0 2.56,0.512 1.536,0.512 3.072,2.048 3.584,4.096 0.512,2.048 0.512,3.584 -1.024,5.632 z m 32.256,-8.704 c 0,5.632 -4.608,10.24 -10.24,10.24 -5.632,0 -10.24,-4.608 -10.24,-10.24 0,-5.632 4.608,-10.24 10.24,-10.24 5.632,0 10.24,4.608 10.24,10.24 z M 129.661,24.56 c 0,-0.512 0.512,-1.024 1.024,-1.024 0.512,0 1.024,0.512 1.536,1.024 l 19.456,113.152 c 0,1.536 0,3.072 -1.024,4.096 -1.024,1.536 -2.56,2.56 -4.608,3.072 -2.048,0 -3.584,-0.512 -5.12,-2.048 -1.024,-1.024 -1.536,-2.56 -2.048,-4.096 z m 31.744,376.32 h -28.672 l 11.776,-214.528 h 5.12 z M 284.285,201.2 172.157,176.624 c -1.536,-0.512 -2.56,-1.024 -3.584,-2.56 -1.024,-1.536 -1.536,-3.584 -1.024,-5.12 0.512,-2.048 1.536,-3.072 3.584,-4.096 1.536,-0.512 3.072,-0.512 4.096,-0.512 l 109.568,34.304 c 0.512,0 1.024,1.024 1.024,1.536 0,0.512 -1.024,1.024 -1.536,1.024 z"
             inkscape:connector-curvature="0"
             style="fill:none;stroke:#000000;stroke-width:1.10712106;stroke-miterlimit:4;stroke-dasharray:none" />
        </g>
      </g>
      <g
         id="g5681"
         style="fill:none;stroke:#000000;stroke-width:1.10712106;stroke-miterlimit:4;stroke-dasharray:none">
        <g
           id="g5679"
           style="fill:none;stroke:#000000;stroke-width:1.10712106;stroke-miterlimit:4;stroke-dasharray:none">
          <path
             id="path5677"
             d="m 420.989,186.352 -60.928,-64 c -2.56,-2.56 -5.632,-3.584 -9.216,-4.096 -0.512,0 -1.536,0 -2.048,0 0,-1.536 -0.512,-3.584 -1.024,-5.12 0.512,0 1.024,0 1.536,-0.512 3.072,-1.024 5.632,-3.584 7.168,-6.656 L 396.925,27.12 c 2.56,-4.608 0.512,-10.752 -4.096,-13.312 -4.608,-2.56 -10.24,-1.024 -13.312,3.072 l -46.592,75.776 c -1.536,2.56 -2.048,5.632 -2.048,9.216 -4.096,0 -8.192,2.048 -10.752,5.12 -2.56,-2.048 -5.12,-3.072 -8.192,-3.072 l -88.576,-2.048 c -5.12,0 -9.728,4.096 -9.728,9.216 -0.512,5.12 3.584,9.728 8.704,10.752 l 88.064,9.728 c 0.512,0 1.024,0 1.536,0 2.56,0 5.12,-1.024 7.68,-2.56 0.512,1.024 1.536,1.536 2.048,2.56 l -9.728,167.424 h -10.24 c -3.072,0 -5.12,2.048 -5.12,5.12 0,3.072 2.048,5.12 5.12,5.12 h 60.416 c 3.072,0 5.12,-2.048 5.12,-5.12 0,-3.072 -2.048,-5.12 -5.12,-5.12 h -10.24 l -8.704,-153.6 64,55.296 c 2.048,1.536 4.096,2.56 6.656,2.56 2.56,0 5.12,-1.024 7.168,-3.072 3.584,-4.096 3.584,-9.728 0,-13.824 z m -107.52,-66.048 c -0.512,0.512 -1.536,0.512 -2.56,0.512 l -88.064,-9.216 88.576,2.048 c 1.024,0 1.536,0.512 2.56,1.024 1.024,1.024 1.024,2.048 1.024,3.072 0,0.512 0,1.536 -1.536,2.56 z m 18.432,-8.192 c 3.584,0 6.656,3.072 6.656,6.656 0,3.584 -3.072,6.656 -6.656,6.656 -3.584,0 -6.656,-3.072 -6.656,-6.656 0,-4.096 3.072,-6.656 6.656,-6.656 z m -9.728,186.88 9.216,-162.816 h 1.536 l 9.216,162.816 z m 20.48,-196.096 c -0.512,-0.512 -1.536,-1.024 -2.048,-2.56 0.512,-1.024 0.512,-1.536 1.024,-2.56 l 46.592,-75.264 -40.448,78.848 c -0.512,1.024 -1.024,1.536 -2.048,1.536 -1.536,0.512 -2.56,0 -3.072,0 z m 5.12,32.256 c -0.512,-0.512 -1.024,-1.536 -1.024,-2.048 0,-1.536 0.512,-2.56 1.024,-3.072 0.512,-0.512 1.536,-1.024 3.072,-1.024 1.024,0 1.536,0.512 2.048,1.024 l 61.44,62.976 z"
             inkscape:connector-curvature="0"
             style="fill:none;stroke:#000000;stroke-width:1.10712106;stroke-miterlimit:4;stroke-dasharray:none" />
        </g>
      </g>
      <g
         id="g5683"
         style="fill:none;stroke:#000000;stroke-width:1.10712106;stroke-miterlimit:4;stroke-dasharray:none" />
      <g
         id="g5685"
         style="fill:none;stroke:#000000;stroke-width:1.10712106;stroke-miterlimit:4;stroke-dasharray:none" />
      <g
         id="g5687"
         style="fill:none;stroke:#000000;stroke-width:1.10712106;stroke-miterlimit:4;stroke-dasharray:none" />
      <g
         id="g5689"
         style="fill:none;stroke:#000000;stroke-width:1.10712106;stroke-miterlimit:4;stroke-dasharray:none" />
      <g
         id="g5691"
         style="fill:none;stroke:#000000;stroke-width:1.10712106;stroke-miterlimit:4;stroke-dasharray:none" />
      <g
         id="g5693"
         style="fill:none;stroke:#000000;stroke-width:1.10712106;stroke-miterlimit:4;stroke-dasharray:none" />
      <g
         id="g5695"
         style="fill:none;stroke:#000000;stroke-width:1.10712106;stroke-miterlimit:4;stroke-dasharray:none" />
      <g
         id="g5697"
         style="fill:none;stroke:#000000;stroke-width:1.10712106;stroke-miterlimit:4;stroke-dasharray:none" />
      <g
         id="g5699"
         style="fill:none;stroke:#000000;stroke-width:1.10712106;stroke-miterlimit:4;stroke-dasharray:none" />
      <g
         id="g5701"
         style="fill:none;stroke:#000000;stroke-width:1.10712106;stroke-miterlimit:4;stroke-dasharray:none" />
      <g
         id="g5703"
         style="fill:none;stroke:#000000;stroke-width:1.10712106;stroke-miterlimit:4;stroke-dasharray:none" />
      <g
         id="g5705"
         style="fill:none;stroke:#000000;stroke-width:1.10712106;stroke-miterlimit:4;stroke-dasharray:none" />
      <g
         id="g5707"
         style="fill:none;stroke:#000000;stroke-width:1.10712106;stroke-miterlimit:4;stroke-dasharray:none" />
      <g
         id="g5709"
         style="fill:none;stroke:#000000;stroke-width:1.10712106;stroke-miterlimit:4;stroke-dasharray:none" />
      <g
         id="g5711"
         style="fill:none;stroke:#000000;stroke-width:1.10712106;stroke-miterlimit:4;stroke-dasharray:none" />
    </g>
  </g>
</svg>
