<?xml version="1.0" encoding="UTF-8" standalone="no"?>
<!-- Created with Inkscape (http://www.inkscape.org/) -->

<svg
   xmlns:dc="http://purl.org/dc/elements/1.1/"
   xmlns:cc="http://creativecommons.org/ns#"
   xmlns:rdf="http://www.w3.org/1999/02/22-rdf-syntax-ns#"
   xmlns:svg="http://www.w3.org/2000/svg"
   xmlns="http://www.w3.org/2000/svg"
   xmlns:sodipodi="http://sodipodi.sourceforge.net/DTD/sodipodi-0.dtd"
   xmlns:inkscape="http://www.inkscape.org/namespaces/inkscape"
   width="44mm"
   height="44mm"
   viewBox="0 0 44 44"
   version="1.1"
   id="svg8"
   inkscape:version="0.92.4 5da689c313, 2019-01-14"
   sodipodi:docname="expo_cardiorespirometro.svg">
  <defs
     id="defs2" />
  <sodipodi:namedview
     id="base"
     pagecolor="#ffffff"
     bordercolor="#666666"
     borderopacity="1.0"
     inkscape:pageopacity="0.0"
     inkscape:pageshadow="2"
     inkscape:zoom="5.135322"
     inkscape:cx="83.149606"
     inkscape:cy="83.149606"
     inkscape:document-units="mm"
     inkscape:current-layer="layer1"
     showgrid="true"
     units="mm"
     objecttolerance="1"
     guidetolerance="1"
     inkscape:window-width="1920"
     inkscape:window-height="1051"
     inkscape:window-x="0"
     inkscape:window-y="0"
     inkscape:window-maximized="1" />
  <metadata
     id="metadata5">
    <rdf:RDF>
      <cc:Work
         rdf:about="">
        <dc:format>image/svg+xml</dc:format>
        <dc:type
           rdf:resource="http://purl.org/dc/dcmitype/StillImage" />
        <dc:title />
      </cc:Work>
    </rdf:RDF>
  </metadata>
  <g
     inkscape:label="Layer 1"
     inkscape:groupmode="layer"
     id="layer1"
     transform="translate(0,-253)">
    <path
       style="display:inline;opacity:1;fill:none;stroke-width:0.03705085;stroke:#000000"
       d="m 15.796517,292.9986 c -0.03925,0.004 -0.07136,-9.5e-4 -0.07136,-0.0111 0,-0.01 -0.119263,-0.13721 -0.265029,-0.28261 -0.145766,-0.1454 -0.265029,-0.27248 -0.265029,-0.28239 0,-0.01 -0.144294,-0.17404 -0.320651,-0.36469 -0.176358,-0.19066 -0.35984,-0.38925 -0.407738,-0.44133 -0.0479,-0.0521 -0.08708,-0.11211 -0.08708,-0.13341 0,-0.0213 -0.02709,-0.0592 -0.0602,-0.0843 -0.08603,-0.0651 -0.469866,-0.46869 -0.469866,-0.49406 0,-0.0117 -0.110089,-0.12944 -0.244642,-0.2617 -0.134553,-0.13225 -0.244642,-0.25628 -0.244642,-0.27562 0,-0.0193 -0.03461,-0.0572 -0.0769,-0.0841 -0.04229,-0.0269 -0.09013,-0.0772 -0.106314,-0.11175 -0.01618,-0.0345 -0.138602,-0.18781 -0.272048,-0.34064 -0.345812,-0.39606 -0.363865,-0.41602 -0.422392,-0.46687 -0.02899,-0.0252 -0.05345,-0.0529 -0.05436,-0.0614 -9.18e-4,-0.009 -0.05848,-0.0803 -0.12794,-0.15937 -0.174162,-0.19824 -0.210109,-0.24077 -0.24659,-0.29184 -0.06105,-0.0854 -0.208922,-0.25275 -0.262561,-0.29703 -0.150127,-0.12398 -0.190733,-0.16194 -0.285407,-0.26683 -0.05645,-0.0625 -0.102628,-0.13379 -0.102628,-0.15832 0,-0.0245 -0.02441,-0.0508 -0.05426,-0.0583 -0.06605,-0.0166 -0.190392,-0.19792 -0.190392,-0.2776 0,-0.0318 -0.018,-0.0447 -0.04,-0.0287 -0.022,0.016 -0.0524,-0.004 -0.06755,-0.0434 -0.01515,-0.0399 -0.105643,-0.14773 -0.201096,-0.23962 -0.09545,-0.0919 -0.186196,-0.20542 -0.201652,-0.25228 -0.01545,-0.0469 -0.08127,-0.13497 -0.146257,-0.19581 -0.06499,-0.0608 -0.118156,-0.12808 -0.118156,-0.14941 0,-0.0213 -0.02542,-0.0605 -0.05649,-0.0871 -0.03106,-0.0265 -0.09262,-0.0901 -0.136802,-0.14127 -0.04418,-0.0512 -0.137023,-0.15782 -0.2063318,-0.23698 -0.06931,-0.0792 -0.1653094,-0.22139 -0.2133382,-0.31605 -0.048032,-0.0946 -0.1407641,-0.22387 -0.2060805,-0.28715 -0.065321,-0.0633 -0.1187585,-0.13823 -0.1187585,-0.16656 0,-0.0283 -0.033992,-0.0796 -0.075553,-0.11383 -0.041552,-0.0343 -0.09818,-0.10648 -0.1258373,-0.16041 -0.027663,-0.0539 -0.076225,-0.12692 -0.1079329,-0.16219 -0.031708,-0.0352 -0.057647,-0.086 -0.057647,-0.11278 0,-0.0268 -0.025522,-0.0741 -0.05671,-0.10513 -0.1754767,-0.17473 -0.1883969,-0.19501 -0.7533563,-1.18222 -0.093506,-0.16339 -0.2155419,-0.33578 -0.2711904,-0.3831 -0.055649,-0.0473 -0.1011782,-0.12275 -0.1011782,-0.16764 0,-0.0449 -0.037251,-0.12627 -0.082772,-0.18082 -0.045521,-0.0546 -0.1008883,-0.15565 -0.1230283,-0.22466 -0.02214,-0.069 -0.056501,-0.14394 -0.076349,-0.16652 -0.057439,-0.0654 -0.1968351,-0.28219 -0.2506438,-0.3899 -0.027133,-0.0543 -0.063294,-0.11889 -0.080346,-0.1435 -0.07614,-0.10991 -0.1200707,-0.19252 -0.1613561,-0.30339 -0.024414,-0.0656 -0.060291,-0.13792 -0.07974,-0.1608 -0.073914,-0.087 -0.2913921,-0.5443 -0.3459539,-0.72753 -0.03132,-0.10517 -0.096541,-0.26843 -0.1449448,-0.36281 -0.1230501,-0.23993 -0.2458179,-0.53429 -0.2854369,-0.68441 -0.018445,-0.0699 -0.079873,-0.25244 -0.136499,-0.40565 -0.056624,-0.15321 -0.1576282,-0.46602 -0.2244491,-0.69513 -0.1062172,-0.3642 -0.1698928,-0.61161 -0.3320314,-1.29018 -0.020728,-0.0868 -0.047274,-0.24166 -0.058983,-0.34423 -0.0117,-0.10258 -0.056767,-0.42583 -0.10012,-0.71831 -0.067936,-0.45833 -0.1009849,-1.02255 -0.1021312,-1.74373 -1.156e-4,-0.10175 0.012524,-0.33822 0.028184,-0.52553 0.01566,-0.18732 0.038387,-0.47658 0.050495,-0.64278 0.012107,-0.16622 0.048259,-0.47283 0.080328,-0.68134 0.1058392,-0.68816 0.1911461,-1.24743 0.2231643,-1.46305 0.043503,-0.29296 0.1149539,-0.58394 0.2515647,-1.02445 0.063919,-0.20613 0.1162262,-0.39164 0.1162262,-0.41224 0,-0.0496 0.4383624,-1.1058 0.4823061,-1.16211 0.018796,-0.0241 0.1010077,-0.17503 0.1826842,-0.33543 0.081673,-0.16039 0.2815205,-0.50011 0.4440968,-0.75495 0.4289465,-0.67235 1.2132325,-1.5963 1.5871945,-1.8698 0.058936,-0.0431 0.177631,-0.154 0.2637772,-0.24643 0.1792879,-0.19237 1.0561116,-0.84151 1.4435076,-1.06867 0.506257,-0.29685 1.040971,-0.55107 1.496198,-0.71132 0.09408,-0.0331 0.182187,-0.0683 0.195798,-0.0783 0.07336,-0.0534 0.728526,-0.23308 1.071953,-0.29398 1.267238,-0.2247 2.283135,-0.18642 3.256243,0.12272 0.814145,0.25864 1.181337,0.45194 1.919049,1.01021 0.401528,0.30386 0.95963,0.92143 1.11031,1.22861 0.02677,0.0546 0.06506,0.11762 0.08508,0.14008 0.09993,0.11209 0.56952,1.10406 0.56952,1.20306 0,0.0926 0.109882,0.0414 0.26207,-0.12186 0.08078,-0.0867 0.341727,-0.32566 0.579883,-0.53107 0.375609,-0.32399 0.491269,-0.41056 0.87253,-0.6531 0.528458,-0.33619 1.136979,-0.63523 1.643239,-0.80751 0.498858,-0.16978 1.371399,-0.31738 1.922482,-0.32524 0.409804,-0.006 1.250458,0.071 1.54981,0.14161 0.999539,0.23586 1.889739,0.72023 2.606913,1.41849 0.415627,0.40465 0.413726,0.40249 0.686215,0.77982 0.663149,0.91834 1.074669,2.01761 1.322259,3.53207 0.0872,0.53338 0.09883,2.52449 0.01841,3.15138 -0.128994,1.00541 -0.267281,1.64957 -0.550192,2.56279 -0.732256,2.36367 -1.961435,4.51024 -3.95348,6.90412 -0.24217,0.29103 -0.451806,0.5375 -0.465857,0.54773 -0.01405,0.0102 -0.164534,0.17442 -0.334395,0.36485 -0.169859,0.19044 -0.345543,0.38688 -0.39039,0.43654 -0.274788,0.30429 -1.319312,1.34395 -1.692113,1.68423 -0.145772,0.13306 -0.310896,0.29024 -0.366963,0.3493 -0.05607,0.0591 -0.257895,0.2441 -0.448512,0.41117 -0.836571,0.73326 -1.299795,1.13253 -1.50863,1.30035 -0.123343,0.0991 -0.306825,0.25448 -0.407738,0.34523 -0.100913,0.0908 -0.453118,0.37795 -0.782662,0.6382 -0.329555,0.26025 -0.641472,0.51073 -0.693156,0.55661 -0.05169,0.0458 -0.31415,0.25248 -0.583257,0.45909 -0.269107,0.20663 -0.670125,0.5214 -0.89115,0.69949 -0.644566,0.51939 -2.681713,1.99092 -2.768294,1.99969 z m -1.763466,-6.43425 c 0.201831,-0.21726 0.376139,-0.41066 0.387352,-0.42978 0.01121,-0.0191 0.08461,-0.1025 0.163095,-0.18532 0.07849,-0.0828 0.151882,-0.16604 0.163095,-0.18495 0.0375,-0.0633 1.185641,-1.3356 1.242679,-1.37712 0.03094,-0.0226 0.0805,-0.0785 0.110137,-0.12441 0.02963,-0.046 0.163968,-0.20582 0.298521,-0.35536 0.134554,-0.14955 0.290513,-0.32434 0.346579,-0.38844 0.05607,-0.064 0.193673,-0.22153 0.3058,-0.34988 0.11213,-0.12836 0.277263,-0.31388 0.366965,-0.41228 0.08971,-0.0984 0.190616,-0.21656 0.224255,-0.26258 0.03364,-0.046 0.152903,-0.17783 0.26503,-0.29291 0.112129,-0.11508 0.231392,-0.24678 0.265029,-0.29268 0.03364,-0.0459 0.107031,-0.13378 0.163095,-0.19529 0.298655,-0.32766 1.017804,-1.13442 1.141666,-1.28075 0.183942,-0.21731 0.957486,-1.09509 1.325146,-1.50373 0.156979,-0.17447 0.312939,-0.35548 0.346578,-0.40225 0.03364,-0.0468 0.244643,-0.2874 0.468898,-0.53476 0.224256,-0.24735 0.605909,-0.67119 0.848128,-0.94188 0.242206,-0.27068 0.455832,-0.5034 0.474723,-0.51714 0.04041,-0.0294 0.08384,-0.14459 0.08384,-0.22228 0,-0.0559 -0.290116,-0.0852 -2.4256,-0.24453 -1.825503,-0.13628 -1.774101,-0.12943 -1.774101,-0.23615 0,-0.0577 0.04095,-0.15455 0.106935,-0.25296 0.05881,-0.0877 0.176588,-0.2874 0.261719,-0.44377 0.08513,-0.15635 0.179473,-0.32351 0.209647,-0.37145 0.03017,-0.0479 0.118557,-0.20171 0.196403,-0.34171 0.131649,-0.23676 0.466623,-0.81796 0.668632,-1.16012 0.04794,-0.0812 0.13243,-0.2336 0.187766,-0.33869 0.129039,-0.24505 0.191198,-0.35504 0.369192,-0.6532 0.127485,-0.21356 0.336551,-0.57864 0.52768,-0.92146 0.03364,-0.0604 0.117194,-0.20494 0.185687,-0.32133 0.06849,-0.11641 0.280288,-0.48411 0.470662,-0.81713 0.190375,-0.33302 0.496711,-0.86842 0.680751,-1.18979 0.18404,-0.32137 0.334627,-0.59386 0.334627,-0.60553 0,-0.0458 -0.137651,0.0851 -0.5996,0.57009 -0.264496,0.27769 -0.627687,0.65397 -0.807097,0.83616 -0.17941,0.1822 -0.454627,0.46607 -0.611607,0.63083 -0.15698,0.16476 -0.432197,0.44819 -0.611606,0.62986 -0.179405,0.18166 -0.491323,0.50432 -0.693153,0.71701 -0.201831,0.2127 -0.431183,0.4477 -0.509672,0.52223 -0.07849,0.0745 -0.280319,0.28123 -0.448511,0.45937 -0.168193,0.17812 -0.599374,0.62424 -0.958183,0.99137 -0.358811,0.36713 -0.80834,0.83191 -0.998959,1.03284 -0.364304,0.38403 -0.68656,0.71511 -1.060117,1.08911 -0.212656,0.21291 -0.465349,0.48133 -0.621247,0.6599 -0.03894,0.0446 -0.09838,0.10118 -0.132085,0.12572 -0.03371,0.0245 -0.176154,0.16421 -0.31655,0.3104 -0.140397,0.14617 -0.3897,0.40521 -0.554008,0.57564 -0.164309,0.17041 -0.304976,0.33153 -0.312592,0.35803 -0.08228,0.28624 -0.09443,0.27743 0.440619,0.31926 0.278429,0.0218 0.586703,0.0393 0.685051,0.039 0.09835,-2.7e-4 0.464954,0.0206 0.814673,0.0466 1.08919,0.0808 2.135363,0.14377 2.245922,0.13509 0.219676,-0.0172 0.187493,0.10991 -0.189334,0.74794 -0.122256,0.207 -0.274852,0.47269 -0.430474,0.74951 -0.04405,0.0784 -0.176534,0.30779 -0.294398,0.50983 -0.198548,0.34034 -0.391714,0.67781 -0.837688,1.46344 -0.246538,0.4343 -0.565187,0.98293 -0.803692,1.38375 -0.112129,0.18843 -0.255097,0.4288 -0.317709,0.53416 -0.06261,0.10535 -0.236264,0.41265 -0.385889,0.6829 -0.149624,0.27024 -0.283444,0.50721 -0.297381,0.52662 -0.01394,0.0194 -0.04211,0.0722 -0.06262,0.11726 -0.02051,0.0451 -0.149407,0.26771 -0.286438,0.49471 -0.13703,0.22698 -0.337916,0.56823 -0.446413,0.75832 -0.108494,0.19009 -0.221144,0.38301 -0.250331,0.42873 -0.09615,0.1506 -0.06495,0.2814 0.05907,0.24766 0.131992,-0.0359 0.128981,-0.0333 0.601411,-0.54175 z M 35.07165,266.95191 c -0.176034,-0.0246 -0.708576,-0.0952 -1.183428,-0.15693 -1.280801,-0.16641 -1.20459,-0.14701 -1.181894,-0.30114 0.01068,-0.0726 0.09501,-0.81947 0.187357,-1.65971 l 0.1679,-1.5277 -0.110324,-0.0279 c -0.06067,-0.0153 -0.380355,-0.0668 -0.710409,-0.11425 -2.065993,-0.29715 -1.959462,-0.27533 -1.959462,-0.40128 0,-0.10853 0.288525,-2.50707 0.350662,-2.9151 0.01507,-0.0989 0.04097,-0.18975 0.05757,-0.20184 0.03194,-0.0232 0.913502,0.10003 1.629445,0.22783 0.583875,0.10424 1.029254,0.15975 1.066175,0.13288 0.01691,-0.0123 0.04046,-0.0939 0.05235,-0.1812 0.04934,-0.36245 0.15024,-1.26806 0.209207,-1.87778 0.03468,-0.35855 0.07005,-0.68732 0.07858,-0.73057 0.0086,-0.0433 0.01694,-0.0986 0.01864,-0.12299 0.0017,-0.0245 0.02877,-0.063 0.06013,-0.0858 0.05539,-0.0403 0.89815,0.0716 1.308915,0.17392 0.112135,0.0279 0.334359,0.0703 0.493845,0.0942 0.49734,0.0744 0.728093,0.11747 0.763774,0.14263 0.01899,0.0134 0.01485,0.22956 -0.0093,0.48267 -0.02401,0.25212 -0.08052,0.84885 -0.12557,1.32607 -0.04506,0.47721 -0.09307,0.95275 -0.106705,1.05675 -0.02384,0.18192 -0.01825,0.19063 0.147442,0.22935 0.18244,0.0426 0.954299,0.17185 1.160858,0.19432 0.06743,0.008 0.260076,0.0421 0.428126,0.0771 0.168037,0.0351 0.314715,0.0647 0.325924,0.0658 0.01127,9.4e-4 0.127577,0.0189 0.258578,0.0398 l 0.23818,0.0377 -0.02714,0.34728 c -0.0253,0.3239 -0.156551,1.81385 -0.212523,2.41273 -0.03087,0.33021 -0.08957,0.40398 -0.291462,0.36626 -0.22225,-0.0415 -1.06056,-0.17063 -1.311179,-0.20197 -0.123343,-0.0154 -0.387688,-0.0559 -0.587437,-0.0899 -0.319879,-0.0545 -0.47158,-0.0406 -0.473158,0.0434 0,0.0139 -0.02688,0.27964 -0.05912,0.59014 -0.03225,0.31049 -0.09633,0.93287 -0.14243,1.38307 -0.104672,1.02242 -0.124386,1.16792 -0.161958,1.19527 -0.01658,0.012 -0.174175,0.002 -0.35022,-0.0228 z"
       id="path5586"
       inkscape:connector-curvature="0"
       sodipodi:nodetypes="cscscsscscsccsccccccssssccscscccscssccscccscccccccscsccccccscccsscccccscsscsccsccscccccscccscccssccccsccccccscsccscscccccccssssccccccccssssccsccccscccscscccccccccccccccccccccccccsscscsccccsccccsccccccccccsccscscc" />
  </g>
</svg>
