$date
  Fri Dec 04 20:06:15 2020
$end
$version
  GHDL v0
$end
$timescale
  1 fs
$end
$scope module standard $end
$upscope $end
$scope module textio $end
$upscope $end
$scope module std_logic_1164 $end
$upscope $end
$scope module numeric_std $end
$upscope $end
$scope module vga_term_tb $end
$var reg 1 ! v_sync_out $end
$var reg 1 " h_sync_out $end
$var reg 12 # vga_data_out[11:0] $end
$var reg 8 $ data_sel_in[7:0] $end
$var reg 1 % clk_in $end
$scope module uut $end
$var reg 1 & v_sync $end
$var reg 1 ' h_sync $end
$var reg 12 ( vga_data[11:0] $end
$var reg 8 ) data_sel[7:0] $end
$var reg 1 * clk $end
$var reg 11 + hcount[10:0] $end
$var reg 11 , vcount[10:0] $end
$var reg 1 - hsync $end
$var reg 1 . vsync $end
$var reg 6 / comp[5:0] $end
$var reg 12 0 colour[11:0] $end
$var reg 8 1 font_rom_reg[7:0] $end
$upscope $end
$upscope $end
$enddefinitions $end
#0
U!
U"
bUUUUUUUUUUUU #
b01001101 $
0%
U&
U'
bUUUUUUUUUUUU (
b01001101 )
0*
bUUUUUUUUUUU +
bUUUUUUUUUUU ,
U-
U.
bUUUUUU /
bUUUUUUUUUUUU 0
bUUUUUUUU 1
#5000000
b000000000000 #
1%
b000000000000 (
1*
bXXXXXXXXXXX +
b0UUUUUUU 1
#10000000
0%
0*
#15000000
1%
1*
b00UUUUUU 1
#20000000
0%
0*
#25000000
1%
1*
b000UUUUU 1
#30000000
0%
0*
#35000000
1%
1*
b0000UUUU 1
#40000000
0%
0*
#45000000
1%
1*
b00000UUU 1
#50000000
0%
0*
#55000000
1%
1*
b000000UU 1
#60000000
0%
0*
#65000000
1%
1*
b0000000U 1
#70000000
0%
0*
#75000000
1%
1*
b00000000 1
#80000000
0%
0*
#85000000
1%
1*
#90000000
0%
0*
#95000000
1%
1*
#100000000
