{
	"info": {
		"_postman_id": "1e6577a9-9593-4cb9-89fc-c2ecce4257da",
		"name": "Resync Test",
		"schema": "https://schema.getpostman.com/json/collection/v2.1.0/collection.json"
	},
	"item": [
		{
			"name": "GET USERS ALL",
			"request": {
				"method": "GET",
				"header": [],
				"url": {
					"raw": "http://0.0.0.0:5000/users",
					"protocol": "http",
					"host": [
						"0",
						"0",
						"0",
						"0"
					],
					"port": "5000",
					"path": [
						"users"
					],
					"query": [
						{
							"key": "userid",
							"value": "resync",
							"disabled": true
						},
						{
							"key": "username",
							"value": "resync user",
							"disabled": true
						},
						{
							"key": "userdesc",
							"value": "to create user for resync",
							"disabled": true
						},
						{
							"key": "updatefield",
							"value": "adescription",
							"disabled": true
						},
						{
							"key": "updateval",
							"value": "Update resycn test",
							"disabled": true
						}
					]
				}
			},
			"response": []
		},
		{
			"name": "GET USER SINGLE",
			"request": {
				"method": "GET",
				"header": [],
				"url": {
					"raw": "http://0.0.0.0:5000/users?userid=resync",
					"protocol": "http",
					"host": [
						"0",
						"0",
						"0",
						"0"
					],
					"port": "5000",
					"path": [
						"users"
					],
					"query": [
						{
							"key": "userid",
							"value": "resync"
						}
					]
				}
			},
			"response": []
		},
		{
			"name": "POST USER",
			"request": {
				"method": "POST",
				"header": [],
				"url": {
					"raw": "http://0.0.0.0:5000/users?userid=New User&username=New Resync User&userdesc=New Description",
					"protocol": "http",
					"host": [
						"0",
						"0",
						"0",
						"0"
					],
					"port": "5000",
					"path": [
						"users"
					],
					"query": [
						{
							"key": "userid",
							"value": "New User"
						},
						{
							"key": "username",
							"value": "New Resync User"
						},
						{
							"key": "userdesc",
							"value": "New Description"
						}
					]
				}
			},
			"response": []
		},
		{
			"name": "UPDATE USER",
			"request": {
				"method": "PATCH",
				"header": [],
				"url": {
					"raw": "http://0.0.0.0:5000/users?userid=resync&updatefield=description&updateval=New resycn test",
					"protocol": "http",
					"host": [
						"0",
						"0",
						"0",
						"0"
					],
					"port": "5000",
					"path": [
						"users"
					],
					"query": [
						{
							"key": "userid",
							"value": "resync"
						},
						{
							"key": "username",
							"value": "resync user",
							"disabled": true
						},
						{
							"key": "userdesc",
							"value": "to create user for resync",
							"disabled": true
						},
						{
							"key": "updatefield",
							"value": "description"
						},
						{
							"key": "updateval",
							"value": "New resycn test"
						}
					]
				}
			},
			"response": []
		},
		{
			"name": "DELETE USER",
			"request": {
				"method": "DELETE",
				"header": [],
				"url": {
					"raw": "http://0.0.0.0:5000/users?userid=resync",
					"protocol": "http",
					"host": [
						"0",
						"0",
						"0",
						"0"
					],
					"port": "5000",
					"path": [
						"users"
					],
					"query": [
						{
							"key": "userid",
							"value": "resync"
						},
						{
							"key": "updatefield",
							"value": "description",
							"disabled": true
						},
						{
							"key": "updateval",
							"value": "New resycn test",
							"disabled": true
						}
					]
				}
			},
			"response": []
		}
	]
}