<?xml version="1.0" encoding="utf-8"?>
<!-- Generator: Adobe Illustrator 26.3.1, SVG Export Plug-In . SVG Version: 6.00 Build 0)  -->
<svg version="1.1" id="Layer_1" xmlns="http://www.w3.org/2000/svg" xmlns:xlink="http://www.w3.org/1999/xlink" x="0px" y="0px"
	 viewBox="0 0 240 240" style="enable-background:new 0 0 240 240;" xml:space="preserve">
<style type="text/css">
	.st0{fill:#69C9CA;}
	.st1{opacity:0.9;fill:#FFFFFF;enable-background:new    ;}
	.st2{fill:#66CCCC;}
	.st3{opacity:0.4;fill:#FAFAFA;enable-background:new    ;}
	.st4{fill:#FFFFFF;}
	.st5{opacity:0.7;fill:#66CCCC;enable-background:new    ;}
	.st6{opacity:0.6;fill:#66CCCC;enable-background:new    ;}
	.st7{opacity:0.5;fill:#66CCCC;enable-background:new    ;}
	.st8{fill:#263238;}
	.st9{opacity:0.7;fill:#FFFFFF;enable-background:new    ;}
	.st10{opacity:0.6;fill:#FFFFFF;enable-background:new    ;}
	.st11{opacity:0.6;}
	.st12{opacity:0.2;enable-background:new    ;}
	.st13{opacity:0.4;fill:#66CCCC;enable-background:new    ;}
	.st14{opacity:0.3;fill:#66CCCC;enable-background:new    ;}
</style>
<g id="freepik--background-simple--inject-31">
	<path class="st0" d="M153.9,108.4c-11.8-12.3-18.4-26-34.6-35.2c-12.7-7.1-27.3-13-45.5-8.4c-17.3,4.4-32.5,14-36.9,29.4
		c-4.4,15.2,1.3,32.8,11.2,42.8c5.3,5.4,12.8,8.3,19.6,12.2c7.5,4.3,12.1,10.2,15.7,17.3c6.5,12.4,11.4,25.2,27.7,30
		c16,4.7,34.2-0.9,51.8-6.2c16.1-4.8,40.1-7.8,48.7-23.7c8.1-15,0.4-34.4-12-41.9C185.7,116.3,165.3,120.2,153.9,108.4z"/>
	<path class="st1" d="M153.9,108.4c-11.8-12.3-18.4-26-34.6-35.2c-12.7-7.1-27.3-13-45.5-8.4c-17.3,4.4-32.5,14-36.9,29.4
		c-4.4,15.2,1.3,32.8,11.2,42.8c5.3,5.4,12.8,8.3,19.6,12.2c7.5,4.3,12.1,10.2,15.7,17.3c6.5,12.4,11.4,25.2,27.7,30
		c16,4.7,34.2-0.9,51.8-6.2c16.1-4.8,40.1-7.8,48.7-23.7c8.1-15,0.4-34.4-12-41.9C185.7,116.3,165.3,120.2,153.9,108.4z"/>
</g>
<g id="freepik--Smartphone--inject-185">
	<path class="st2" d="M160.6,88.3c0.8,0,1.4-0.6,1.4-1.4c0,0,0-0.1,0-0.1l-0.4-8.6c0-0.8-0.7-1.5-1.6-1.5h-1.2l-1.1-21.3
		c-0.3-4.7-4.2-8.4-8.9-8.5H82.2c-4.4,0-8,3.5-8.1,8c0,0.2,0,0.3,0,0.5l1.1,21.4c-0.6,0.2-1,0.8-1,1.5l1,20.6c0,0.7,0.5,1.3,1.2,1.5
		l4.5,90.7c0.3,4.7,4.2,8.4,8.9,8.5h66.8c4.4,0,8-3.5,8.1-8c0-0.2,0-0.3,0-0.5l-4.3-87.4h1.2c0.8,0,1.4-0.6,1.4-1.4c0,0,0-0.1,0-0.1
		l-0.4-8.6c-0.1-0.8-0.7-1.5-1.6-1.5h-1.2l-0.2-3.7L160.6,88.3z"/>
	<path class="st2" d="M91.1,199.6h66.8c4.4,0,8-3.5,8.1-8c0-0.2,0-0.3,0-0.5l-6.7-135.7c-0.3-4.7-4.2-8.4-8.9-8.5H83.6
		c-4.4,0-8,3.5-8.1,8c0,0.2,0,0.3,0,0.5l6.7,135.7C82.5,195.8,86.4,199.5,91.1,199.6z"/>
	<path class="st3" d="M91.1,199.6h66.8c4.4,0,8-3.5,8.1-8c0-0.2,0-0.3,0-0.5l-6.7-135.7c-0.3-4.7-4.2-8.4-8.9-8.5H83.6
		c-4.4,0-8,3.5-8.1,8c0,0.2,0,0.3,0,0.5l6.7,135.7C82.5,195.8,86.4,199.5,91.1,199.6z"/>
	<path class="st4" d="M85.6,187.7h76.6c0.7,0,1.3-0.5,1.3-1.2c0,0,0-0.1,0-0.1l-6.3-126c0-0.7-0.7-1.3-1.4-1.3H79.3
		c-0.7,0-1.2,0.5-1.3,1.2c0,0,0,0.1,0,0.1l6.2,126C84.3,187.2,84.9,187.8,85.6,187.7z"/>
	<path class="st5" d="M125.2,50.9h-16.1c-0.5,0-1,0.4-1,1c0,0,0,0,0,0.1l0,0c0,0.6,0.5,1,1.1,1.1h16.1c0.5,0,1-0.4,1-1
		c0,0,0,0,0-0.1l0,0C126.3,51.3,125.8,50.9,125.2,50.9z"/>
	<polygon class="st6" points="184.1,161.5 117.1,161.5 112.4,64.4 179.3,64.4 	"/>
	<path class="st4" d="M176.2,135C176.2,135,176.1,135,176.2,135c-0.1,0-0.1,0-0.2-0.1c0,0,0,0-0.1-0.1c0,0,0-0.1,0-0.1
		c0-0.1,0.1-0.2,0.2-0.2c0.1,0,0.2,0.1,0.2,0.2c0,0,0,0.1,0,0.1c0,0,0,0.1-0.1,0.1c0,0,0,0-0.1,0.1C176.3,135,176.2,135,176.2,135z"
		/>
	<path class="st4" d="M176.8,153.1c0-0.1,0.1-0.2,0.2-0.2c0,0,0,0,0,0l0,0c0.1,0,0.2,0.1,0.3,0.2l0,0c0,0.1-0.1,0.2-0.2,0.3
		c0,0,0,0,0,0l0,0C177,153.3,176.9,153.2,176.8,153.1z M176.8,151.3c0-0.1,0.1-0.2,0.2-0.3c0,0,0,0,0,0l0,0c0.1,0,0.2,0.1,0.2,0.2
		c0,0,0,0,0,0l0,0c0,0.1-0.1,0.2-0.2,0.2c0,0,0,0,0,0l0,0C176.9,151.5,176.8,151.4,176.8,151.3L176.8,151.3z M176.7,149.4
		c0-0.1,0.1-0.2,0.2-0.2c0,0,0,0,0,0l0,0c0.1,0,0.2,0.1,0.2,0.2c0,0,0,0,0,0l0,0c0,0.1-0.1,0.2-0.2,0.3c0,0,0,0,0,0l0,0
		C176.8,149.7,176.7,149.6,176.7,149.4L176.7,149.4z M176.6,147.6c0-0.1,0.1-0.2,0.2-0.2l0,0c0.1,0,0.2,0.1,0.3,0.2l0,0
		c0,0.1-0.1,0.2-0.2,0.3l0,0C176.7,147.8,176.6,147.7,176.6,147.6C176.6,147.6,176.6,147.6,176.6,147.6L176.6,147.6z M176.5,145.8
		c0-0.1,0.1-0.2,0.2-0.3c0,0,0,0,0,0l0,0c0.1,0,0.2,0.1,0.2,0.2c0,0,0,0,0,0l0,0c0,0.1-0.1,0.2-0.2,0.2c0,0,0,0,0,0l0,0
		C176.6,146,176.5,145.9,176.5,145.8L176.5,145.8z M176.4,143.9c0-0.1,0.1-0.2,0.2-0.2c0,0,0,0,0,0l0,0c0.1,0,0.2,0.1,0.3,0.2
		c0,0,0,0,0,0l0,0c0,0.1-0.1,0.2-0.2,0.3l0,0C176.5,144.2,176.4,144.1,176.4,143.9L176.4,143.9z M176.3,142.1c0-0.1,0.1-0.2,0.2-0.2
		l0,0c0.1,0,0.2,0.1,0.2,0.2c0,0,0,0,0,0l0,0c0,0.1-0.1,0.2-0.2,0.3l0,0C176.4,142.3,176.3,142.2,176.3,142.1
		C176.3,142.1,176.3,142.1,176.3,142.1L176.3,142.1z M176.2,140.3c0-0.1,0.1-0.2,0.2-0.3c0,0,0,0,0,0l0,0c0.1,0,0.2,0.1,0.2,0.2
		c0,0,0,0,0,0l0,0c0,0.1-0.1,0.2-0.2,0.2c0,0,0,0,0,0l0,0C176.3,140.5,176.2,140.4,176.2,140.3C176.2,140.3,176.2,140.3,176.2,140.3
		L176.2,140.3z M176.1,138.4c0-0.1,0.1-0.2,0.2-0.2c0,0,0,0,0,0l0,0c0.1,0,0.2,0.1,0.3,0.2l0,0c0,0.1-0.1,0.2-0.2,0.3l0,0
		C176.2,138.6,176.1,138.5,176.1,138.4L176.1,138.4z M176,136.6c0-0.1,0.1-0.2,0.2-0.3c0,0,0,0,0,0l0,0c0.1,0,0.2,0.1,0.2,0.2
		c0,0,0,0,0,0l0,0c0,0.1-0.1,0.2-0.2,0.3l0,0C176.2,136.8,176,136.7,176,136.6L176,136.6z"/>
	<path class="st4" d="M177.2,155.2c-0.1,0-0.1,0-0.2-0.1c0,0-0.1-0.1-0.1-0.2c0,0,0-0.1,0-0.1c0,0,0-0.1,0.1-0.1c0,0,0,0,0.1-0.1
		c0.1,0,0.1,0,0.2,0c0,0,0.1,0,0.1,0.1c0,0,0,0,0,0.1c0,0,0,0.1,0,0.1c0,0.1,0,0.1-0.1,0.2C177.3,155.1,177.3,155.1,177.2,155.2
		C177.2,155.2,177.2,155.2,177.2,155.2z"/>
	<path class="st4" d="M175,154.9c0-0.1,0.1-0.2,0.2-0.2c0,0,0,0,0,0l0,0c0.1,0,0.2,0.1,0.2,0.2l0,0l0,0c0,0.1-0.1,0.2-0.2,0.2l0,0
		C175.1,155.2,175,155.1,175,154.9L175,154.9z M173,154.9c0-0.1,0.1-0.2,0.2-0.2c0,0,0,0,0,0l0,0c0.1,0,0.2,0.1,0.2,0.2l0,0l0,0
		c0,0.1-0.1,0.2-0.2,0.2c0,0,0,0,0,0l0,0C173.2,155.2,173.1,155.1,173,154.9L173,154.9z M171.1,154.9c0-0.1,0.1-0.2,0.2-0.2l0,0l0,0
		c0.1,0,0.2,0.1,0.2,0.2c0,0,0,0,0,0l0,0c0,0.1-0.1,0.2-0.2,0.2h0l0,0C171.2,155.2,171.1,155.1,171.1,154.9
		C171.1,154.9,171.1,154.9,171.1,154.9z M169.2,154.9c0-0.1,0.1-0.2,0.2-0.2c0,0,0,0,0,0l0,0c0.1,0,0.2,0.1,0.2,0.2l0,0l0,0
		c0,0.1-0.1,0.2-0.2,0.2c0,0,0,0,0,0l0,0C169.3,155.2,169.2,155.1,169.2,154.9C169.2,154.9,169.2,154.9,169.2,154.9L169.2,154.9z
		 M167.2,154.9c0-0.1,0.1-0.2,0.2-0.2l0,0l0,0c0.1,0,0.2,0.1,0.2,0.2c0,0,0,0,0,0l0,0c0,0.1-0.1,0.2-0.2,0.2h0l0,0
		C167.3,155.2,167.2,155.1,167.2,154.9C167.2,154.9,167.2,154.9,167.2,154.9L167.2,154.9z M165.3,154.9c0-0.1,0.1-0.2,0.2-0.2
		c0,0,0,0,0,0l0,0c0.1,0,0.2,0.1,0.2,0.2l0,0l0,0c0,0.1-0.1,0.2-0.2,0.2c0,0,0,0,0,0l0,0C165.4,155.2,165.3,155.1,165.3,154.9
		C165.3,154.9,165.3,154.9,165.3,154.9L165.3,154.9z M163.3,154.9c0-0.1,0.1-0.2,0.2-0.2c0,0,0,0,0,0l0,0c0.1,0,0.2,0.1,0.2,0.2l0,0
		l0,0c0,0.1-0.1,0.2-0.2,0.2c0,0,0,0,0,0l0,0C163.4,155.2,163.3,155.1,163.3,154.9C163.3,154.9,163.3,154.9,163.3,154.9L163.3,154.9
		z M161.4,154.9c0-0.1,0.1-0.2,0.2-0.2l0,0l0,0c0.1,0,0.2,0.1,0.2,0.2c0,0,0,0,0,0l0,0c0,0.1-0.1,0.2-0.2,0.2h0l0,0
		C161.5,155.2,161.4,155.1,161.4,154.9L161.4,154.9z M159.4,154.9c0-0.1,0.1-0.2,0.2-0.2c0,0,0,0,0,0l0,0c0.1,0,0.2,0.1,0.2,0.2l0,0
		l0,0c0,0.1-0.1,0.2-0.2,0.2c0,0,0,0,0,0l0,0C159.5,155.2,159.4,155.1,159.4,154.9C159.4,154.9,159.4,154.9,159.4,154.9L159.4,154.9
		z M157.5,154.9c0-0.1,0.1-0.2,0.2-0.2l0,0l0,0c0.1,0,0.2,0.1,0.2,0.2c0,0,0,0,0,0l0,0c0,0.1-0.1,0.2-0.2,0.2h0l0,0
		C157.6,155.2,157.5,155.1,157.5,154.9C157.5,154.9,157.5,154.9,157.5,154.9L157.5,154.9z M155.5,154.9c0-0.1,0.1-0.2,0.2-0.2
		c0,0,0,0,0,0l0,0c0.1,0,0.2,0.1,0.2,0.2l0,0l0,0c0,0.1-0.1,0.2-0.2,0.2c0,0,0,0,0,0l0,0C155.6,155.2,155.5,155.1,155.5,154.9
		C155.5,154.9,155.5,154.9,155.5,154.9L155.5,154.9z"/>
	<path class="st4" d="M153.8,155.2c-0.1,0-0.1,0-0.2-0.1c0,0,0,0-0.1-0.1c0,0,0-0.1,0-0.1c0-0.1,0-0.1,0.1-0.2
		c0.1-0.1,0.2-0.1,0.3-0.1c0,0,0.1,0,0.1,0.1c0,0,0.1,0.1,0.1,0.2c0,0,0,0.1,0,0.1c0,0.1-0.1,0.1-0.1,0.1
		C153.9,155.2,153.9,155.2,153.8,155.2z"/>
	<polygon class="st7" points="180.6,90.3 113.6,90.3 112.4,64.4 179.3,64.4 	"/>
	<path class="st8" d="M177.4,131.8l-0.2-1.7c4.2-0.2,8.2-2,11.1-5c1.7-1.8,3-4,3.7-6.3l1.6,0.6c-0.8,2.6-2.2,5-4.1,7
		C186.4,129.6,182,131.6,177.4,131.8z"/>
	<path class="st7" d="M187.1,100.9c-2.1-2-4.6-3.5-7.3-4.3l0.4-1.6c3,0.9,5.8,2.5,8.1,4.7c5.4,5,7.4,12.6,5.4,19.6l-1.6-0.6
		C193.9,112.4,192,105.4,187.1,100.9z"/>
	<path class="st2" d="M163,126.3c-3.6-3.4-5.8-8.1-6.1-13.1h1.7c0.7,9.7,9,17.2,18.7,16.9l0.2,1.7C172.1,132,166.9,130,163,126.3z"
		/>
	<path class="st9" d="M156.9,113.2c-0.4-5,1.4-9.9,4.8-13.5c4.8-4.9,12-6.8,18.5-4.7l-0.4,1.6c-6-1.9-12.5-0.2-16.9,4.3
		c-3.1,3.3-4.7,7.8-4.4,12.3L156.9,113.2z"/>
	
		<ellipse transform="matrix(0.6983 -0.7158 0.7158 0.6983 -27.8632 159.8087)" class="st10" cx="175.6" cy="113" rx="14" ry="14.7"/>
	<path class="st8" d="M140.7,141l-0.3,1.2c-2.9-0.9-6.1-0.6-8.8,0.8c-1.6,0.8-3,1.9-4,3.4l-1-0.8c1.2-1.6,2.7-2.8,4.4-3.7
		C134,140.4,137.4,140.1,140.7,141z"/>
	<path class="st7" d="M126.8,159.4c1,1.8,2.4,3.4,4.1,4.5l-0.7,1c-1.9-1.3-3.4-3-4.5-5c-2.5-4.5-2.2-10.1,0.8-14.3l1,0.8
		C124.8,150.1,124.5,155.2,126.8,159.4z"/>
	<path class="st9" d="M149.3,148c1.7,3.1,2.1,6.7,1.2,10.1l-1.2-0.4c0.8-3.1,0.4-6.4-1.1-9.2c-1.7-3.1-4.5-5.4-7.9-6.4l0.3-1.2
		C144.4,142.1,147.5,144.6,149.3,148z"/>
	<path class="st2" d="M150.5,158.1c-0.9,3.4-3.3,6.3-6.5,7.9c-4.5,2.2-9.8,1.7-13.9-1.2l0.7-1c3.7,2.6,8.5,3,12.6,1
		c2.9-1.4,5-4.1,5.9-7.2L150.5,158.1z"/>
	
		<ellipse transform="matrix(0.6983 -0.7158 0.7158 0.6983 -68.7036 144.8866)" class="st10" cx="137.5" cy="153.9" rx="10" ry="10.5"/>
	<polygon class="st4" points="155.1,67.7 152.8,67.7 147,76.3 153.6,84.9 155.9,84.9 149.3,76.3 	"/>
	<polygon class="st4" points="161.9,67.7 164.2,67.7 170.9,76.3 165.1,84.9 162.8,84.9 168.6,76.3 	"/>
	<g class="st11">
		<path class="st2" d="M103.3,75.5H88.6c-0.6,0-1,0.5-1,1c0,0,0,0,0,0.1l0.5,10.1c0,0.6,0.5,1.1,1.2,1.1h14.7c0.6,0,1-0.5,1-1
			c0,0,0,0,0-0.1l-0.5-10.1C104.4,76,103.9,75.5,103.3,75.5z M97.8,84.9h-2.7l0.2-3.2c-0.5-0.3-0.8-0.9-0.9-1.5
			c-0.1-0.9,0.7-1.7,1.6-1.8c0,0,0.1,0,0.1,0c1,0,1.8,0.8,1.9,1.8c0,0.6-0.2,1.2-0.7,1.5L97.8,84.9z"/>
		<path class="st12" d="M94.4,80.2c0,0.6,0.4,1.2,0.9,1.5l-0.2,3.2h1.4l0.1,2.9h-7.4c-0.6,0-1.1-0.5-1.2-1.1l-0.5-10.1
			c0-0.6,0.4-1.1,1-1.1c0,0,0,0,0.1,0H96l0.1,2.9C95.2,78.4,94.4,79.1,94.4,80.2C94.4,80.1,94.4,80.1,94.4,80.2z"/>
		<path class="st2" d="M102,74.7L102,74.7c-0.5,0-1-0.4-1-1l-0.1-1c-0.1-2.8-2.3-5-5.1-5.2c-2.6-0.2-4.9,1.8-5.1,4.5
			c0,0.2,0,0.4,0,0.6l0.1,1.2c0,0.5-0.4,0.9-0.9,1c0,0,0,0-0.1,0l0,0c-0.5,0-1-0.4-1-1l0-1c-0.3-3.7,2.5-6.9,6.2-7.2
			c0.1,0,0.1,0,0.2,0c4-0.1,7.4,3,7.6,7l0.1,1.2C102.9,74.3,102.5,74.7,102,74.7C102,74.8,102,74.8,102,74.7z"/>
	</g>
	<polygon class="st13" points="108.4,182.8 60.5,182.8 56.3,99.2 104.2,99.2 	"/>
	<polygon class="st14" points="104.4,103.2 56.5,103.2 56.3,99.2 104.2,99.2 	"/>
	<polygon class="st14" points="108.4,182.8 60.5,182.8 60.3,178.8 108.2,178.8 	"/>
	<path class="st2" d="M71.2,122.9l-1.7-0.9c-0.3-0.7-0.6-1.5-1-2.2l0,0l0.5-1.8l-3.8-3.6l-1.8,0.6l0,0c-0.7-0.4-1.4-0.7-2.2-0.9l0,0
		l-1-1.7h-5.1l-0.8,1.7c-0.7,0.2-1.4,0.5-2.1,0.9l0,0l-1.8-0.6L47,118l0.6,1.8l0,0c-0.3,0.7-0.6,1.4-0.8,2.2l-1.6,0.9l0.2,5.1
		l1.7,0.9l0,0c0.3,0.7,0.6,1.5,1,2.2l0,0l-0.5,1.8l3.8,3.6l1.8-0.6c0.7,0.4,1.4,0.7,2.2,0.9l1,1.7h5.1l0.8-1.7l0,0
		c0.7-0.2,1.4-0.5,2.1-0.9l1.8,0.6l3.4-3.6L69,131l0,0c0.3-0.7,0.6-1.4,0.8-2.2l0,0l1.6-0.9L71.2,122.9z M58.8,134.6
		c-5.1-0.1-9.3-4.1-9.6-9.2c-0.3-4.8,3.3-8.9,8.1-9.2c0.2,0,0.4,0,0.6,0c5.1,0.1,9.3,4.1,9.6,9.2c0.3,4.8-3.4,8.9-8.1,9.2
		C59.2,134.6,59,134.6,58.8,134.6z"/>
	<path class="st10" d="M58,117.5c-4.1,0-7.5,3.3-7.5,7.4c0,0.2,0,0.3,0,0.5c0.3,4.4,3.9,7.9,8.3,7.9c4.1,0.1,7.5-3.2,7.6-7.4
		c0-0.2,0-0.4,0-0.5C66,121,62.4,117.5,58,117.5z"/>
	<path class="st2" d="M108.9,130.7H81.7c-1.1,0-2,0.9-2,2c0,0,0,0.1,0,0.1l0.7,14c0.1,1.2,1,2.1,2.2,2.1h16.3l0.3,6.1l5.8-6.1h4.8
		c1.1,0,2-0.9,2-1.9c0,0,0-0.1,0-0.1l-0.7-14C111,131.6,110,130.7,108.9,130.7z"/>
	<path class="st4" d="M72.1,154h18.6c0.8,0,1.4,0.6,1.5,1.4l0.5,9.5c0,0.7-0.5,1.4-1.3,1.4c0,0-0.1,0-0.1,0H80.2l0.2,4.1l-4.3-4.1
		h-3.3c-0.8,0-1.4-0.6-1.5-1.4l-0.5-9.5c0-0.7,0.5-1.4,1.2-1.4C72.1,154,72.1,154,72.1,154z"/>
</g>
</svg>
