{
  "development": {
    "username": "zeri",
    "password": "123456",
    "database": "sequelize_practice",
    "host": "127.0.0.1",
    "dialect": "postgres"
  },
  "test": {
    "username": "root",
    "password": null,
    "database": "sequelize_practice",
    "host": "127.0.0.1",
    "dialect": "postgres"
  },
  "production": {
    "username": "root",
    "password": null,
    "database": "sequelize_practice",
    "host": "127.0.0.1",
    "dialect": "postgres"
  }
}
