^C:\GIT_NG\HOME TASK\TASK 6\TASK 6\TASK 6\STDAFX.CPP
/c /ZI /nologo /W3 /WX- /sdl /Od /Oy- /D WIN32 /D _DEBUG /D _CONSOLE /D _UNICODE /D UNICODE /Gm /EHsc /RTC1 /MDd /GS /fp:precise /Zc:wchar_t /Zc:forScope /Yc"stdafx.h" /Fp"DEBUG\TASK 6.PCH" /Fo"DEBUG\\" /Fd"DEBUG\VC110.PDB" /Gd /TP /analyze- C:\GIT_NG\HOME TASK\TASK 6\TASK 6\TASK 6\STDAFX.CPP
^C:\GIT_NG\HOME TASK\TASK 6\TASK 6\TASK 6\QUEUE.CPP
/c /ZI /nologo /W3 /WX- /sdl /Od /Oy- /D WIN32 /D _DEBUG /D _CONSOLE /D _UNICODE /D UNICODE /Gm /EHsc /RTC1 /MDd /GS /fp:precise /Zc:wchar_t /Zc:forScope /Yu"stdafx.h" /Fp"DEBUG\TASK 6.PCH" /Fo"DEBUG\\" /Fd"DEBUG\VC110.PDB" /Gd /TP /analyze- C:\GIT_NG\HOME TASK\TASK 6\TASK 6\TASK 6\QUEUE.CPP
^C:\GIT_NG\HOME TASK\TASK 6\TASK 6\TASK 6\TASK 6.CPP
/c /ZI /nologo /W3 /WX- /sdl /Od /Oy- /D WIN32 /D _DEBUG /D _CONSOLE /D _UNICODE /D UNICODE /Gm /EHsc /RTC1 /MDd /GS /fp:precise /Zc:wchar_t /Zc:forScope /Yu"stdafx.h" /Fp"DEBUG\TASK 6.PCH" /Fo"DEBUG\\" /Fd"DEBUG\VC110.PDB" /Gd /TP /analyze- C:\GIT_NG\HOME TASK\TASK 6\TASK 6\TASK 6\TASK 6.CPP
