^C:\GIT_NG\HOME TASK\TASK 6\TASK 6\TASK 6\DEBUG\QUEUE.OBJ|C:\GIT_NG\HOME TASK\TASK 6\TASK 6\TASK 6\DEBUG\STDAFX.OBJ|C:\GIT_NG\HOME TASK\TASK 6\TASK 6\TASK 6\DEBUG\TASK 6.OBJ
C:\GIT_NG\HOME TASK\TASK 6\TASK 6\DEBUG\TASK 6.ILK
C:\GIT_NG\HOME TASK\TASK 6\TASK 6\DEBUG\TASK 6.EXE
C:\GIT_NG\HOME TASK\TASK 6\TASK 6\DEBUG\TASK 6.PDB
