<mxfile host="app.diagrams.net" modified="2023-07-16T12:10:50.984Z" agent="Mozilla/5.0 (Windows NT 10.0; Win64; x64) AppleWebKit/537.36 (KHTML, like Gecko) Chrome/112.0.0.0 YaBrowser/23.5.4.674 Yowser/2.5 Safari/537.36" version="21.6.1" etag="1v7GFKQK98QoqCfZHmmD" type="gitlab">
  <diagram name="Page-1" id="ku3YX3Q80SmV8dlqot0n">
    <mxGraphModel>
      <root>
        <mxCell id="0" />
        <mxCell id="1" parent="0" />
      </root>
    </mxGraphModel>
  </diagram>
</mxfile>
