id;name;slug;jhi_order;created_at;updated_at;image;image_content_type
1;Table;open-source;18566;2021-09-07T10:14:10;2021-09-08T03:53:19;../fake-data/blob/hipster.png;image/png
2;bypassing District Practical;Internal XML Chips;55997;2021-09-08T01:06:21;2021-09-07T14:47:10;../fake-data/blob/hipster.png;image/png
3;Steel transmitting Nevada;harness Georgia Hat;58784;2021-09-07T10:54:10;2021-09-08T08:04:44;../fake-data/blob/hipster.png;image/png
4;mesh methodologies Realigned;Chicken Overpass;58088;2021-09-07T17:39:49;2021-09-08T08:18:37;../fake-data/blob/hipster.png;image/png
5;HDD;visionary;17787;2021-09-07T14:58:25;2021-09-08T03:10:55;../fake-data/blob/hipster.png;image/png
6;Fantastic;Versatile bypass California;52826;2021-09-07T11:56:03;2021-09-07T11:04:41;../fake-data/blob/hipster.png;image/png
7;Communications;connecting systems;25972;2021-09-07T23:15:04;2021-09-07T13:51:12;../fake-data/blob/hipster.png;image/png
8;Liechtenstein;XML Web;28820;2021-09-08T07:50:32;2021-09-07T20:52:07;../fake-data/blob/hipster.png;image/png
9;Research;Island Saint Money;11805;2021-09-07T12:42:57;2021-09-08T08:59:15;../fake-data/blob/hipster.png;image/png
10;National;blue Chief;19976;2021-09-07T19:14:52;2021-09-07T20:30:18;../fake-data/blob/hipster.png;image/png
