{
  "name": "Partner",
  "fields": [
    {
      "fieldName": "id",
      "fieldType": "Long",
      "fieldValidateRules": ["unique"]
    },
    {
      "fieldName": "image",
      "fieldType": "byte[]",
      "fieldTypeBlobContent": "image"
    },
    {
      "fieldName": "nextActivity",
      "fieldType": "ZonedDateTime"
    },
    {
      "fieldName": "lastActivity",
      "fieldType": "ZonedDateTime"
    },
    {
      "fieldName": "createdAt",
      "fieldType": "ZonedDateTime"
    },
    {
      "fieldName": "updatedAt",
      "fieldType": "ZonedDateTime"
    }
  ],
  "relationships": [
    {
      "relationshipType": "many-to-many",
      "otherEntityName": "company",
      "otherEntityRelationshipName": "partner",
      "relationshipName": "company",
      "ownerSide": true
    }
  ],
  "entityTableName": "partner",
  "dto": "no",
  "pagination": "no",
  "service": "no",
  "jpaMetamodelFiltering": false,
  "fluentMethods": true,
  "readOnly": false,
  "embedded": false,
  "applications": "*",
  "changelogDate": "20210908091031"
}
