{
  "name": "Category",
  "fields": [
    {
      "fieldName": "id",
      "fieldType": "Long",
      "fieldValidateRules": ["unique"]
    },
    {
      "fieldName": "name",
      "fieldType": "String",
      "fieldValidateRules": ["required", "unique"]
    },
    {
      "fieldName": "slug",
      "fieldType": "String",
      "fieldValidateRules": ["required"]
    },
    {
      "fieldName": "order",
      "fieldType": "Long",
      "fieldValidateRules": ["required"]
    },
    {
      "fieldName": "createdAt",
      "fieldType": "ZonedDateTime"
    },
    {
      "fieldName": "updatedAt",
      "fieldType": "ZonedDateTime"
    },
    {
      "fieldName": "image",
      "fieldType": "byte[]",
      "fieldTypeBlobContent": "image"
    }
  ],
  "relationships": [
    {
      "relationshipType": "many-to-many",
      "otherEntityName": "product",
      "otherEntityRelationshipName": "category",
      "relationshipName": "product",
      "otherEntityField": "name",
      "ownerSide": false
    },
    {
      "relationshipType": "many-to-many",
      "otherEntityName": "company",
      "otherEntityRelationshipName": "category",
      "relationshipName": "company",
      "otherEntityField": "name",
      "ownerSide": false
    }
  ],
  "entityTableName": "category",
  "dto": "no",
  "pagination": "no",
  "service": "no",
  "jpaMetamodelFiltering": false,
  "fluentMethods": true,
  "readOnly": false,
  "embedded": false,
  "applications": "*",
  "changelogDate": "20210908091027"
}
