{
  "name": "Complain",
  "fields": [
    {
      "fieldName": "id",
      "fieldType": "Long",
      "fieldValidateRules": ["unique"]
    },
    {
      "fieldName": "title",
      "fieldType": "String",
      "fieldValidateRules": ["unique", "required"]
    },
    {
      "fieldName": "data",
      "fieldType": "String"
    },
    {
      "fieldName": "status",
      "fieldType": "String",
      "fieldValidateRules": ["required"]
    },
    {
      "fieldName": "callPhone",
      "fieldType": "String"
    },
    {
      "fieldName": "salesNotes",
      "fieldType": "String"
    },
    {
      "fieldName": "nextActivity",
      "fieldType": "ZonedDateTime"
    },
    {
      "fieldName": "lastActivity",
      "fieldType": "ZonedDateTime"
    },
    {
      "fieldName": "createdAt",
      "fieldType": "ZonedDateTime"
    },
    {
      "fieldName": "updatedAt",
      "fieldType": "ZonedDateTime"
    }
  ],
  "relationships": [
    {
      "relationshipType": "many-to-one",
      "otherEntityName": "customer",
      "otherEntityRelationshipName": "complain",
      "relationshipName": "customer",
      "otherEntityField": "name"
    },
    {
      "relationshipType": "many-to-one",
      "otherEntityName": "company",
      "otherEntityRelationshipName": "complain",
      "relationshipName": "company",
      "otherEntityField": "name"
    }
  ],
  "entityTableName": "complain",
  "dto": "no",
  "pagination": "no",
  "service": "no",
  "jpaMetamodelFiltering": false,
  "fluentMethods": true,
  "readOnly": false,
  "embedded": false,
  "applications": "*",
  "changelogDate": "20210908091030"
}
