id;name;description;image;image_content_type;next_activity;last_activity;created_at;updated_at;link;price;sale_price;currency
1;Steel;Assistant;../fake-data/blob/hipster.png;image/png;2021-09-07T19:24:13;2021-09-07T13:40:37;2021-09-07T23:52:19;2021-09-08T01:23:22;Consultant wireless Computer;89830;76808;deposit Track actuating
2;Unbranded Soap;applications Metical;../fake-data/blob/hipster.png;image/png;2021-09-08T06:51:23;2021-09-08T01:28:44;2021-09-07T10:26:38;2021-09-07T20:03:17;Internal intermediate;30312;49167;Generic
3;Lao;Australian;../fake-data/blob/hipster.png;image/png;2021-09-08T05:13:11;2021-09-08T03:35:10;2021-09-08T07:37:35;2021-09-07T14:17:42;Rubber;95238;37638;throughput
4;Data distributed;auxiliary;../fake-data/blob/hipster.png;image/png;2021-09-07T11:23:58;2021-09-07T12:26:19;2021-09-07T19:45:54;2021-09-07T18:25:04;yellow Cape intangible;47574;66238;Rubber Chips
5;Keyboard;Center black pixel;../fake-data/blob/hipster.png;image/png;2021-09-08T02:21:20;2021-09-07T18:45:19;2021-09-07T14:21:44;2021-09-07T13:05:38;Cheese Consultant online;80952;30021;Stand-alone Fantastic Sleek
6;AGP lavender;navigate brand up;../fake-data/blob/hipster.png;image/png;2021-09-07T19:39:51;2021-09-07T23:19:42;2021-09-07T18:13:03;2021-09-08T08:06:11;system-worthy;9545;6953;Ergonomic relationships back-end
7;solution Zimbabwe Games;Account transmit Incredible;../fake-data/blob/hipster.png;image/png;2021-09-07T11:54:41;2021-09-07T12:50:23;2021-09-07T11:21:30;2021-09-07T20:29:16;Industrial Concrete;67786;7332;National
8;Practical Solutions Tuvalu;Square Checking Coordinator;../fake-data/blob/hipster.png;image/png;2021-09-08T04:54:50;2021-09-07T11:07:28;2021-09-08T01:40:31;2021-09-08T05:22:53;Administrator CFA;47027;67453;executive
9;Assistant Berkshire program;Accounts Borders;../fake-data/blob/hipster.png;image/png;2021-09-07T17:07:03;2021-09-08T06:07:02;2021-09-08T03:29:13;2021-09-07T13:19:31;Soft;75593;65021;global
10;focus Phased infomediaries;sky;../fake-data/blob/hipster.png;image/png;2021-09-07T22:09:55;2021-09-07T10:03:30;2021-09-08T02:39:23;2021-09-08T02:00:07;Account portals Berkshire;36836;13935;Belize
