id;name;created_at;updated_at
1;brand;2021-09-08T05:25:37;2021-09-08T07:13:42
2;grey;2021-09-08T07:28:17;2021-09-07T12:42:17
3;Sausages Specialist;2021-09-07T12:00:37;2021-09-07T16:07:19
4;grey Fresh;2021-09-07T11:58:11;2021-09-07T17:20:37
5;USB;2021-09-07T16:44:32;2021-09-07T21:01:57
6;open-source;2021-09-07T20:03:48;2021-09-08T04:03:41
7;Loan vertical Internal;2021-09-07T17:09:22;2021-09-08T09:01:55
8;portals Forward;2021-09-08T03:21:46;2021-09-08T06:00:56
9;Licensed calculating;2021-09-07T13:48:34;2021-09-08T03:22:14
10;Upgradable Zambian;2021-09-08T01:48:53;2021-09-07T22:00:14
