-------------------------------------------------------------------------------
Test set: com.exampe.testNG.priject_testNG.TestNGhelper
-------------------------------------------------------------------------------
Tests run: 0, Failures: 0, Errors: 0, Skipped: 0, Time elapsed: 0.001 sec
