{
  "algorithm": {
    "parameters": [],
    "statements": [
      {
        "command": "Comment",
        "comment": "Create the admin user if its not already there in the DB"
      },
      {
        "children": [
          {
            "command": "Set",
            "expression": "{}",
            "variableName": "adminTblLoginInstance"
          },
          {
            "command": "Set",
            "expression": "\"Admin\"",
            "variableName": "adminTblLoginInstance.ustatus"
          },
          {
            "command": "Set",
            "expression": "\"admin@gmail.com\"",
            "variableName": "adminTblLoginInstance.uemailid"
          },
          {
            "command": "Set",
            "expression": "\"admin\"",
            "variableName": "adminTblLoginInstance.uunm"
          },
          {
            "command": "Set",
            "expression": "\"e10adc3949ba59abbe56e057f20f883e\"",
            "variableName": "adminTblLoginInstance.upass"
          },
          {
            "command": "Execute",
            "expression": "CreateTblLogin(^adminTblLoginInstance)"
          }
        ],
        "command": "If",
        "expression": "IsNull(RdsSelectOne(Ias.TblLogin, This(), uemailid == \"admin@gmail.com\"))"
      }
    ],
    "typeReturn": "any",
    "variables": [
      {
        "name": "adminTblLoginInstance",
        "type": "TblLogin"
      }
    ]
  }
}