{
  "systems": [
    {
      "name": "Ias",
      "type": "RelationalDatabase",
      "x": 875,
      "y": 325
    },
    {
      "name": "IasFrontend",
      "type": "MobileApp",
      "x": 269,
      "y": 218
    },
    {
      "name": "Myservices",
      "type": "Microservice",
      "x": 584,
      "y": 355
    }
  ],
  "references": [
    {
      "fromSystemName": "IasFrontend",
      "toSystemName": "Myservices"
    },
    {
      "fromSystemName": "Myservices",
      "toSystemName": "Ias"
    }
  ]
}