{
  "systems": [
    {
      "name": "Admin",
      "type": "WebFrontend",
      "x": 275,
      "y": 114
    },
    {
      "name": "Ias",
      "type": "RelationalDatabase",
      "x": 726,
      "y": 237
    },
    {
      "name": "IasFrontend",
      "type": "MobileApp",
      "x": 271,
      "y": 355
    },
    {
      "name": "Myservices",
      "type": "Microservice",
      "x": 480,
      "y": 238
    }
  ],
  "references": [
    {
      "fromSystemName": "Admin",
      "toSystemName": "Myservices"
    },
    {
      "fromSystemName": "IasFrontend",
      "toSystemName": "Myservices"
    },
    {
      "fromSystemName": "Myservices",
      "toSystemName": "Ias"
    }
  ]
}