2018-11-12 10:56:34 : info : Starting application
2018-11-12 10:56:34 : info : Initializing database module
2018-11-12 10:56:37 : info : Initializing web server module
2018-11-12 10:56:38 : info : Web server listening on localhost:3000
2018-11-12 10:59:55 : info : Order.controller : getPendingOrders : Started 
2018-11-12 10:59:55 : info : Order.service : getOrdersByStatusAndAgentId : Started
2018-11-12 10:59:55 : info : Order.dao : findByStatusIdAndAgentId : Started 
2018-11-12 10:59:55 : info : Query : SELECT o.ORDER_NUMBER as orderNumber ,o.ORDER_DATE as orderDate,
              o.REJECTION_REASON as rejectionReason
              a.NAME_ARABIC as agent_nameArabic ,a.NAME_ENGLISH as agent_nameEnglish,
              l.NAME_ARABIC as orderReasonLookup_nameArabic
              FROM DCA_ORDER o,DCA_AGENT a,DCA_SYSTEM_LOOKUPS l
              WHERE a.AGENT_ID=o.AGENT_ID and o.REASON_CODE_ID =l.LOOKUP_ID 
              AND l.LOOKUP_TYPE_ID =14
              AND o.STATUS_ID in (2) AND o.AGENT_ID = 67130 ORDER BY  ORDER_DATE DESC
2018-11-12 10:59:55 : error : ReferenceError: err is not defined
2018-11-12 11:01:55 : info : {"remote_addr": ": remote-addr", "remote_user": "-", "date": "12/Nov/2018:09:01:55 +0000", "method": "GET", "url": "/orders/pendingOrders?agentId=67130&orderBy=ORDER_ID&ordering=desc", "http_version": "1.1", "status": "-", "result_length": "-", "referrer": "-", "user_agent": "PostmanRuntime/7.4.0", "response_time": "-"}

2018-11-12 11:01:58 : info : Starting application
2018-11-12 11:01:58 : info : Initializing database module
2018-11-12 11:02:00 : info : Initializing web server module
2018-11-12 11:02:00 : info : Web server listening on localhost:3000
2018-11-12 11:02:57 : info : Starting application
2018-11-12 11:02:57 : info : Initializing database module
2018-11-12 11:02:58 : info : Initializing web server module
2018-11-12 11:02:58 : info : Web server listening on localhost:3000
2018-11-12 11:03:20 : info : Order.controller : getPendingOrders : Started 
2018-11-12 11:03:20 : info : Order.service : getOrdersByStatusAndAgentId : Started
2018-11-12 11:03:20 : info : Order.dao : findByStatusIdAndAgentId : Started 
2018-11-12 11:03:20 : info : Query : SELECT o.ORDER_NUMBER as orderNumber ,o.ORDER_DATE as orderDate,
              o.REJECTION_REASON as rejectionReason
              a.NAME_ARABIC as agent_nameArabic ,a.NAME_ENGLISH as agent_nameEnglish,
              l.NAME_ARABIC as orderReasonLookup_nameArabic
              FROM DCA_ORDER o,DCA_AGENT a,DCA_SYSTEM_LOOKUPS l
              WHERE a.AGENT_ID=o.AGENT_ID and o.REASON_CODE_ID =l.LOOKUP_ID 
              AND l.LOOKUP_TYPE_ID =14
              AND o.STATUS_ID in (2) AND o.AGENT_ID = 67130 ORDER BY  ORDER_DATE DESC
2018-11-12 11:03:20 : error : ReferenceError: err is not defined
2018-11-12 11:03:41 : info : Starting application
2018-11-12 11:03:41 : info : Initializing database module
2018-11-12 11:03:43 : info : Initializing web server module
2018-11-12 11:03:43 : info : Web server listening on localhost:3000
2018-11-12 11:03:46 : info : Starting application
2018-11-12 11:03:46 : info : Initializing database module
2018-11-12 11:03:54 : info : Initializing web server module
2018-11-12 11:03:54 : info : Web server listening on localhost:3000
2018-11-12 11:04:00 : info : Order.controller : getPendingOrders : Started 
2018-11-12 11:04:00 : info : Order.service : getOrdersByStatusAndAgentId : Started
2018-11-12 11:04:00 : info : Order.dao : findByStatusIdAndAgentId : Started 
2018-11-12 11:04:00 : info : Query : SELECT o.ORDER_NUMBER as orderNumber ,o.ORDER_DATE as orderDate,
              o.REJECTION_REASON as rejectionReason
              a.NAME_ARABIC as agent_nameArabic ,a.NAME_ENGLISH as agent_nameEnglish,
              l.NAME_ARABIC as orderReasonLookup_nameArabic
              FROM DCA_ORDER o,DCA_AGENT a,DCA_SYSTEM_LOOKUPS l
              WHERE a.AGENT_ID=o.AGENT_ID and o.REASON_CODE_ID =l.LOOKUP_ID 
              AND l.LOOKUP_TYPE_ID =14
              AND o.STATUS_ID in (2) AND o.AGENT_ID = 67130 ORDER BY  ORDER_DATE DESC
2018-11-12 11:04:01 : error : Order.controller : getPendingOrders : error :: Error: ORA-00923: FROM keyword not found where expected
2018-11-12 11:04:01 : error : [ORDER_LOG_START] 500, Order.dao Operation
       findByStatusIdAndAgentId Service request failed  with Error Code: 500}
        Error Key: External server erro , ORA-00923: FROM keyword not found where expected [ORDER_LOG_END ,url Request /orders/pendingOrders?agentId=67130&orderBy=ORDER_ID&ordering=desc ,method GET ,IP 127.0.0.1]
2018-11-12 11:04:01 : info : {"remote_addr": ": remote-addr", "remote_user": "-", "date": "12/Nov/2018:09:04:01 +0000", "method": "GET", "url": "/orders/pendingOrders?agentId=67130&orderBy=ORDER_ID&ordering=desc", "http_version": "1.1", "status": "500", "result_length": "90", "referrer": "-", "user_agent": "PostmanRuntime/7.4.0", "response_time": "139.229"}

2018-11-12 11:05:51 : info : Starting application
2018-11-12 11:05:51 : info : Initializing database module
2018-11-12 11:05:52 : info : Initializing web server module
2018-11-12 11:05:52 : info : Web server listening on localhost:3000
2018-11-12 11:05:59 : info : Order.controller : getPendingOrders : Started 
2018-11-12 11:05:59 : info : Order.service : getOrdersByStatusAndAgentId : Started
2018-11-12 11:05:59 : info : Order.dao : findByStatusIdAndAgentId : Started 
2018-11-12 11:05:59 : info : Query : SELECT o.ORDER_NUMBER as orderNumber ,o.ORDER_DATE as orderDate,
              o.REJECTION_REASON as rejectionReason ,
              a.NAME_ARABIC as agent_nameArabic ,a.NAME_ENGLISH as agent_nameEnglish,
              l.NAME_ARABIC as orderReasonLookup_nameArabic
              FROM DCA_ORDER o,DCA_AGENT a,DCA_SYSTEM_LOOKUPS l
              WHERE a.AGENT_ID=o.AGENT_ID and o.REASON_CODE_ID =l.LOOKUP_ID 
              AND l.LOOKUP_TYPE_ID =14
              AND o.STATUS_ID in (2) AND o.AGENT_ID = 67130 ORDER BY  ORDER_DATE DESC
2018-11-12 11:05:59 : info : Order.dao : findByStatusIdAndAgentId : End 
2018-11-12 11:05:59 : info : Order.service : getOrdersByStatusAndAgentId : Ended
2018-11-12 11:05:59 : info : Order.controller : getApprovedOrders : End sucessfully 
2018-11-12 11:05:59 : info : {"remote_addr": ": remote-addr", "remote_user": "-", "date": "12/Nov/2018:09:05:59 +0000", "method": "GET", "url": "/orders/pendingOrders?agentId=67130&orderBy=ORDER_ID&ordering=desc", "http_version": "1.1", "status": "200", "result_length": "1677", "referrer": "-", "user_agent": "PostmanRuntime/7.4.0", "response_time": "81.647"}

2018-11-12 11:08:41 : info : Order.controller : getPendingOrders : Started 
2018-11-12 11:08:41 : info : Order.service : getOrdersByStatusAndAgentId : Started
2018-11-12 11:08:41 : info : Order.dao : findByStatusIdAndAgentId : Started 
2018-11-12 11:08:41 : info : Query : SELECT o.ORDER_NUMBER as orderNumber ,o.ORDER_DATE as orderDate,
              o.REJECTION_REASON as rejectionReason ,
              a.NAME_ARABIC as agent_nameArabic ,a.NAME_ENGLISH as agent_nameEnglish,
              l.NAME_ARABIC as orderReasonLookup_nameArabic
              FROM DCA_ORDER o,DCA_AGENT a,DCA_SYSTEM_LOOKUPS l
              WHERE a.AGENT_ID=o.AGENT_ID and o.REASON_CODE_ID =l.LOOKUP_ID 
              AND l.LOOKUP_TYPE_ID =14
              AND o.STATUS_ID in (2) AND o.AGENT_ID = 22571 ORDER BY  ORDER_DATE DESC
2018-11-12 11:08:41 : info : Order.dao : findByStatusIdAndAgentId : End 
2018-11-12 11:08:41 : info : Order.service : getOrdersByStatusAndAgentId : Ended
2018-11-12 11:08:41 : info : Order.controller : getApprovedOrders : End sucessfully 
2018-11-12 11:08:41 : info : {"remote_addr": ": remote-addr", "remote_user": "-", "date": "12/Nov/2018:09:08:41 +0000", "method": "GET", "url": "/orders/pendingOrders?agentId=22571&orderBy=ORDER_ID&ordering=desc", "http_version": "1.1", "status": "200", "result_length": "1645", "referrer": "-", "user_agent": "PostmanRuntime/7.4.0", "response_time": "92.115"}

2018-11-12 11:11:02 : info : Order.controller : getDraftOrders : Started 
2018-11-12 11:11:02 : info : Order.service : getOrdersByStatusAndAgentId : Started
2018-11-12 11:11:02 : info : Order.dao : findByStatusIdAndAgentId : Started 
2018-11-12 11:11:02 : info : Query : SELECT o.ORDER_NUMBER as orderNumber ,o.ORDER_DATE as orderDate,
              o.REJECTION_REASON as rejectionReason ,
              a.NAME_ARABIC as agent_nameArabic ,a.NAME_ENGLISH as agent_nameEnglish,
              l.NAME_ARABIC as orderReasonLookup_nameArabic
              FROM DCA_ORDER o,DCA_AGENT a,DCA_SYSTEM_LOOKUPS l
              WHERE a.AGENT_ID=o.AGENT_ID and o.REASON_CODE_ID =l.LOOKUP_ID 
              AND l.LOOKUP_TYPE_ID =14
              AND o.STATUS_ID in (1) AND o.AGENT_ID = 22571 ORDER BY  ORDER_DATE DESC
2018-11-12 11:11:02 : info : Order.dao : findByStatusIdAndAgentId : End 
2018-11-12 11:11:02 : info : Order.service : getOrdersByStatusAndAgentId : Ended
2018-11-12 11:11:02 : info : Order.controller : getApprovedOrders : End sucessfully 
2018-11-12 11:11:02 : info : {"remote_addr": ": remote-addr", "remote_user": "-", "date": "12/Nov/2018:09:11:02 +0000", "method": "GET", "url": "/orders/draftOrders?agentId=22571&orderBy=ORDER_ID&ordering=desc", "http_version": "1.1", "status": "200", "result_length": "5039", "referrer": "-", "user_agent": "PostmanRuntime/7.4.0", "response_time": "109.140"}

2018-11-12 11:12:58 : info : Order.controller : getRejectedOrders : Started 
2018-11-12 11:12:58 : info : Order.service : getOrdersByStatusAndAgentId : Started
2018-11-12 11:12:58 : info : Order.dao : findByStatusIdAndAgentId : Started 
2018-11-12 11:12:58 : info : Query : SELECT o.ORDER_NUMBER as orderNumber ,o.ORDER_DATE as orderDate,
              o.REJECTION_REASON as rejectionReason ,
              a.NAME_ARABIC as agent_nameArabic ,a.NAME_ENGLISH as agent_nameEnglish,
              l.NAME_ARABIC as orderReasonLookup_nameArabic
              FROM DCA_ORDER o,DCA_AGENT a,DCA_SYSTEM_LOOKUPS l
              WHERE a.AGENT_ID=o.AGENT_ID and o.REASON_CODE_ID =l.LOOKUP_ID 
              AND l.LOOKUP_TYPE_ID =14
              AND o.STATUS_ID in (4) AND o.AGENT_ID = 22571 ORDER BY  ORDER_DATE DESC
2018-11-12 11:12:58 : info : Order.dao : findByStatusIdAndAgentId : End 
2018-11-12 11:12:58 : info : Order.service : getOrdersByStatusAndAgentId : Ended
2018-11-12 11:12:58 : info : Order.controller : getApprovedOrders : End sucessfully 
2018-11-12 11:12:58 : info : {"remote_addr": ": remote-addr", "remote_user": "-", "date": "12/Nov/2018:09:12:58 +0000", "method": "GET", "url": "/orders/rejectedOrders?agentId=22571&orderBy=ORDER_ID&ordering=desc", "http_version": "1.1", "status": "200", "result_length": "246", "referrer": "-", "user_agent": "PostmanRuntime/7.4.0", "response_time": "71.665"}

2018-11-12 11:14:01 : info : Order.controller : getApprovedOrders : Started  
2018-11-12 11:14:01 : info : Order.service : getOrdersByStatusAndAgentId : Started
2018-11-12 11:14:01 : error : [ORDER_LOG_START] 500, Order.service Operation
       getOrdersByStatusAndAgentId Service request failed  with Error Code: 500}
        Error Key: External server erro , Cannot read property 'split' of undefined [ORDER_LOG_END ,url Request /orders/approvedOrders?agentId=22571&sort=2,desc&page=0&size=10 ,method GET ,IP 127.0.0.1]
2018-11-12 11:14:01 : info : {"remote_addr": ": remote-addr", "remote_user": "-", "date": "12/Nov/2018:09:14:01 +0000", "method": "GET", "url": "/orders/approvedOrders?agentId=22571&sort=2,desc&page=0&size=10", "http_version": "1.1", "status": "500", "result_length": "83", "referrer": "-", "user_agent": "PostmanRuntime/7.4.0", "response_time": "10.267"}

2018-11-12 11:16:50 : info : Order.controller : getApprovedOrders : Started  
2018-11-12 11:18:52 : info : Starting application
2018-11-12 11:18:52 : info : Initializing database module
2018-11-12 11:18:54 : error : uncaughtException: query is not defined
ReferenceError: query is not defined
    at Object.<anonymous> (F:\node.js.project\transaction\order\service\order.service.js:95:3)
    at Module._compile (module.js:653:30)
    at Object.Module._extensions..js (module.js:664:10)
    at Module.load (module.js:566:32)
    at tryModuleLoad (module.js:506:12)
    at Function.Module._load (module.js:498:3)
    at Module.require (module.js:597:17)
    at require (internal/module.js:11:18)
    at Object.<anonymous> (F:\node.js.project\transaction\order\controller\order.controller.js:1:82)
    at Module._compile (module.js:653:30)
2018-11-12 11:18:55 : error : uncaughtException: query is not defined
ReferenceError: query is not defined
    at Object.<anonymous> (F:\node.js.project\transaction\order\service\order.service.js:95:3)
    at Module._compile (module.js:653:30)
    at Object.Module._extensions..js (module.js:664:10)
    at Module.load (module.js:566:32)
    at tryModuleLoad (module.js:506:12)
    at Function.Module._load (module.js:498:3)
    at Module.require (module.js:597:17)
    at require (internal/module.js:11:18)
    at Object.<anonymous> (F:\node.js.project\transaction\order\controller\order.controller.js:1:82)
    at Module._compile (module.js:653:30)
2018-11-12 11:18:59 : error : uncaughtException: query is not defined
ReferenceError: query is not defined
    at Object.<anonymous> (F:\node.js.project\transaction\order\service\order.service.js:95:3)
    at Module._compile (module.js:653:30)
    at Object.Module._extensions..js (module.js:664:10)
    at Module.load (module.js:566:32)
    at tryModuleLoad (module.js:506:12)
    at Function.Module._load (module.js:498:3)
    at Module.require (module.js:597:17)
    at require (internal/module.js:11:18)
    at Object.<anonymous> (F:\node.js.project\transaction\order\controller\order.controller.js:1:82)
    at Module._compile (module.js:653:30)
2018-11-12 11:19:01 : info : Starting application
2018-11-12 11:19:01 : info : Initializing database module
2018-11-12 11:19:02 : info : Initializing web server module
2018-11-12 11:19:02 : info : Web server listening on localhost:3000
2018-11-12 11:19:46 : info : Starting application
2018-11-12 11:19:46 : info : Initializing database module
2018-11-12 11:19:48 : info : Initializing web server module
2018-11-12 11:19:48 : info : Web server listening on localhost:3000
2018-11-12 11:19:50 : info : Starting application
2018-11-12 11:19:50 : info : Initializing database module
2018-11-12 11:19:55 : info : Initializing web server module
2018-11-12 11:19:55 : info : Web server listening on localhost:3000
2018-11-12 11:20:07 : info : Starting application
2018-11-12 11:20:07 : info : Initializing database module
2018-11-12 11:20:08 : info : Initializing web server module
2018-11-12 11:20:08 : info : Web server listening on localhost:3000
2018-11-12 11:20:11 : info : Starting application
2018-11-12 11:20:11 : info : Initializing database module
2018-11-12 11:20:12 : info : Initializing web server module
2018-11-12 11:20:12 : info : Web server listening on localhost:3000
2018-11-12 11:20:18 : info : Starting application
2018-11-12 11:20:18 : info : Initializing database module
2018-11-12 11:20:22 : info : Initializing web server module
2018-11-12 11:20:22 : info : Web server listening on localhost:3000
2018-11-12 11:20:30 : info : Order.controller : getApprovedOrders : Started  
2018-11-12 11:22:33 : info : Starting application
2018-11-12 11:22:33 : info : Initializing database module
2018-11-12 11:22:36 : info : Initializing web server module
2018-11-12 11:22:36 : info : Web server listening on localhost:3000
2018-11-12 11:22:38 : info : Starting application
2018-11-12 11:22:38 : info : Initializing database module
2018-11-12 11:22:40 : info : Starting application
2018-11-12 11:22:40 : info : Initializing database module
2018-11-12 11:22:42 : info : Starting application
2018-11-12 11:22:42 : info : Initializing database module
2018-11-12 11:22:43 : info : Starting application
2018-11-12 11:22:43 : info : Initializing database module
2018-11-12 11:22:44 : info : Initializing web server module
2018-11-12 11:22:45 : info : Web server listening on localhost:3000
2018-11-12 11:23:09 : info : Starting application
2018-11-12 11:23:10 : info : Initializing database module
2018-11-12 11:23:11 : info : Initializing web server module
2018-11-12 11:23:11 : info : Web server listening on localhost:3000
2018-11-12 11:23:39 : info : Starting application
2018-11-12 11:23:39 : info : Initializing database module
2018-11-12 11:23:40 : info : Initializing web server module
2018-11-12 11:23:40 : info : Web server listening on localhost:3000
2018-11-12 11:23:46 : info : Starting application
2018-11-12 11:23:46 : info : Initializing database module
2018-11-12 11:23:49 : info : Initializing web server module
2018-11-12 11:23:49 : info : Web server listening on localhost:3000
2018-11-12 11:23:59 : info : Starting application
2018-11-12 11:23:59 : info : Initializing database module
2018-11-12 11:24:01 : info : Initializing web server module
2018-11-12 11:24:01 : info : Web server listening on localhost:3000
2018-11-12 11:24:03 : info : Starting application
2018-11-12 11:24:03 : info : Initializing database module
2018-11-12 11:24:04 : info : Initializing web server module
2018-11-12 11:24:04 : info : Web server listening on localhost:3000
2018-11-12 11:24:08 : info : Starting application
2018-11-12 11:24:08 : info : Initializing database module
2018-11-12 11:24:09 : info : Initializing web server module
2018-11-12 11:24:10 : info : Starting application
2018-11-12 11:24:10 : info : Initializing database module
2018-11-12 11:24:14 : info : Initializing web server module
2018-11-12 11:24:14 : info : Web server listening on localhost:3000
2018-11-12 11:24:18 : info : Starting application
2018-11-12 11:24:18 : info : Initializing database module
2018-11-12 11:24:19 : info : Starting application
2018-11-12 11:24:19 : info : Initializing database module
2018-11-12 11:24:20 : info : Initializing web server module
2018-11-12 11:24:20 : info : Web server listening on localhost:3000
2018-11-12 11:24:25 : info : Starting application
2018-11-12 11:24:25 : info : Initializing database module
2018-11-12 11:24:26 : info : Initializing web server module
2018-11-12 11:24:26 : info : Web server listening on localhost:3000
2018-11-12 11:24:47 : info : Order.controller : getApprovedOrders : Started  
2018-11-12 11:25:20 : info : Starting application
2018-11-12 11:25:20 : info : Initializing database module
2018-11-12 11:25:23 : info : Initializing web server module
2018-11-12 11:25:23 : info : Web server listening on localhost:3000
2018-11-12 11:25:27 : info : Starting application
2018-11-12 11:25:27 : info : Initializing database module
2018-11-12 11:25:28 : info : Initializing web server module
2018-11-12 11:25:28 : info : Web server listening on localhost:3000
2018-11-12 11:25:29 : info : Starting application
2018-11-12 11:25:29 : info : Initializing database module
2018-11-12 11:25:31 : info : Starting application
2018-11-12 11:25:31 : info : Initializing database module
2018-11-12 11:25:32 : info : Starting application
2018-11-12 11:25:32 : info : Initializing database module
2018-11-12 11:25:34 : info : Initializing web server module
2018-11-12 11:25:34 : info : Web server listening on localhost:3000
2018-11-12 11:25:40 : info : Starting application
2018-11-12 11:25:40 : info : Initializing database module
2018-11-12 11:25:42 : info : Starting application
2018-11-12 11:25:42 : info : Initializing database module
2018-11-12 11:25:44 : info : Starting application
2018-11-12 11:25:44 : info : Initializing database module
2018-11-12 11:25:47 : info : Initializing web server module
2018-11-12 11:25:47 : info : Web server listening on localhost:3000
2018-11-12 11:26:01 : info : Starting application
2018-11-12 11:26:01 : info : Initializing database module
2018-11-12 11:26:04 : info : Initializing web server module
2018-11-12 11:26:04 : info : Web server listening on localhost:3000
2018-11-12 11:26:10 : info : Starting application
2018-11-12 11:26:10 : info : Initializing database module
2018-11-12 11:26:12 : info : Initializing web server module
2018-11-12 11:26:12 : info : Web server listening on localhost:3000
2018-11-12 11:26:18 : info : Starting application
2018-11-12 11:26:18 : info : Initializing database module
2018-11-12 11:26:19 : info : Initializing web server module
2018-11-12 11:26:19 : info : Web server listening on localhost:3000
2018-11-12 11:26:48 : info : Starting application
2018-11-12 11:26:48 : info : Initializing database module
2018-11-12 11:26:50 : info : Starting application
2018-11-12 11:26:50 : info : Initializing database module
2018-11-12 11:26:52 : info : Starting application
2018-11-12 11:26:52 : info : Initializing database module
2018-11-12 11:26:56 : info : Initializing web server module
2018-11-12 11:26:56 : info : Web server listening on localhost:3000
2018-11-12 11:26:57 : info : Starting application
2018-11-12 11:26:57 : info : Initializing database module
2018-11-12 11:26:58 : info : Initializing web server module
2018-11-12 11:26:58 : info : Web server listening on localhost:3000
2018-11-12 11:28:30 : info : Order.controller : getApprovedOrders : Started  
2018-11-12 11:28:36 : info : Order.service : getOrdersByStatusAndAgentId : Started
2018-11-12 11:29:24 : info : Order.dao : findByStatusIdAndAgentId : Started 
2018-11-12 11:29:25 : info : Query : SELECT o.ORDER_NUMBER as orderNumber ,o.ORDER_DATE as orderDate,
              o.REJECTION_REASON as rejectionReason ,
              a.NAME_ARABIC as agent_nameArabic ,a.NAME_ENGLISH as agent_nameEnglish,
              l.NAME_ARABIC as orderReasonLookup_nameArabic
              FROM DCA_ORDER o,DCA_AGENT a,DCA_SYSTEM_LOOKUPS l
              WHERE a.AGENT_ID=o.AGENT_ID and o.REASON_CODE_ID =l.LOOKUP_ID 
              AND l.LOOKUP_TYPE_ID =14
              AND o.STATUS_ID in (3,5,6,50) AND o.AGENT_ID = 22571 ORDER BY  a.NAME_ARABIC DESC
2018-11-12 11:29:27 : info : Order.dao : findByStatusIdAndAgentId : End 
2018-11-12 11:29:27 : info : Order.service : getOrdersByStatusAndAgentId : Ended
2018-11-12 11:29:27 : info : Order.controller : getApprovedOrders : End sucessfully 
2018-11-12 11:29:27 : info : {"remote_addr": ": remote-addr", "remote_user": "-", "date": "12/Nov/2018:09:29:27 +0000", "method": "GET", "url": "/orders/approvedOrders?agentId=22571&sort=2,desc&page=0&size=10", "http_version": "1.1", "status": "200", "result_length": "846", "referrer": "-", "user_agent": "PostmanRuntime/7.4.0", "response_time": "56216.220"}

2018-11-12 11:34:32 : info : Starting application
2018-11-12 11:34:32 : info : Initializing database module
2018-11-12 11:34:33 : info : Initializing web server module
2018-11-12 11:34:33 : info : Web server listening on localhost:3000
2018-11-12 11:40:00 : info : Starting application
2018-11-12 11:40:00 : info : Initializing database module
2018-11-12 11:40:02 : info : Initializing web server module
2018-11-12 11:40:02 : info : Web server listening on localhost:3000
2018-11-12 11:40:03 : info : Starting application
2018-11-12 11:40:03 : info : Initializing database module
2018-11-12 11:40:04 : info : Starting application
2018-11-12 11:40:04 : info : Initializing database module
2018-11-12 11:40:06 : info : Initializing web server module
2018-11-12 11:40:06 : info : Web server listening on localhost:3000
2018-11-12 11:40:46 : info : Starting application
2018-11-12 11:40:46 : info : Initializing database module
2018-11-12 11:40:50 : info : Initializing web server module
2018-11-12 11:40:50 : info : Web server listening on localhost:3000
2018-11-12 12:54:56 : info : Starting application
2018-11-12 12:54:56 : info : Initializing database module
2018-11-12 12:54:58 : info : Starting application
2018-11-12 12:54:58 : info : Initializing database module
