<?xml version="1.0" encoding="UTF-8"?>
<svg width="41px" height="39px" viewBox="0 0 41 39" version="1.1" xmlns="http://www.w3.org/2000/svg" xmlns:xlink="http://www.w3.org/1999/xlink">
    <title>menu-bg-2</title>
    <g id="Page-1" stroke="none" stroke-width="1" fill="none" fill-rule="evenodd" stroke-linecap="round" stroke-linejoin="round">
        <g id="Menu" transform="translate(-296.000000, -305.000000)" stroke="#FA4F6E" stroke-width="3">
            <path d="M304.181124,307 C295.942626,315.275812 295.939187,328.69013 304.173442,336.961718 C312.407698,345.233306 325.761502,345.229883 334,336.954071" id="menu-bg-2" transform="translate(316.000000, 325.081585) rotate(-265.000000) translate(-316.000000, -325.081585) "></path>
        </g>
    </g>
</svg>