<?xml version="1.0" encoding="UTF-8"?>
<svg width="11px" height="5px" viewBox="0 0 11 5" version="1.1" xmlns="http://www.w3.org/2000/svg" xmlns:xlink="http://www.w3.org/1999/xlink">
    <title>icon-collapse</title>
    <g id="Page-1" stroke="none" stroke-width="1" fill="none" fill-rule="evenodd">
        <g id="Landing-page---responsive" transform="translate(-345.000000, -3555.000000)" stroke="#FFFFFF">
            <polyline id="icon-collapse" transform="translate(350.500000, 3557.500000) scale(1, -1) rotate(-90.000000) translate(-350.500000, -3557.500000) " points="348 3562 353 3557.20733 348 3553"></polyline>
        </g>
    </g>
</svg>