<svg viewBox="0 0 312 79" fill="none" xmlns="http://www.w3.org/2000/svg">
    <path d="M43.968 43.048H35.52V55.272C35.52 55.6133 35.4773 55.9973 35.392 56.424C35.3493 56.8507 35.1573 57.2347 34.816 57.576C34.4747 57.9173 34.112 58.1307 33.728 58.216C33.344 58.2587 32.96 58.28 32.576 58.28H21.632C19.84 58.28 18.1973 57.9813 16.704 57.384C15.2107 56.744 13.9947 55.4853 13.056 53.608C12.8853 53.2667 12.6933 52.8187 12.48 52.264C12.2667 51.6667 12.0747 50.92 11.904 50.024C11.7333 49.128 11.584 48.0827 11.456 46.888C11.328 45.6507 11.264 44.2213 11.264 42.6C11.264 40.9787 11.328 39.5707 11.456 38.376C11.584 37.1813 11.7333 36.1573 11.904 35.304C12.0747 34.4507 12.2667 33.7467 12.48 33.192C12.6933 32.5947 12.9067 32.1253 13.12 31.784C13.9733 30.2053 15.232 29.0107 16.896 28.2C18.56 27.3467 20.608 26.92 23.04 26.92H42.944V20.2H20.672C16.2773 20.2 12.672 21.1173 9.856 22.952C8.192 24.0187 6.86933 25.32 5.888 26.856C4.94933 28.3493 4.224 29.992 3.712 31.784C3.24267 33.5333 2.92267 35.368 2.752 37.288C2.624 39.1653 2.56 41.0213 2.56 42.856C2.56 44.4347 2.60267 46.0773 2.688 47.784C2.816 49.4907 3.072 51.176 3.456 52.84C3.84 54.4613 4.416 56.0187 5.184 57.512C5.99467 59.0053 7.08267 60.328 8.448 61.48C9.472 62.3333 10.8373 63.144 12.544 63.912C14.2507 64.6373 16.3627 65 18.88 65H37.952C38.592 65 39.3173 64.8933 40.128 64.68C40.9813 64.4667 41.7067 64.1253 42.304 63.656C42.7307 63.3147 43.1147 62.7813 43.456 62.056C43.7973 61.3307 43.968 60.392 43.968 59.24V43.048ZM79.78 65V59.24H63.204C62.5213 59.24 61.8173 59.1973 61.092 59.112C60.4093 59.0267 59.748 58.856 59.108 58.6C58.468 58.3013 57.9133 57.896 57.444 57.384C56.9747 56.8293 56.612 56.104 56.356 55.208C56.228 54.696 56.1213 53.9707 56.036 53.032C55.9507 52.0933 55.908 51.2613 55.908 50.536H75.62C76.3027 50.536 76.9427 50.4507 77.54 50.28C78.18 50.1093 78.756 49.768 79.268 49.256C79.9933 48.5307 80.4413 47.72 80.612 46.824C80.7827 45.8853 80.868 44.9893 80.868 44.136C80.868 43.0693 80.804 42.024 80.676 41C80.548 39.9333 80.292 38.9307 79.908 37.992C79.5667 37.0107 79.076 36.1147 78.436 35.304C77.8387 34.4933 77.0493 33.768 76.068 33.128C74.4893 32.1467 72.7187 31.5493 70.756 31.336C68.836 31.08 66.8733 30.952 64.868 30.952C64.0573 30.952 63.1187 30.9733 62.052 31.016C60.9853 31.0587 59.876 31.1867 58.724 31.4C57.572 31.5707 56.42 31.8693 55.268 32.296C54.1587 32.7227 53.1347 33.3413 52.196 34.152C51.2573 34.9627 50.5107 35.8587 49.956 36.84C49.444 37.8213 49.0387 38.9093 48.74 40.104C48.484 41.256 48.3133 42.536 48.228 43.944C48.1853 45.3093 48.164 46.7813 48.164 48.36C48.164 50.6213 48.292 52.84 48.548 55.016C48.804 57.192 49.4867 59.0907 50.596 60.712C51.2787 61.6933 52.0467 62.4827 52.9 63.08C53.7533 63.6347 54.628 64.0613 55.524 64.36C56.42 64.6587 57.3373 64.8507 58.276 64.936C59.2147 64.9787 60.1107 65 60.964 65H79.78ZM55.908 44.776C55.9507 43.6667 56.0147 42.6427 56.1 41.704C56.228 40.7227 56.676 39.8053 57.444 38.952C57.956 38.3973 58.5107 37.9707 59.108 37.672C59.748 37.3307 60.388 37.096 61.028 36.968C61.668 36.84 62.2867 36.776 62.884 36.776C63.4813 36.7333 64.036 36.712 64.548 36.712C65.6147 36.712 66.7027 36.7973 67.812 36.968C68.964 37.096 70.0093 37.5227 70.948 38.248C71.5027 38.6747 71.9933 39.272 72.42 40.04C72.8893 40.808 73.124 41.7253 73.124 42.792C73.124 43.2613 73.0173 43.7093 72.804 44.136C72.6333 44.5627 72.1853 44.776 71.46 44.776H55.908ZM115.843 65V59.24H99.2665C98.5838 59.24 97.8798 59.1973 97.1545 59.112C96.4718 59.0267 95.8105 58.856 95.1705 58.6C94.5305 58.3013 93.9758 57.896 93.5065 57.384C93.0372 56.8293 92.6745 56.104 92.4185 55.208C92.2905 54.696 92.1838 53.9707 92.0985 53.032C92.0132 52.0933 91.9705 51.2613 91.9705 50.536H111.683C112.365 50.536 113.005 50.4507 113.603 50.28C114.243 50.1093 114.819 49.768 115.331 49.256C116.056 48.5307 116.504 47.72 116.675 46.824C116.845 45.8853 116.931 44.9893 116.931 44.136C116.931 43.0693 116.867 42.024 116.739 41C116.611 39.9333 116.355 38.9307 115.971 37.992C115.629 37.0107 115.139 36.1147 114.499 35.304C113.901 34.4933 113.112 33.768 112.131 33.128C110.552 32.1467 108.781 31.5493 106.819 31.336C104.899 31.08 102.936 30.952 100.931 30.952C100.12 30.952 99.1812 30.9733 98.1145 31.016C97.0478 31.0587 95.9385 31.1867 94.7865 31.4C93.6345 31.5707 92.4825 31.8693 91.3305 32.296C90.2212 32.7227 89.1972 33.3413 88.2585 34.152C87.3198 34.9627 86.5732 35.8587 86.0185 36.84C85.5065 37.8213 85.1012 38.9093 84.8025 40.104C84.5465 41.256 84.3758 42.536 84.2905 43.944C84.2478 45.3093 84.2265 46.7813 84.2265 48.36C84.2265 50.6213 84.3545 52.84 84.6105 55.016C84.8665 57.192 85.5492 59.0907 86.6585 60.712C87.3412 61.6933 88.1092 62.4827 88.9625 63.08C89.8158 63.6347 90.6905 64.0613 91.5865 64.36C92.4825 64.6587 93.3998 64.8507 94.3385 64.936C95.2772 64.9787 96.1732 65 97.0265 65H115.843ZM91.9705 44.776C92.0132 43.6667 92.0772 42.6427 92.1625 41.704C92.2905 40.7227 92.7385 39.8053 93.5065 38.952C94.0185 38.3973 94.5732 37.9707 95.1705 37.672C95.8105 37.3307 96.4505 37.096 97.0905 36.968C97.7305 36.84 98.3492 36.776 98.9465 36.776C99.5438 36.7333 100.099 36.712 100.611 36.712C101.677 36.712 102.765 36.7973 103.875 36.968C105.027 37.096 106.072 37.5227 107.011 38.248C107.565 38.6747 108.056 39.272 108.483 40.04C108.952 40.808 109.187 41.7253 109.187 42.792C109.187 43.2613 109.08 43.7093 108.867 44.136C108.696 44.5627 108.248 44.776 107.523 44.776H91.9705ZM153.889 65L140.001 50.344C139.574 49.8747 139.19 49.384 138.849 48.872C138.55 48.3173 138.401 47.7627 138.401 47.208C138.401 46.6533 138.508 46.2053 138.721 45.864C138.934 45.48 139.19 45.1173 139.489 44.776L152.225 31.08H143.521L133.281 42.344C132.812 42.8987 132.3 43.5813 131.745 44.392C131.19 45.16 130.913 46.184 130.913 47.464C130.913 48.6587 131.169 49.6827 131.681 50.536C132.236 51.3893 132.748 52.072 133.217 52.584L144.929 65H153.889ZM128.673 65V20.2H121.185V65H128.673ZM155.56 65H163.048V20.2H155.56V65ZM185.337 30.696C184.313 30.696 183.204 30.7173 182.009 30.76C180.814 30.8027 179.598 30.952 178.361 31.208C177.124 31.4213 175.929 31.784 174.777 32.296C173.625 32.7653 172.58 33.4267 171.641 34.28C170.66 35.176 169.87 36.2427 169.273 37.48C168.718 38.6747 168.292 39.912 167.993 41.192C167.694 42.4293 167.502 43.6667 167.417 44.904C167.332 46.1413 167.289 47.2293 167.289 48.168C167.289 49.0213 167.332 50.0453 167.417 51.24C167.502 52.392 167.673 53.608 167.929 54.888C168.228 56.1253 168.654 57.3413 169.209 58.536C169.806 59.7307 170.617 60.7973 171.641 61.736C172.58 62.5893 173.625 63.272 174.777 63.784C175.929 64.2533 177.124 64.616 178.361 64.872C179.598 65.0853 180.814 65.2133 182.009 65.256C183.204 65.3413 184.313 65.384 185.337 65.384C186.318 65.384 187.406 65.3413 188.601 65.256C189.796 65.2133 191.012 65.0853 192.249 64.872C193.529 64.616 194.745 64.2533 195.897 63.784C197.092 63.272 198.137 62.5893 199.033 61.736C200.27 60.5413 201.294 58.856 202.105 56.68C202.958 54.4613 203.385 51.5387 203.385 47.912C203.385 47.016 203.342 45.9707 203.257 44.776C203.172 43.5813 202.98 42.3653 202.681 41.128C202.382 39.8907 201.934 38.6747 201.337 37.48C200.782 36.2427 200.014 35.176 199.033 34.28C198.094 33.4267 197.049 32.7653 195.897 32.296C194.745 31.784 193.55 31.4213 192.313 31.208C191.076 30.952 189.86 30.8027 188.665 30.76C187.47 30.7173 186.361 30.696 185.337 30.696ZM175.033 48.104C175.033 47.5493 175.033 46.888 175.033 46.12C175.076 45.352 175.161 44.5627 175.289 43.752C175.417 42.8987 175.63 42.0667 175.929 41.256C176.228 40.4453 176.633 39.7413 177.145 39.144C177.657 38.5467 178.254 38.0773 178.937 37.736C179.662 37.352 180.388 37.0747 181.113 36.904C181.838 36.6907 182.564 36.5627 183.289 36.52C184.057 36.4773 184.74 36.456 185.337 36.456C186.02 36.456 186.724 36.4773 187.449 36.52C188.174 36.5627 188.878 36.6907 189.561 36.904C190.286 37.0747 190.969 37.352 191.609 37.736C192.292 38.0773 192.91 38.5467 193.465 39.144C194.062 39.784 194.51 40.5093 194.809 41.32C195.108 42.088 195.321 42.8773 195.449 43.688C195.577 44.4987 195.641 45.288 195.641 46.056C195.641 46.7813 195.641 47.464 195.641 48.104C195.641 49.5973 195.534 51.112 195.321 52.648C195.15 54.184 194.51 55.5707 193.401 56.808C192.292 58.0453 191.012 58.8347 189.561 59.176C188.153 59.4747 186.745 59.624 185.337 59.624C183.972 59.624 182.542 59.4747 181.049 59.176C179.598 58.8347 178.318 58.0453 177.209 56.808C176.142 55.5707 175.502 54.1627 175.289 52.584C175.118 51.0053 175.033 49.512 175.033 48.104ZM231.623 65C231.409 66.6213 230.748 67.9227 229.639 68.904C228.743 69.6293 227.676 70.056 226.439 70.184C225.201 70.3547 224.177 70.44 223.367 70.44H209.095V76.2H225.095C225.692 76.2 226.46 76.1573 227.399 76.072C228.38 75.9867 229.404 75.7947 230.471 75.496C231.537 75.24 232.604 74.8347 233.671 74.28C234.737 73.768 235.655 73.0427 236.423 72.104C237.532 70.7387 238.257 69.1173 238.599 67.24C238.983 65.3627 239.175 63.336 239.175 61.16V37.352C239.175 36.6267 239.047 35.816 238.791 34.92C238.577 33.9813 238.044 33.1493 237.191 32.424C236.38 31.784 235.505 31.4 234.567 31.272C233.628 31.144 232.668 31.08 231.687 31.08H220.743C219.889 31.08 219.015 31.1227 218.119 31.208C217.223 31.2507 216.327 31.4 215.431 31.656C214.535 31.8693 213.66 32.232 212.807 32.744C211.953 33.2133 211.121 33.896 210.311 34.792C208.817 36.4133 207.836 38.2693 207.367 40.36C206.94 42.4507 206.727 44.84 206.727 47.528C206.727 53.544 207.601 57.9173 209.351 60.648C209.991 61.672 210.716 62.4827 211.527 63.08C212.38 63.6347 213.255 64.0613 214.151 64.36C215.047 64.616 215.943 64.7867 216.839 64.872C217.777 64.9573 218.695 65 219.591 65H231.623ZM231.687 59.24H222.791C221.681 59.24 220.551 59.1547 219.399 58.984C218.247 58.8133 217.244 58.2373 216.391 57.256C216.177 57.0427 215.964 56.7227 215.751 56.296C215.537 55.8693 215.324 55.3147 215.111 54.632C214.94 53.9067 214.791 53.032 214.663 52.008C214.535 50.9413 214.47 49.64 214.47 48.104C214.47 47.72 214.47 47.144 214.47 46.376C214.513 45.5653 214.599 44.712 214.727 43.816C214.855 42.92 215.047 42.0453 215.303 41.192C215.601 40.296 216.007 39.5493 216.519 38.952C217.116 38.2693 217.927 37.7573 218.951 37.416C219.975 37.032 221.105 36.84 222.343 36.84H228.743C229.084 36.84 229.404 36.8827 229.703 36.968C230.044 37.0107 230.385 37.1387 230.727 37.352C231.153 37.6507 231.409 37.9707 231.495 38.312C231.623 38.6533 231.687 39.0587 231.687 39.528V59.24ZM244.31 65H251.798V31.08H244.31V65ZM251.798 26.152V20.2H244.31V26.152H251.798ZM256.935 65H264.423V38.632C264.423 38.4187 264.423 38.184 264.423 37.928C264.466 37.672 264.594 37.4373 264.807 37.224C265.02 37.0107 265.234 36.904 265.447 36.904C265.66 36.8613 265.874 36.84 266.087 36.84H273.703C275.068 36.84 276.156 37.0107 276.967 37.352C277.82 37.6507 278.524 38.1627 279.079 38.888C279.676 39.6987 280.06 40.6373 280.231 41.704C280.402 42.728 280.487 43.7947 280.487 44.904V65H287.975V42.664C287.975 40.3173 287.634 38.4613 286.951 37.096C286.311 35.7307 285.543 34.6427 284.647 33.832C283.282 32.5947 281.81 31.8267 280.231 31.528C278.652 31.2293 276.967 31.08 275.175 31.08H263.207C262.482 31.08 261.607 31.144 260.583 31.272C259.602 31.3573 258.748 31.8053 258.023 32.616C257.511 33.1707 257.191 33.7893 257.063 34.472C256.978 35.1547 256.935 35.752 256.935 36.264V65Z" fill="#A80000"/>
    <path d="M269.594 21H275.696C275.936 21 276.188 20.982 276.452 20.946C276.728 20.898 276.986 20.784 277.226 20.604C277.418 20.46 277.568 20.298 277.676 20.118C277.784 19.938 277.862 19.752 277.91 19.56C277.97 19.368 278.006 19.188 278.018 19.02C278.03 18.84 278.036 18.69 278.036 18.57C278.036 18.306 278 18.018 277.928 17.706C277.868 17.394 277.706 17.1 277.442 16.824C277.202 16.572 276.89 16.374 276.506 16.23C276.122 16.074 275.642 15.912 275.066 15.744L273.014 15.168C272.954 15.156 272.87 15.132 272.762 15.096C272.654 15.06 272.54 15.024 272.42 14.988C272.312 14.94 272.204 14.892 272.096 14.844C271.988 14.796 271.898 14.742 271.826 14.682C271.682 14.562 271.592 14.442 271.556 14.322C271.532 14.202 271.52 14.076 271.52 13.944C271.52 13.812 271.532 13.692 271.556 13.584C271.58 13.464 271.658 13.356 271.79 13.26C271.91 13.164 272.03 13.11 272.15 13.098C272.282 13.086 272.408 13.08 272.528 13.08H277.586V11.46H272.204C272 11.46 271.79 11.466 271.574 11.478C271.37 11.49 271.166 11.526 270.962 11.586C270.77 11.634 270.584 11.718 270.404 11.838C270.224 11.946 270.062 12.096 269.918 12.288C269.726 12.552 269.6 12.828 269.54 13.116C269.492 13.404 269.468 13.668 269.468 13.908C269.468 14.148 269.492 14.412 269.54 14.7C269.6 14.988 269.726 15.264 269.918 15.528C270.11 15.792 270.38 16.02 270.728 16.212C271.076 16.392 271.502 16.548 272.006 16.68L273.842 17.184C274.178 17.28 274.448 17.358 274.652 17.418C274.856 17.478 275.018 17.532 275.138 17.58C275.27 17.628 275.366 17.67 275.426 17.706C275.486 17.73 275.534 17.76 275.57 17.796C275.69 17.904 275.762 18.018 275.786 18.138C275.822 18.258 275.84 18.384 275.84 18.516C275.84 18.588 275.834 18.684 275.822 18.804C275.81 18.912 275.756 19.014 275.66 19.11C275.564 19.23 275.45 19.308 275.318 19.344C275.186 19.368 275.066 19.38 274.958 19.38H269.594V21ZM284.648 21V19.38H284.126C283.934 19.38 283.67 19.362 283.334 19.326C283.01 19.29 282.728 19.17 282.488 18.966C282.332 18.846 282.212 18.702 282.128 18.534C282.056 18.354 282.002 18.174 281.966 17.994C281.942 17.814 281.93 17.634 281.93 17.454C281.93 17.262 281.93 17.082 281.93 16.914V13.08H284.594V11.46H281.93V8.4H279.824V11.46H278.51V13.08H279.824V17.886C279.824 18.498 279.902 18.99 280.058 19.362C280.226 19.734 280.466 20.046 280.778 20.298C281.078 20.538 281.414 20.718 281.786 20.838C282.17 20.946 282.686 21 283.334 21H284.648ZM290.189 11.352C289.901 11.352 289.589 11.358 289.253 11.37C288.917 11.382 288.575 11.424 288.227 11.496C287.879 11.556 287.543 11.658 287.219 11.802C286.895 11.934 286.601 12.12 286.337 12.36C286.061 12.612 285.839 12.912 285.671 13.26C285.515 13.596 285.395 13.944 285.311 14.304C285.227 14.652 285.173 15 285.149 15.348C285.125 15.696 285.113 16.002 285.113 16.266C285.113 16.506 285.125 16.794 285.149 17.13C285.173 17.454 285.221 17.796 285.293 18.156C285.377 18.504 285.497 18.846 285.653 19.182C285.821 19.518 286.049 19.818 286.337 20.082C286.601 20.322 286.895 20.514 287.219 20.658C287.543 20.79 287.879 20.892 288.227 20.964C288.575 21.024 288.917 21.06 289.253 21.072C289.589 21.096 289.901 21.108 290.189 21.108C290.465 21.108 290.771 21.096 291.107 21.072C291.443 21.06 291.785 21.024 292.133 20.964C292.493 20.892 292.835 20.79 293.159 20.658C293.495 20.514 293.789 20.322 294.041 20.082C294.389 19.746 294.677 19.272 294.905 18.66C295.145 18.036 295.265 17.214 295.265 16.194C295.265 15.942 295.253 15.648 295.229 15.312C295.205 14.976 295.151 14.634 295.067 14.286C294.983 13.938 294.857 13.596 294.689 13.26C294.533 12.912 294.317 12.612 294.041 12.36C293.777 12.12 293.483 11.934 293.159 11.802C292.835 11.658 292.499 11.556 292.151 11.496C291.803 11.424 291.461 11.382 291.125 11.37C290.789 11.358 290.477 11.352 290.189 11.352ZM287.291 16.248C287.291 16.092 287.291 15.906 287.291 15.69C287.303 15.474 287.327 15.252 287.363 15.024C287.399 14.784 287.459 14.55 287.543 14.322C287.627 14.094 287.741 13.896 287.885 13.728C288.029 13.56 288.197 13.428 288.389 13.332C288.593 13.224 288.797 13.146 289.001 13.098C289.205 13.038 289.409 13.002 289.613 12.99C289.829 12.978 290.021 12.972 290.189 12.972C290.381 12.972 290.579 12.978 290.783 12.99C290.987 13.002 291.185 13.038 291.377 13.098C291.581 13.146 291.773 13.224 291.953 13.332C292.145 13.428 292.319 13.56 292.475 13.728C292.643 13.908 292.769 14.112 292.853 14.34C292.937 14.556 292.997 14.778 293.033 15.006C293.069 15.234 293.087 15.456 293.087 15.672C293.087 15.876 293.087 16.068 293.087 16.248C293.087 16.668 293.057 17.094 292.997 17.526C292.949 17.958 292.769 18.348 292.457 18.696C292.145 19.044 291.785 19.266 291.377 19.362C290.981 19.446 290.585 19.488 290.189 19.488C289.805 19.488 289.403 19.446 288.983 19.362C288.575 19.266 288.215 19.044 287.903 18.696C287.603 18.348 287.423 17.952 287.363 17.508C287.315 17.064 287.291 16.644 287.291 16.248ZM296.456 21H298.562V15.618C298.562 15.258 298.592 14.916 298.652 14.592C298.712 14.268 298.844 13.986 299.048 13.746C299.3 13.446 299.594 13.26 299.93 13.188C300.266 13.116 300.572 13.08 300.848 13.08H301.73V11.46H300.308C300.128 11.46 299.918 11.466 299.678 11.478C299.438 11.49 299.186 11.526 298.922 11.586C298.67 11.634 298.412 11.718 298.148 11.838C297.896 11.946 297.662 12.096 297.446 12.288C297.038 12.636 296.768 13.056 296.636 13.548C296.516 14.028 296.456 14.532 296.456 15.06V21ZM311.09 21V19.38H306.428C306.236 19.38 306.038 19.368 305.834 19.344C305.642 19.32 305.456 19.272 305.276 19.2C305.096 19.116 304.94 19.002 304.808 18.858C304.676 18.702 304.574 18.498 304.502 18.246C304.466 18.102 304.436 17.898 304.412 17.634C304.388 17.37 304.376 17.136 304.376 16.932H309.92C310.112 16.932 310.292 16.908 310.46 16.86C310.64 16.812 310.802 16.716 310.946 16.572C311.15 16.368 311.276 16.14 311.324 15.888C311.372 15.624 311.396 15.372 311.396 15.132C311.396 14.832 311.378 14.538 311.342 14.25C311.306 13.95 311.234 13.668 311.126 13.404C311.03 13.128 310.892 12.876 310.712 12.648C310.544 12.42 310.322 12.216 310.046 12.036C309.602 11.76 309.104 11.592 308.552 11.532C308.012 11.46 307.46 11.424 306.896 11.424C306.668 11.424 306.404 11.43 306.104 11.442C305.804 11.454 305.492 11.49 305.168 11.55C304.844 11.598 304.52 11.682 304.196 11.802C303.884 11.922 303.596 12.096 303.332 12.324C303.068 12.552 302.858 12.804 302.702 13.08C302.558 13.356 302.444 13.662 302.36 13.998C302.288 14.322 302.24 14.682 302.216 15.078C302.204 15.462 302.198 15.876 302.198 16.32C302.198 16.956 302.234 17.58 302.306 18.192C302.378 18.804 302.57 19.338 302.882 19.794C303.074 20.07 303.29 20.292 303.53 20.46C303.77 20.616 304.016 20.736 304.268 20.82C304.52 20.904 304.778 20.958 305.042 20.982C305.306 20.994 305.558 21 305.798 21H311.09ZM304.376 15.312C304.388 15 304.406 14.712 304.43 14.448C304.466 14.172 304.592 13.914 304.808 13.674C304.952 13.518 305.108 13.398 305.276 13.314C305.456 13.218 305.636 13.152 305.816 13.116C305.996 13.08 306.17 13.062 306.338 13.062C306.506 13.05 306.662 13.044 306.806 13.044C307.106 13.044 307.412 13.068 307.724 13.116C308.048 13.152 308.342 13.272 308.606 13.476C308.762 13.596 308.9 13.764 309.02 13.98C309.152 14.196 309.218 14.454 309.218 14.754C309.218 14.886 309.188 15.012 309.128 15.132C309.08 15.252 308.954 15.312 308.75 15.312H304.376Z" fill="black"/>
</svg>
