[gd_scene load_steps=2 format=2]

[ext_resource path="res://Assets/sound/game_over.ogg" type="AudioStream" id=1]

[node name="GameOver" type="AudioStreamPlayer2D"]
stream = ExtResource( 1 )
volume_db = -20.371
autoplay = true
