[gd_scene load_steps=3 format=2]

[sub_resource type="GDScript" id=1]
script/source = "extends Area2D

export (String) var sceneName = \"Level1\"

func _on_MinusNyawa_body_entered(body):
	if body.get_name() == \"Player\":
		if (global.lives == 0):
			get_tree().change_scene(str(\"res://Scenes/GameOver.tscn\"))
		else :
			global.lives -=1
			global.kunci = 0 
			get_tree().change_scene(str(\"res://Scenes/Level1/\" + sceneName + \".tscn\"))
		
"

[sub_resource type="RectangleShape2D" id=2]
extents = Vector2( 659.444, 27.7144 )

[node name="MinusNyawa" type="Area2D"]
script = SubResource( 1 )

[node name="CollisionShape2D" type="CollisionShape2D" parent="."]
position = Vector2( 479.718, 636.077 )
shape = SubResource( 2 )
[connection signal="body_entered" from="." to="." method="_on_MinusNyawa_body_entered"]
