[gd_scene load_steps=4 format=2]

[ext_resource path="res://Assets/object/jagung.png" type="Texture" id=1]
[ext_resource path="res://Scripts/Level1/jagung.gd" type="Script" id=2]



[sub_resource type="RectangleShape2D" id=1]
extents = Vector2( 21.3217, 11.3656 )

[node name="Jagung" type="RigidBody2D"]
contacts_reported = 10
contact_monitor = true
script = ExtResource( 2 )

[node name="CollisionShape2D" type="CollisionShape2D" parent="."]
shape = SubResource( 1 )

[node name="Sprite" type="Sprite" parent="."]
position = Vector2( -1.20221, 0.17157 )
scale = Vector2( 0.0351305, 0.0395246 )
texture = ExtResource( 1 )
[connection signal="body_exited" from="." to="." method="_on_Jagung_body_exited"]
