[gd_scene load_steps=5 format=2]

[ext_resource path="res://Assets/spritesheet/tile - cake/slice04_04.png" type="Texture" id=1]
[ext_resource path="res://Assets/spritesheet/tile - cake/slice02_02.png" type="Texture" id=2]
[ext_resource path="res://Assets/spritesheet/tile - cake/slice03_03.png" type="Texture" id=3]

[sub_resource type="RectangleShape2D" id=1]
extents = Vector2( 115.508, 27.4984 )

[node name="StaticBody2D" type="StaticBody2D"]

[node name="Sprite" type="Sprite" parent="."]
position = Vector2( 31.7027, 576.297 )
scale = Vector2( 0.833513, 0.788108 )
texture = ExtResource( 2 )

[node name="Sprite2" type="Sprite" parent="."]
position = Vector2( 88.8919, 576.297 )
scale = Vector2( 0.833513, 0.788108 )
texture = ExtResource( 3 )

[node name="Sprite3" type="Sprite" parent="."]
position = Vector2( 146.543, 576.331 )
scale = Vector2( 0.833513, 0.788108 )
texture = ExtResource( 3 )

[node name="Sprite4" type="Sprite" parent="."]
position = Vector2( 204.233, 576.381 )
scale = Vector2( 0.836516, 0.791111 )
texture = ExtResource( 1 )

[node name="CollisionShape2D" type="CollisionShape2D" parent="."]
position = Vector2( 118.086, 576.25 )
shape = SubResource( 1 )
