[gd_scene load_steps=8 format=2]

[ext_resource path="res://Assets/background/Cartoon_Forest_BG_04.png" type="Texture" id=1]
[ext_resource path="res://Scenes/Kunci.tscn" type="PackedScene" id=2]
[ext_resource path="res://Scenes/Nyawa.tscn" type="PackedScene" id=3]
[ext_resource path="res://Scenes/Level2/Cake1.tscn" type="PackedScene" id=4]
[ext_resource path="res://Scenes/Player.tscn" type="PackedScene" id=5]
[ext_resource path="res://Scenes/Pembatas.tscn" type="PackedScene" id=6]
[ext_resource path="res://Scenes/Level2/MinusNyawaL2.tscn" type="PackedScene" id=7]

[node name="Node2D" type="Node2D"]

[node name="Sprite" type="Sprite" parent="."]
position = Vector2( 513.36, 299.814 )
scale = Vector2( 0.553638, 0.56526 )
texture = ExtResource( 1 )

[node name="Label" parent="." instance=ExtResource( 3 )]

[node name="Label2" parent="." instance=ExtResource( 2 )]

[node name="StaticBody2D" parent="." instance=ExtResource( 4 )]

[node name="StaticBody2D2" parent="." instance=ExtResource( 4 )]
position = Vector2( 792.478, -4.23785 )

[node name="StaticBody2D3" parent="." instance=ExtResource( 4 )]
position = Vector2( 402.596, -444.974 )

[node name="Player" parent="." instance=ExtResource( 5 )]
position = Vector2( -2.99661, 427.018 )

[node name="Pembatas" parent="." instance=ExtResource( 6 )]

[node name="MinusNyawaL2" parent="." instance=ExtResource( 7 )]
position = Vector2( 17.6389, -2.5199 )
