[gd_scene load_steps=4 format=2]

[ext_resource path="res://Scripts/Level2/PermenEnak.gd" type="Script" id=1]
[ext_resource path="res://Assets/object/candyBlue.png" type="Texture" id=2]

[sub_resource type="RectangleShape2D" id=1]
extents = Vector2( 31.1727, 23.5131 )

[node name="PermenEnak" type="RigidBody2D"]
position = Vector2( 545.886, 50.9117 )
gravity_scale = 0.0
contacts_reported = 1
contact_monitor = true
script = ExtResource( 1 )

[node name="Sprite" type="Sprite" parent="."]
position = Vector2( -4.41687, 57.8 )
scale = Vector2( 1.22449, 1.17639 )
texture = ExtResource( 2 )

[node name="CollisionShape2D" type="CollisionShape2D" parent="."]
position = Vector2( -5.44666, 76.1086 )
shape = SubResource( 1 )
[connection signal="body_exited" from="." to="." method="_on_RigidBody2D_body_exited"]
