{
  "type": "carousel",
  "contents": [
    {
      "type": "bubble",
      "hero": {
        "type": "image",
        "size": "full",
        "aspectRatio": "20:13",
        "aspectMode": "cover",
        "url": "https://i.ibb.co/qdNBGDf/3.png"
      },
      "body": {
        "type": "box",
        "layout": "vertical",
        "contents": [
          {
            "type": "spacer",
            "size": "md"
          },
          {
            "type": "button",
            "action": {
              "type": "message",
              "label": "Catat Pengeluaran",
              "text": "Catat Pengeluaran"
            },
            "style": "primary",
            "color": "#348255",
            "height": "sm"
          }
        ],
        "borderColor": "#348255"
      },
      "footer": {
        "type": "box",
        "layout": "vertical",
        "contents": [
          {
            "type": "separator",
            "color": "#348255"
          },
          {
            "type": "text",
            "text": "• Action Menu •",
            "size": "sm",
            "align": "center"
          }
        ],
        "height": "30px"
      },
      "styles": {
        "header": {
          "backgroundColor": "#348255"
        }
      }
    },
    {
      "type": "bubble",
      "hero": {
        "type": "image",
        "url": "https://i.ibb.co/f1CpkSx/4.png",
        "size": "full",
        "aspectRatio": "20:13",
        "aspectMode": "cover"
      },
      "body": {
        "type": "box",
        "layout": "vertical",
        "contents": [
          {
            "type": "spacer",
            "size": "md"
          },
          {
            "type": "button",
            "action": {
              "type": "message",
              "label": "Atur Budget",
              "text": "Atur Budget"
            },
            "style": "primary",
            "color": "#348255",
            "height": "sm"
          }
        ]
      },
      "footer": {
        "type": "box",
        "layout": "vertical",
        "contents": [
          {
            "type": "separator",
            "color": "#348255"
          },
          {
            "type": "text",
            "text": "• Action Menu •",
            "size": "sm",
            "align": "center"
          }
        ],
        "height": "30px"
      },
      "styles": {
        "header": {
          "backgroundColor": "#348255"
        }
      }
    },
    {
      "type": "bubble",
      "hero": {
        "type": "image",
        "size": "full",
        "aspectRatio": "20:13",
        "aspectMode": "cover",
        "url": "https://i.ibb.co/7t08Jh6/2.png"
      },
      "body": {
        "type": "box",
        "layout": "vertical",
        "contents": [
          {
            "type": "spacer",
            "size": "md"
          },
          {
            "type": "button",
            "action": {
              "type": "message",
              "label": "Sisa Budget",
              "text": "Sisa Budget"
            },
            "style": "primary",
            "color": "#348255",
            "height": "sm"
          }
        ],
        "borderColor": "#348255"
      },
      "footer": {
        "type": "box",
        "layout": "vertical",
        "contents": [
          {
            "type": "separator",
            "color": "#348255"
          },
          {
            "type": "text",
            "text": "• Action Menu •",
            "size": "sm",
            "align": "center"
          }
        ],
        "height": "30px"
      },
      "styles": {
        "header": {
          "backgroundColor": "#348255"
        }
      }
    },
    {
      "type": "bubble",
      "hero": {
        "type": "image",
        "size": "full",
        "aspectRatio": "20:13",
        "aspectMode": "cover",
        "url": "https://i.ibb.co/PTBWNbN/5.png"
      },
      "body": {
        "type": "box",
        "layout": "vertical",
        "contents": [
          {
            "type": "spacer",
            "size": "md"
          },
          {
            "type": "button",
            "action": {
              "type": "message",
              "label": "Lihat Laporan",
              "text": "Lihat Laporan"
            },
            "style": "primary",
            "color": "#348255",
            "height": "sm"
          }
        ],
        "borderColor": "#348255"
      },
      "footer": {
        "type": "box",
        "layout": "vertical",
        "contents": [
          {
            "type": "separator",
            "color": "#348255"
          },
          {
            "type": "text",
            "text": "Action Menu",
            "size": "sm",
            "align": "center"
          }
        ],
        "height": "30px"
      },
      "styles": {
        "header": {
          "backgroundColor": "#348255"
        }
      }
    },
    {
      "type": "bubble",
      "hero": {
        "type": "image",
        "size": "full",
        "aspectRatio": "20:13",
        "aspectMode": "cover",
        "url": "https://i.ibb.co/VMFkcfY/6.png"
      },
      "body": {
        "type": "box",
        "layout": "vertical",
        "contents": [
          {
            "type": "spacer",
            "size": "md"
          },
          {
            "type": "button",
            "action": {
              "type": "message",
              "label": "Ingatkan Saya",
              "text": "Ingatkan Saya"
            },
            "style": "primary",
            "color": "#348255",
            "height": "sm"
          }
        ],
        "borderColor": "#348255"
      },
      "footer": {
        "type": "box",
        "layout": "vertical",
        "contents": [
          {
            "type": "separator",
            "color": "#348255"
          },
          {
            "type": "text",
            "text": "• Action Menu •",
            "size": "sm",
            "align": "center"
          }
        ],
        "height": "30px"
      },
      "styles": {
        "header": {
          "backgroundColor": "#348255"
        }
      }
    }
  ]
}
