{
  "type": "bubble",
  "hero": {
    "type": "image",
    "url": "https://files.catbox.moe/02n9ge.png",
    "size": "full",
    "aspectRatio": "20:13",
    "aspectMode": "cover",
    "action": {
      "type": "message",
      "text": "menu"
    }
  },
  "body": {
    "type": "box",
    "layout": "vertical",
    "contents": [
      {
        "type": "box",
        "layout": "horizontal",
        "contents": [
          {
            "type": "text",
            "text": "Catat Pengeluaran",
            "size": "xl",
            "color": "#348255",
            "weight": "bold",
            "decoration": "none"
          }
        ]
      },
      {
        "type": "separator",
        "margin": "lg"
      },
      {
        "type": "box",
        "layout": "horizontal",
        "contents": [
          {
            "type": "box",
            "layout": "vertical",
            "contents": [
              {
                "type": "image",
                "url": "https://files.catbox.moe/qtiriw.png",
                "aspectMode": "cover",
                "aspectRatio": "1.51:1",
                "size": "full",
                "action": {
                  "type": "message",
                  "text": "Makanan"
                }
              },
              {
                "type": "separator",
                "margin": "none"
              },
              {
                "type": "image",
                "url": "https://files.catbox.moe/ftpawv.png",
                "size": "full",
                "aspectMode": "cover",
                "aspectRatio": "1.51:1",
                "action": {
                  "type": "message",
                  "text": "Tagihan"
                }
              }
            ],
            "flex": 1
          },
          {
            "type": "separator"
          },
          {
            "type": "box",
            "layout": "vertical",
            "contents": [
              {
                "type": "image",
                "url": "https://files.catbox.moe/gqafbt.png",
                "size": "full",
                "aspectMode": "cover",
                "aspectRatio": "1.51:1",
                "action": {
                  "type": "message",
                  "text": "Transportasi"
                }
              },
              {
                "type": "separator"
              },
              {
                "type": "image",
                "url": "https://files.catbox.moe/v3udib.png",
                "aspectRatio": "1.51:1",
                "size": "full",
                "aspectMode": "cover",
                "action": {
                  "type": "message",
                  "text": "Belanja"
                }
              }
            ]
          }
        ],
        "paddingTop": "0px",
        "paddingBottom": "0px"
      },
      {
        "type": "separator"
      },
      {
        "type": "box",
        "layout": "horizontal",
        "contents": [
          {
            "type": "image",
            "url": "https://files.catbox.moe/62wud2.png",
            "aspectMode": "fit",
            "aspectRatio": "3:1",
            "size": "4xl",
            "action": {
              "type": "message",
              "text": "Lainnya"
            }
          }
        ],
        "spacing": "none",
        "margin": "none"
      },
      {
        "type": "separator"
      }
    ],
    "spacing": "none",
    "paddingBottom": "0px"
  },
  "footer": {
    "type": "box",
    "layout": "vertical",
    "spacing": "none",
    "contents": [
      {
        "type": "button",
        "style": "primary",
        "height": "sm",
        "action": {
          "type": "message",
          "label": "Batal",
          "text": "Batal"
        },
        "color": "#348255"
      },
      {
        "type": "spacer",
        "size": "sm"
      }
    ],
    "flex": 0,
    "margin": "none"
  },
  "styles": {
    "body": {
      "separator": false
    }
  }
}