{
	"resources":[
		[
			["O","I","E"],
			["I","I","X"],
			["E","X","E"]
		],
		[
			["E","I","O","I","E","I","O","E","I","O"]
		],
		[
			["1","2","3","4","5"],
			["6","7","8","9","1"],
			["2","3","4","5","6"],
			["7","8","9","1","2"],
			["3","4","5","6","7"]
		],
		[
			["E","A","E","A","E"],
			["A","I","I","I","A"],
			["E","I","O","I","E"],
			["A","I","I","I","A"],
			["E","A","E","A","E"]
		],
		[
			["O","X"],
			["I","O"],
			["E","X"],
			["I","I"],
			["O","X"],
			["I","E"],
			["E","X"]
		]
	]
}