{
  "projectName": "CANopen Library Toolset",
  "sourceIdentifier": "CAN-N7S-CANDP-SRS-A",
  "version": "2.1",
  "importDate": "2024-10-03T14:05:27.6900924+00:00",
  "requirements": [
    {
      "identifier": "SRS-CANSW-FUN-SDO-001",
      "verificationMethod": "Test",
      "text": "CANSW shall implement SDO service compliant with ECSS Standard Clause 6.1a [AD2]",
      "note": "ECSS standard defines SDO as optional, CANSW has to provide SDO but do not require it to be used by the user.",
      "justification": "",
      "traces": [
        {
          "source": "AD2",
          "identifier": "6.1a"
        }
      ],
      "design": {
        "components": [
          "liblely-co"
        ]
      }
    },
    {
      "identifier": "SRS-CANSW-FUN-SDO-002",
      "verificationMethod": "Test",
      "text": "CANSW shall provide SDO expedited download service.",
      "note": "ECSS standard references chapters 7.2.4.2.2-3 and 7.2.4.3.2-3 of the CiA [RD5].",
      "justification": "",
      "traces": [
        {
          "source": "AD2",
          "identifier": "6.1a"
        }
      ],
      "design": {
        "components": [
          "liblely-co"
        ]
      }
    },
    {
      "identifier": "SRS-CANSW-FUN-SDO-003",
      "verificationMethod": "Test",
      "text": "CANSW shall provide SDO expedited upload service.",
      "note": "ECSS standard references chapters 7.2.4.2.5-6 and 7.2.4.3.5-6 of the CiA [RD5].",
      "justification": "",
      "traces": [
        {
          "source": "AD2",
          "identifier": "6.1a"
        }
      ],
      "design": {
        "components": [
          "liblely-co"
        ]
      }
    },
    {
      "identifier": "SRS-CANSW-FUN-SDO-004",
      "verificationMethod": "Test",
      "text": "CANSW shall provide SDO segmented download service.",
      "note": "ECSS standard references chapters 7.2.4.2.2-4 and 7.2.4.3.2-4 of the CiA [RD5].",
      "justification": "",
      "traces": [
        {
          "source": "AD2",
          "identifier": "6.1a"
        }
      ],
      "design": {
        "components": [
          "liblely-co"
        ]
      }
    },
    {
      "identifier": "SRS-CANSW-FUN-SDO-005",
      "verificationMethod": "Test",
      "text": "CANSW shall provide SDO segmented upload service.",
      "note": "ECSS standard references chapters 7.2.4.2.5-7 and 7.2.4.3.5-7 of the CiA [RD5].",
      "justification": "",
      "traces": [
        {
          "source": "AD2",
          "identifier": "6.1a"
        }
      ],
      "design": {
        "components": [
          "liblely-co"
        ]
      }
    },
    {
      "identifier": "SRS-CANSW-FUN-SDO-006",
      "verificationMethod": "Test",
      "text": "CANSW shall provide SDO block download service.",
      "note": "ECSS standard references chapters 7.2.4.2.2-3,8-11 and 7.2.4.3.2-3,8-11 of the CiA [RD5].",
      "justification": "",
      "traces": [
        {
          "source": "AD2",
          "identifier": "6.1a"
        }
      ],
      "design": {
        "components": [
          "liblely-co"
        ]
      }
    },
    {
      "identifier": "SRS-CANSW-FUN-SDO-007",
      "verificationMethod": "Test",
      "text": "CANSW shall provide SDO block upload service.",
      "note": "ECSS standard references chapters 7.2.4.2.5-7,12-15 and 7.2.4.3.5-7,12-15 of the CiA [RD5].",
      "justification": "",
      "traces": [
        {
          "source": "AD2",
          "identifier": "6.1a"
        }
      ],
      "design": {
        "components": [
          "liblely-co"
        ]
      }
    },
    {
      "identifier": "SRS-CANSW-FUN-SDO-008",
      "verificationMethod": "Test",
      "text": "CANSW shall provide SDO abort transfer service.",
      "note": "ECSS standard references chapters 7.2.4.2.16 and 7.2.4.3.17 of the CiA [RD5].",
      "justification": "",
      "traces": [
        {
          "source": "AD2",
          "identifier": "6.1a"
        }
      ],
      "design": {
        "components": [
          "liblely-co"
        ]
      }
    },
    {
      "identifier": "SRS-CANSW-FUN-SDO-910",
      "verificationMethod": "Test",
      "text": "CANSW SDO service shall support objects with BOOLEAN data type.",
      "note": "Type defined in chapter 7.1.4.3 of the CiA [RD5].",
      "justification": "",
      "traces": [
        {
          "source": "AD2",
          "identifier": "6.1a"
        },
        {
          "source": "AD2",
          "identifier": "11"
        }
      ],
      "design": {
        "components": [
          "liblely-co"
        ]
      }
    },
    {
      "identifier": "SRS-CANSW-FUN-SDO-920",
      "verificationMethod": "Test",
      "text": "CANSW SDO service shall support objects with signed integer data type, including:\n \u2022 INTEGER8\n \u2022 INTEGER16\n \u2022 INTEGER24\n \u2022 INTEGER32\n \u2022 INTEGER40\n \u2022 INTEGER48\n \u2022 INTEGER56\n \u2022 INTEGER64",
      "note": "Type defined in chapter 7.1.4.6 of the CiA [RD5].",
      "justification": "",
      "traces": [
        {
          "source": "AD2",
          "identifier": "6.1a"
        },
        {
          "source": "AD2",
          "identifier": "11"
        }
      ],
      "design": {
        "components": [
          "liblely-co"
        ]
      }
    },
    {
      "identifier": "SRS-CANSW-FUN-SDO-930",
      "verificationMethod": "Test",
      "text": "CANSW SDO service shall support objects with unsigned integer data type, including:\n \u2022 UNINTEGER8\n \u2022 UNINTEGER16\n \u2022 UNINTEGER24\n \u2022 UNINTEGER32\n \u2022 UNINTEGER40\n \u2022 UNINTEGER48\n \u2022 UNINTEGER56\n \u2022 UNINTEGER64",
      "note": "Type defined in chapter 7.1.4.5 of the CiA [RD5].",
      "justification": "",
      "traces": [
        {
          "source": "AD2",
          "identifier": "6.1a"
        },
        {
          "source": "AD2",
          "identifier": "11"
        }
      ],
      "design": {
        "components": [
          "liblely-co"
        ]
      }
    },
    {
      "identifier": "SRS-CANSW-FUN-SDO-940",
      "verificationMethod": "Test",
      "text": "CANSW SDO service shall support objects with floating-point number data type, including:\n \u2022 REAL32\n \u2022 REAL64",
      "note": "Type defined in chapter 7.1.4.7 of the CiA [RD5].",
      "justification": "",
      "traces": [
        {
          "source": "AD2",
          "identifier": "6.1a"
        },
        {
          "source": "AD2",
          "identifier": "11"
        }
      ],
      "design": {
        "components": [
          "liblely-co"
        ]
      }
    },
    {
      "identifier": "SRS-CANSW-FUN-SDO-950",
      "verificationMethod": "Test",
      "text": "CANSW SDO service shall support objects with OCTET_STRING data type.",
      "note": "Type defined in chapter 7.1.6.2 of the CiA [RD5].",
      "justification": "",
      "traces": [
        {
          "source": "AD2",
          "identifier": "6.1a"
        },
        {
          "source": "AD2",
          "identifier": "11"
        }
      ],
      "design": {
        "components": [
          "liblely-co"
        ]
      }
    },
    {
      "identifier": "SRS-CANSW-FUN-SDO-955",
      "verificationMethod": "Test",
      "text": "CANSW SDO service shall support objects with VISIBLE_STRING data type.",
      "note": "Type defined in chapter 7.1.6.3 of the CiA [RD5].",
      "justification": "",
      "traces": [
        {
          "source": "AD2",
          "identifier": "6.1a"
        },
        {
          "source": "AD2",
          "identifier": "11"
        }
      ],
      "design": {
        "components": [
          "liblely-co"
        ]
      }
    },
    {
      "identifier": "SRS-CANSW-FUN-SDO-960",
      "verificationMethod": "Test",
      "text": "CANSW SDO service shall support objects with UNICODE_STRING data type.",
      "note": "Type defined in chapter 7.1.6.4 of the CiA [RD5].",
      "justification": "",
      "traces": [
        {
          "source": "AD2",
          "identifier": "6.1a"
        },
        {
          "source": "AD2",
          "identifier": "11"
        }
      ],
      "design": {
        "components": [
          "liblely-co"
        ]
      }
    },
    {
      "identifier": "SRS-CANSW-FUN-SDO-970",
      "verificationMethod": "Test",
      "text": "CANSW SDO service shall support objects with DOMAIN data type.",
      "note": "Type defined in chapter 7.1.6.7 of the CiA [RD5].",
      "justification": "",
      "traces": [
        {
          "source": "AD2",
          "identifier": "6.1a"
        },
        {
          "source": "AD2",
          "identifier": "11"
        }
      ],
      "design": {
        "components": [
          "liblely-co"
        ]
      }
    },
    {
      "identifier": "SRS-CANSW-FUN-SDO-990",
      "verificationMethod": "Test",
      "text": "CANSW SDO service shall support objects with TIME_OF_DAY data type.",
      "note": "Type defined in chapter 7.1.6.5 of the CiA [RD5].",
      "justification": "",
      "traces": [
        {
          "source": "AD2",
          "identifier": "6.1a"
        },
        {
          "source": "AD2",
          "identifier": "11"
        }
      ],
      "design": {
        "components": [
          "liblely-co"
        ]
      }
    },
    {
      "identifier": "SRS-CANSW-FUN-SDO-995",
      "verificationMethod": "Test",
      "text": "CANSW SDO service shall support objects with TIME_DIFFERENCE data type.",
      "note": "Type defined in chapter 7.1.6.6 of the CiA [RD5].",
      "justification": "",
      "traces": [
        {
          "source": "AD2",
          "identifier": "6.1a"
        },
        {
          "source": "AD2",
          "identifier": "11"
        }
      ],
      "design": {
        "components": [
          "liblely-co"
        ]
      }
    },
    {
      "identifier": "SRS-CANSW-FUN-SDO-1000",
      "verificationMethod": "Test",
      "text": "CANSW SDO service shall support objects with Spacecraft elapsed time (SCET) data type.",
      "note": "Type defined in chapter 7.1.2 of the ECSS Standard [AD2].",
      "justification": "",
      "traces": [
        {
          "source": "AD2",
          "identifier": "7.1.2"
        }
      ],
      "design": {
        "components": [
          "liblely-co"
        ]
      }
    },
    {
      "identifier": "SRS-CANSW-FUN-SDO-1005",
      "verificationMethod": "Test",
      "text": "CANSW SDO service shall support objects with Spacecraft universal time coordinated (UTC) data type.",
      "note": "Type defined in chapter 7.1.3 of the ECSS Standard [AD2].",
      "justification": "",
      "traces": [
        {
          "source": "AD2",
          "identifier": "7.1.3"
        }
      ],
      "design": {
        "components": [
          "liblely-co"
        ]
      }
    },
    {
      "identifier": "SRS-CANSW-FUN-PDO-001",
      "verificationMethod": "Test",
      "text": "CANSW shall implement PDO service compliant with ECSS Standard Clause 6.2a [AD2]",
      "note": "",
      "justification": "",
      "traces": [
        {
          "source": "AD2",
          "identifier": "6.2a"
        }
      ],
      "design": {
        "components": [
          "liblely-co"
        ]
      }
    },
    {
      "identifier": "SRS-CANSW-FUN-PDO-002",
      "verificationMethod": "Test",
      "text": "CANSW shall be provide Synchronously Triggered PDO transmission.",
      "note": "",
      "justification": "",
      "traces": [
        {
          "source": "AD2",
          "identifier": "6.2a"
        }
      ],
      "design": {
        "components": [
          "liblely-co"
        ]
      }
    },
    {
      "identifier": "SRS-CANSW-FUN-PDO-003",
      "verificationMethod": "Test",
      "text": "CANSW shall be provide Event and Timer Driven PDO transmission.",
      "note": "",
      "justification": "",
      "traces": [
        {
          "source": "AD2",
          "identifier": "6.2a"
        }
      ],
      "design": {
        "components": [
          "liblely-co"
        ]
      }
    },
    {
      "identifier": "SRS-CANSW-FUN-PDO-910",
      "verificationMethod": "Test",
      "text": "CANSW PDO service shall support objects with BOOLEAN data type.",
      "note": "Type defined in chapter 7.1.4.3 of the CiA [RD5].",
      "justification": "",
      "traces": [
        {
          "source": "AD2",
          "identifier": "6.2a"
        },
        {
          "source": "AD2",
          "identifier": "11"
        }
      ],
      "design": {
        "components": [
          "liblely-co"
        ]
      }
    },
    {
      "identifier": "SRS-CANSW-FUN-PDO-920",
      "verificationMethod": "Test",
      "text": "CANSW PDO service shall support objects with signed integer data type, including:\n \u2022 INTEGER8\n \u2022 INTEGER16\n \u2022 INTEGER24\n \u2022 INTEGER32\n \u2022 INTEGER40\n \u2022 INTEGER48\n \u2022 INTEGER56\n \u2022 INTEGER64",
      "note": "Type defined in chapter 7.1.4.6 of the CiA [RD5].",
      "justification": "",
      "traces": [
        {
          "source": "AD2",
          "identifier": "6.2a"
        },
        {
          "source": "AD2",
          "identifier": "11"
        }
      ],
      "design": {
        "components": [
          "liblely-co"
        ]
      }
    },
    {
      "identifier": "SRS-CANSW-FUN-PDO-930",
      "verificationMethod": "Test",
      "text": "CANSW PDO service shall support objects with unsigned integer data type, including:\n \u2022 UNINTEGER8\n \u2022 UNINTEGER16\n \u2022 UNINTEGER24\n \u2022 UNINTEGER32\n \u2022 UNINTEGER40\n \u2022 UNINTEGER48\n \u2022 UNINTEGER56\n \u2022 UNINTEGER64",
      "note": "Type defined in chapter 7.1.4.5 of the CiA [RD5].",
      "justification": "",
      "traces": [
        {
          "source": "AD2",
          "identifier": "6.2a"
        },
        {
          "source": "AD2",
          "identifier": "11"
        }
      ],
      "design": {
        "components": [
          "liblely-co"
        ]
      }
    },
    {
      "identifier": "SRS-CANSW-FUN-PDO-940",
      "verificationMethod": "Test",
      "text": "CANSW PDO service shall support objects with floating-point number data type, including:\n \u2022 REAL32\n \u2022 REAL64",
      "note": "Type defined in chapter 7.1.4.7 of the CiA [RD5].",
      "justification": "",
      "traces": [
        {
          "source": "AD2",
          "identifier": "6.2a"
        },
        {
          "source": "AD2",
          "identifier": "11"
        }
      ],
      "design": {
        "components": [
          "liblely-co"
        ]
      }
    },
    {
      "identifier": "SRS-CANSW-FUN-PDO-950",
      "verificationMethod": "Test",
      "text": "CANSW PDO service shall support objects with OCTET_STRING data type.",
      "note": "Type defined in chapter 7.1.6.2 of the CiA [RD5].",
      "justification": "",
      "traces": [
        {
          "source": "AD2",
          "identifier": "6.2a"
        },
        {
          "source": "AD2",
          "identifier": "11"
        }
      ],
      "design": {
        "components": [
          "liblely-co"
        ]
      }
    },
    {
      "identifier": "SRS-CANSW-FUN-PDO-955",
      "verificationMethod": "Test",
      "text": "CANSW PDO service shall support objects with VISIBLE_STRING data type.",
      "note": "Type defined in chapter 7.1.6.3 of the CiA [RD5].",
      "justification": "",
      "traces": [
        {
          "source": "AD2",
          "identifier": "6.2a"
        },
        {
          "source": "AD2",
          "identifier": "11"
        }
      ],
      "design": {
        "components": [
          "liblely-co"
        ]
      }
    },
    {
      "identifier": "SRS-CANSW-FUN-PDO-960",
      "verificationMethod": "Test",
      "text": "CANSW PDO service shall support objects with UNICODE_STRING data type.",
      "note": "Type defined in chapter 7.1.6.4 of the CiA [RD5].",
      "justification": "",
      "traces": [
        {
          "source": "AD2",
          "identifier": "6.2a"
        },
        {
          "source": "AD2",
          "identifier": "11"
        }
      ],
      "design": {
        "components": [
          "liblely-co"
        ]
      }
    },
    {
      "identifier": "SRS-CANSW-FUN-PDO-970",
      "verificationMethod": "Test",
      "text": "CANSW PDO service shall support objects with DOMAIN data type.",
      "note": "Type defined in chapter 7.1.6.7 of the CiA [RD5].",
      "justification": "",
      "traces": [
        {
          "source": "AD2",
          "identifier": "6.2a"
        },
        {
          "source": "AD2",
          "identifier": "11"
        }
      ],
      "design": {
        "components": [
          "liblely-co"
        ]
      }
    },
    {
      "identifier": "SRS-CANSW-FUN-PDO-990",
      "verificationMethod": "Test",
      "text": "CANSW PDO service shall support objects with TIME_OF_DAY data type.",
      "note": "Type defined in chapter 7.1.6.5 of the CiA [RD5].",
      "justification": "",
      "traces": [
        {
          "source": "AD2",
          "identifier": "6.2a"
        },
        {
          "source": "AD2",
          "identifier": "11"
        }
      ],
      "design": {
        "components": [
          "liblely-co"
        ]
      }
    },
    {
      "identifier": "SRS-CANSW-FUN-PDO-995",
      "verificationMethod": "Test",
      "text": "CANSW PDO service shall support objects with TIME_DIFFERENCE data type.",
      "note": "Type defined in chapter 7.1.6.6 of the CiA [RD5].",
      "justification": "",
      "traces": [
        {
          "source": "AD2",
          "identifier": "6.2a"
        },
        {
          "source": "AD2",
          "identifier": "11"
        }
      ],
      "design": {
        "components": [
          "liblely-co"
        ]
      }
    },
    {
      "identifier": "SRS-CANSW-FUN-PDO-1000",
      "verificationMethod": "Test",
      "text": "CANSW PDO service shall support objects with Spacecraft elapsed time (SCET) data type.",
      "note": "Type defined in chapter 7.1.2 of the ECSS Standard [AD2].",
      "justification": "",
      "traces": [
        {
          "source": "AD2",
          "identifier": "7.1.2"
        }
      ],
      "design": {
        "components": [
          "liblely-co"
        ]
      }
    },
    {
      "identifier": "SRS-CANSW-FUN-PDO-1005",
      "verificationMethod": "Test",
      "text": "CANSW PDO service shall support objects with Spacecraft universal time coordinated (UTC) data type.",
      "note": "Type defined in chapter 7.1.3 of the ECSS Standard [AD2].",
      "justification": "",
      "traces": [
        {
          "source": "AD2",
          "identifier": "7.1.3"
        }
      ],
      "design": {
        "components": [
          "liblely-co"
        ]
      }
    },
    {
      "identifier": "SRS-CANSW-FUN-SYNC-001",
      "verificationMethod": "Test",
      "text": "CANSW shall be compliant with ECSS Standard Clause 6.3b [AD2]",
      "note": "",
      "justification": "",
      "traces": [
        {
          "source": "AD2",
          "identifier": "6.3b"
        }
      ],
      "design": {
        "components": [
          "liblely-co"
        ]
      }
    },
    {
      "identifier": "SRS-CANSW-FUN-EMCY-001",
      "verificationMethod": "Test",
      "text": "CANSW shall be compliant with ECSS Standard Clause 6.4a [AD2]",
      "note": "Only point 2 of the clause applies, point 1 restricts the code of the CANSW user.",
      "justification": "",
      "traces": [
        {
          "source": "AD2",
          "identifier": "6.4a"
        }
      ],
      "design": {
        "components": [
          "liblely-co"
        ]
      }
    },
    {
      "identifier": "SRS-CANSW-FUN-EMCY-002",
      "verificationMethod": "Test",
      "text": "CANSW shall be compliant with ECSS Standard Clause 6.4b [AD2]",
      "note": "",
      "justification": "",
      "traces": [
        {
          "source": "AD2",
          "identifier": "6.4b"
        }
      ],
      "design": {
        "components": [
          "liblely-co"
        ]
      }
    },
    {
      "identifier": "SRS-CANSW-FUN-NMT-010",
      "verificationMethod": "Test",
      "text": "CANSW shall be compliant with ECSS Standard Clause 6.5.1a [AD2]",
      "note": "Standard puts this requirement on device (so on CANSW user), but it shall be interpreted as requirement on CANSW NMT implementation.",
      "justification": "",
      "traces": [
        {
          "source": "AD2",
          "identifier": "6.5.1a"
        }
      ],
      "design": {
        "components": [
          "liblely-co"
        ]
      }
    },
    {
      "identifier": "SRS-CANSW-FUN-NMT-011",
      "verificationMethod": "Test",
      "text": "CANSW user shall be able to use \"NMT service node\" to reset whole device.",
      "note": "",
      "justification": "",
      "traces": [
        {
          "source": "AD2",
          "identifier": "6.5.1a"
        }
      ],
      "design": {
        "components": [
          "liblely-co"
        ]
      }
    },
    {
      "identifier": "SRS-CANSW-FUN-NMT-020",
      "verificationMethod": "Test",
      "text": "CANSW shall be compliant with ECSS Standard Clause 6.5.2a [AD2]",
      "note": "",
      "justification": "",
      "traces": [
        {
          "source": "AD2",
          "identifier": "6.5.2a"
        }
      ],
      "design": {
        "components": [
          "liblely-co"
        ]
      }
    },
    {
      "identifier": "SRS-CANSW-FUN-NMT-021",
      "verificationMethod": "Test",
      "text": "CANSW shall be compliant with ECSS Standard Clause 6.5.2b [AD2]",
      "note": "",
      "justification": "",
      "traces": [
        {
          "source": "AD2",
          "identifier": "6.5.2b"
        }
      ],
      "design": {
        "components": [
          "liblely-co"
        ]
      }
    },
    {
      "identifier": "SRS-CANSW-FUN-NMT-030",
      "verificationMethod": "Test",
      "text": "CANSW shall be compliant with ECSS Standard Clause 6.5.3a [AD2]",
      "note": "",
      "justification": "",
      "traces": [
        {
          "source": "AD2",
          "identifier": "6.5.3a"
        }
      ],
      "design": {
        "components": [
          "liblely-co"
        ]
      }
    },
    {
      "identifier": "SRS-CANSW-FUN-NMT-040",
      "verificationMethod": "Test",
      "text": "CANSW shall be compliant with ECSS Standard Clause 6.5.4a [AD2]",
      "note": "",
      "justification": "",
      "traces": [
        {
          "source": "AD2",
          "identifier": "6.5.4a"
        }
      ],
      "design": {
        "components": [
          "liblely-co"
        ]
      }
    },
    {
      "identifier": "SRS-CANSW-FUN-NMT-BOOT-101",
      "verificationMethod": "Test",
      "text": "CANSW shall execute following NMT startup sequence:\n \u2022 Start transmission of Heartbeat\n \u2022 Start bus monitoring protocol, wait for boot of all devices\n \u2022 Configuration of all device parameters\n \u2022 Start transmission of SYNC, wait for synchronization of all devices",
      "note": "",
      "justification": "",
      "traces": [
        {
          "source": "AD2",
          "identifier": "6.5.3a"
        },
        {
          "source": "AD2",
          "identifier": "11"
        }
      ],
      "design": {
        "components": [
          "liblely-co"
        ]
      }
    },
    {
      "identifier": "SRS-CANSW-FUN-NMT-BOOT-222",
      "verificationMethod": "Test",
      "text": "CANSW shall allow to directly go to the OPERATIONAL state after the Reset_communication procedure.",
      "note": "This requirement modifies the CiA Standard Clause 7.3.2.2.2 [RD5]",
      "justification": "",
      "traces": [
        {
          "source": "AD2",
          "identifier": "6.5.4a"
        },
        {
          "source": "AD2",
          "identifier": "11"
        }
      ],
      "design": {
        "components": [
          "liblely-co"
        ]
      }
    },
    {
      "identifier": "SRS-CANSW-FUN-EDS-001",
      "verificationMethod": "Test",
      "text": "CANSW shall be compliant with ECSS Standard Clause 6.6a [AD2]",
      "note": "CANSW shall provide support processing DCF files [RD6].",
      "justification": "",
      "traces": [
        {
          "source": "AD2",
          "identifier": "6.6a"
        }
      ],
      "design": {
        "components": [
          "liblely-co",
          "dcf2dev"
        ]
      }
    },
    {
      "identifier": "SRS-CANSW-FUN-OD-001",
      "verificationMethod": "Test",
      "text": "CANSW shall be compliant with ECSS Standard Clause 6.8a [AD2]",
      "note": "CANSW shall provide support for defining custom Object Dictionary.",
      "justification": "",
      "traces": [
        {
          "source": "AD2",
          "identifier": "6.8a"
        }
      ],
      "design": {
        "components": [
          "liblely-co",
          "dcf2dev"
        ]
      }
    },
    {
      "identifier": "SRS-CANSW-FUN-TIME-OBJ-110",
      "verificationMethod": "Test",
      "text": "CANSW shall be compliant with ECSS Standard Clause 7.1.1a [AD2]",
      "note": "CANSW shall support SCET time format.",
      "justification": "",
      "traces": [
        {
          "source": "AD2",
          "identifier": "7.1.1a"
        }
      ],
      "design": {
        "components": [
          "liblely-co"
        ]
      }
    },
    {
      "identifier": "SRS-CANSW-FUN-TIME-OBJ-120",
      "verificationMethod": "Test",
      "text": "CANSW shall be compliant with ECSS Standard Clause 7.1.1b [AD2]",
      "note": "CANSW shall support UTC time format.",
      "justification": "",
      "traces": [
        {
          "source": "AD2",
          "identifier": "7.1.1b"
        }
      ],
      "design": {
        "components": [
          "liblely-co"
        ]
      }
    },
    {
      "identifier": "SRS-CANSW-FUN-TIME-OBJ-130",
      "verificationMethod": "Test",
      "text": "CANSW shall be compliant with ECSS Standard Clause 7.1.1c [AD2]",
      "note": "CANSW shall support CDS time format for the UTC.",
      "justification": "",
      "traces": [
        {
          "source": "AD2",
          "identifier": "7.1.1c"
        }
      ],
      "design": {
        "components": [
          "liblely-co"
        ]
      }
    },
    {
      "identifier": "SRS-CANSW-FUN-TIME-OBJ-140",
      "verificationMethod": "Test",
      "text": "CANSW shall be compliant with ECSS Standard Clause 7.1.1d [AD2]",
      "note": "",
      "justification": "",
      "traces": [
        {
          "source": "AD2",
          "identifier": "7.1.1d"
        }
      ],
      "design": {
        "components": [
          "liblely-co"
        ]
      }
    },
    {
      "identifier": "SRS-CANSW-FUN-TIME-OBJ-210",
      "verificationMethod": "Test",
      "text": "CANSW shall be compliant with ECSS Standard Clause 7.1.2a [AD2]",
      "note": "",
      "justification": "",
      "traces": [
        {
          "source": "AD2",
          "identifier": "7.1.2a"
        }
      ],
      "design": {
        "components": [
          "liblely-co"
        ]
      }
    },
    {
      "identifier": "SRS-CANSW-FUN-TIME-OBJ-220",
      "verificationMethod": "Test",
      "text": "CANSW shall be compliant with ECSS Standard Clause 7.1.2b [AD2]",
      "note": "",
      "justification": "",
      "traces": [
        {
          "source": "AD2",
          "identifier": "7.1.2b"
        }
      ],
      "design": {
        "components": [
          "liblely-co"
        ]
      }
    },
    {
      "identifier": "SRS-CANSW-FUN-TIME-OBJ-230",
      "verificationMethod": "Test",
      "text": "CANSW shall be compliant with ECSS Standard Clause 7.1.2c [AD2]",
      "note": "",
      "justification": "",
      "traces": [
        {
          "source": "AD2",
          "identifier": "7.1.2c"
        }
      ],
      "design": {
        "components": [
          "liblely-co"
        ]
      }
    },
    {
      "identifier": "SRS-CANSW-FUN-TIME-OBJ-240",
      "verificationMethod": "Test",
      "text": "CANSW shall be compliant with ECSS Standard Clause 7.1.2d [AD2]",
      "note": "",
      "justification": "",
      "traces": [
        {
          "source": "AD2",
          "identifier": "7.1.2d"
        }
      ],
      "design": {
        "components": [
          "liblely-co"
        ]
      }
    },
    {
      "identifier": "SRS-CANSW-FUN-TIME-OBJ-250",
      "verificationMethod": "Test",
      "text": "CANSW shall be compliant with ECSS Standard Clause 7.1.2e [AD2]",
      "note": "",
      "justification": "",
      "traces": [
        {
          "source": "AD2",
          "identifier": "7.1.2e"
        }
      ],
      "design": {
        "components": [
          "liblely-co"
        ]
      }
    },
    {
      "identifier": "SRS-CANSW-FUN-TIME-OBJ-260",
      "verificationMethod": "Test",
      "text": "CANSW shall be compliant with ECSS Standard Clause 7.1.2f [AD2]",
      "note": "",
      "justification": "",
      "traces": [
        {
          "source": "AD2",
          "identifier": "7.1.2f"
        }
      ],
      "design": {
        "components": [
          "liblely-co"
        ]
      }
    },
    {
      "identifier": "SRS-CANSW-FUN-TIME-OBJ-270",
      "verificationMethod": "Test",
      "text": "CANSW shall be compliant with ECSS Standard Clause 7.1.2g [AD2]",
      "note": "",
      "justification": "",
      "traces": [
        {
          "source": "AD2",
          "identifier": "7.1.2g"
        }
      ],
      "design": {
        "components": [
          "liblely-co"
        ]
      }
    },
    {
      "identifier": "SRS-CANSW-FUN-TIME-OBJ-280",
      "verificationMethod": "Test",
      "text": "CANSW shall be compliant with ECSS Standard Clause 7.1.2h [AD2]",
      "note": "",
      "justification": "",
      "traces": [
        {
          "source": "AD2",
          "identifier": "7.1.2h"
        }
      ],
      "design": {
        "components": [
          "liblely-co"
        ]
      }
    },
    {
      "identifier": "SRS-CANSW-FUN-TIME-OBJ-310",
      "verificationMethod": "Test",
      "text": "CANSW shall be compliant with ECSS Standard Clause 7.1.3a [AD2]",
      "note": "",
      "justification": "",
      "traces": [
        {
          "source": "AD2",
          "identifier": "7.1.3a"
        }
      ],
      "design": {
        "components": [
          "liblely-co"
        ]
      }
    },
    {
      "identifier": "SRS-CANSW-FUN-TIME-OBJ-320",
      "verificationMethod": "Test",
      "text": "CANSW shall be compliant with ECSS Standard Clause 7.1.3b [AD2]",
      "note": "",
      "justification": "",
      "traces": [
        {
          "source": "AD2",
          "identifier": "7.1.3b"
        }
      ],
      "design": {
        "components": [
          "liblely-co"
        ]
      }
    },
    {
      "identifier": "SRS-CANSW-FUN-TIME-OBJ-330",
      "verificationMethod": "Test",
      "text": "CANSW shall be compliant with ECSS Standard Clause 7.1.3c [AD2]",
      "note": "",
      "justification": "",
      "traces": [
        {
          "source": "AD2",
          "identifier": "7.1.3c"
        }
      ],
      "design": {
        "components": [
          "liblely-co"
        ]
      }
    },
    {
      "identifier": "SRS-CANSW-FUN-TIME-OBJ-340",
      "verificationMethod": "Test",
      "text": "CANSW shall be compliant with ECSS Standard Clause 7.1.3d [AD2]",
      "note": "",
      "justification": "",
      "traces": [
        {
          "source": "AD2",
          "identifier": "7.1.3d"
        }
      ],
      "design": {
        "components": [
          "liblely-co"
        ]
      }
    },
    {
      "identifier": "SRS-CANSW-FUN-TIME-OBJ-350",
      "verificationMethod": "Test",
      "text": "CANSW shall be compliant with ECSS Standard Clause 7.1.3e [AD2]",
      "note": "",
      "justification": "",
      "traces": [
        {
          "source": "AD2",
          "identifier": "7.1.3e"
        }
      ],
      "design": {
        "components": [
          "liblely-co"
        ]
      }
    },
    {
      "identifier": "SRS-CANSW-FUN-TIME-OBJ-360",
      "verificationMethod": "Test",
      "text": "CANSW shall be compliant with ECSS Standard Clause 7.1.3f [AD2]",
      "note": "",
      "justification": "",
      "traces": [
        {
          "source": "AD2",
          "identifier": "7.1.3f"
        }
      ],
      "design": {
        "components": [
          "liblely-co"
        ]
      }
    },
    {
      "identifier": "SRS-CANSW-FUN-TIME-OBJ-370",
      "verificationMethod": "Test",
      "text": "CANSW shall be compliant with ECSS Standard Clause 7.1.3g [AD2]",
      "note": "",
      "justification": "",
      "traces": [
        {
          "source": "AD2",
          "identifier": "7.1.3g"
        }
      ],
      "design": {
        "components": [
          "liblely-co"
        ]
      }
    },
    {
      "identifier": "SRS-CANSW-FUN-TIME-PRO-210",
      "verificationMethod": "Test",
      "text": "CANSW shall be compliant with ECSS Standard Clause 7.2.2a [AD2]",
      "note": "",
      "justification": "",
      "traces": [
        {
          "source": "AD2",
          "identifier": "7.2.2a"
        }
      ],
      "design": {
        "components": [
          "liblely-co"
        ]
      }
    },
    {
      "identifier": "SRS-CANSW-FUN-TIME-PRO-220",
      "verificationMethod": "Test",
      "text": "CANSW shall be compliant with ECSS Standard Clause 7.2.2b [AD2]",
      "note": "",
      "justification": "",
      "traces": [
        {
          "source": "AD2",
          "identifier": "7.2.2b"
        }
      ],
      "design": {
        "components": [
          "liblely-co"
        ]
      }
    },
    {
      "identifier": "SRS-CANSW-FUN-TIME-PRO-230",
      "verificationMethod": "Test",
      "text": "CANSW shall be compliant with ECSS Standard Clause 7.2.2c [AD2]",
      "note": "",
      "justification": "",
      "traces": [
        {
          "source": "AD2",
          "identifier": "7.2.2c"
        }
      ],
      "design": {
        "components": [
          "liblely-co"
        ]
      }
    },
    {
      "identifier": "SRS-CANSW-FUN-TIME-PRO-240",
      "verificationMethod": "Test",
      "text": "CANSW shall be compliant with ECSS Standard Clause 7.2.2d [AD2]",
      "note": "",
      "justification": "",
      "traces": [
        {
          "source": "AD2",
          "identifier": "7.2.2d"
        }
      ],
      "design": {
        "components": [
          "liblely-co"
        ]
      }
    },
    {
      "identifier": "SRS-CANSW-FUN-TIME-PRO-250",
      "verificationMethod": "Test",
      "text": "CANSW shall be compliant with ECSS Standard Clause 7.2.2e [AD2]",
      "note": "",
      "justification": "",
      "traces": [
        {
          "source": "AD2",
          "identifier": "7.2.2e"
        }
      ],
      "design": {
        "components": [
          "liblely-co"
        ]
      }
    },
    {
      "identifier": "SRS-CANSW-FUN-TIME-PRO-260",
      "verificationMethod": "Test",
      "text": "CANSW shall be compliant with ECSS Standard Clause 7.2.2f [AD2]",
      "note": "",
      "justification": "",
      "traces": [
        {
          "source": "AD2",
          "identifier": "7.2.2f"
        }
      ],
      "design": {
        "components": [
          "liblely-co"
        ]
      }
    },
    {
      "identifier": "SRS-CANSW-FUN-TIME-PRO-270",
      "verificationMethod": "Test",
      "text": "CANSW shall be compliant with ECSS Standard Clause 7.2.2g [AD2]",
      "note": "",
      "justification": "",
      "traces": [
        {
          "source": "AD2",
          "identifier": "7.2.2g"
        }
      ],
      "design": {
        "components": [
          "liblely-co"
        ]
      }
    },
    {
      "identifier": "SRS-CANSW-FUN-TIME-PRO-310",
      "verificationMethod": "Test",
      "text": "CANSW shall be compliant with ECSS Standard Clause 7.2.3a [AD2]",
      "note": "",
      "justification": "",
      "traces": [
        {
          "source": "AD2",
          "identifier": "7.2.3a"
        }
      ],
      "design": {
        "components": [
          "liblely-co"
        ]
      }
    },
    {
      "identifier": "SRS-CANSW-FUN-TIME-PRO-315",
      "verificationMethod": "Test",
      "text": "CANSW shall be compliant with ECSS Standard Clause 7.2.3b [AD2]",
      "note": "",
      "justification": "",
      "traces": [
        {
          "source": "AD2",
          "identifier": "7.2.3b"
        }
      ],
      "design": {
        "components": [
          "liblely-co"
        ]
      }
    },
    {
      "identifier": "SRS-CANSW-FUN-TIME-PRO-320",
      "verificationMethod": "Test",
      "text": "CANSW shall be compliant with ECSS Standard Clause 7.2.3c [AD2]",
      "note": "",
      "justification": "",
      "traces": [
        {
          "source": "AD2",
          "identifier": "7.2.3c"
        }
      ],
      "design": {
        "components": [
          "liblely-co"
        ]
      }
    },
    {
      "identifier": "SRS-CANSW-FUN-TIME-PRO-325",
      "verificationMethod": "Test",
      "text": "CANSW shall be compliant with ECSS Standard Clause 7.2.3d [AD2]",
      "note": "",
      "justification": "",
      "traces": [
        {
          "source": "AD2",
          "identifier": "7.2.3d"
        }
      ],
      "design": {
        "components": [
          "liblely-co"
        ]
      }
    },
    {
      "identifier": "SRS-CANSW-FUN-TIME-PRO-330",
      "verificationMethod": "Test",
      "text": "CANSW shall be compliant with ECSS Standard Clause 7.2.3e [AD2]",
      "note": "",
      "justification": "",
      "traces": [
        {
          "source": "AD2",
          "identifier": "7.2.3e"
        }
      ],
      "design": {
        "components": [
          "liblely-co"
        ]
      }
    },
    {
      "identifier": "SRS-CANSW-FUN-TIME-PRO-335",
      "verificationMethod": "Test",
      "text": "CANSW shall be compliant with ECSS Standard Clause 7.2.3f [AD2]",
      "note": "",
      "justification": "",
      "traces": [
        {
          "source": "AD2",
          "identifier": "7.2.3f"
        }
      ],
      "design": {
        "components": [
          "liblely-co"
        ]
      }
    },
    {
      "identifier": "SRS-CANSW-FUN-TIME-PRO-340",
      "verificationMethod": "Test",
      "text": "CANSW shall be compliant with ECSS Standard Clause 7.2.3g [AD2]",
      "note": "",
      "justification": "",
      "traces": [
        {
          "source": "AD2",
          "identifier": "7.2.3g"
        }
      ],
      "design": {
        "components": [
          "liblely-co"
        ]
      }
    },
    {
      "identifier": "SRS-CANSW-FUN-TIME-PRO-345",
      "verificationMethod": "Test",
      "text": "CANSW shall be compliant with ECSS Standard Clause 7.2.3h [AD2]",
      "note": "",
      "justification": "",
      "traces": [
        {
          "source": "AD2",
          "identifier": "7.2.3h"
        }
      ],
      "design": {
        "components": [
          "liblely-co"
        ]
      }
    },
    {
      "identifier": "SRS-CANSW-FUN-TIME-PRO-350",
      "verificationMethod": "Test",
      "text": "CANSW shall be compliant with ECSS Standard Clause 7.2.3i [AD2]",
      "note": "",
      "justification": "",
      "traces": [
        {
          "source": "AD2",
          "identifier": "7.2.3i"
        }
      ],
      "design": {
        "components": [
          "liblely-co"
        ]
      }
    },
    {
      "identifier": "SRS-CANSW-FUN-TIME-PRO-355",
      "verificationMethod": "Test",
      "text": "CANSW shall be compliant with ECSS Standard Clause 7.2.3j [AD2]",
      "note": "",
      "justification": "",
      "traces": [
        {
          "source": "AD2",
          "identifier": "7.2.3j"
        }
      ],
      "design": {
        "components": [
          "liblely-co"
        ]
      }
    },
    {
      "identifier": "SRS-CANSW-FUN-TIME-PRO-360",
      "verificationMethod": "Test",
      "text": "CANSW shall be compliant with ECSS Standard Clause 7.2.3k [AD2]",
      "note": "",
      "justification": "",
      "traces": [
        {
          "source": "AD2",
          "identifier": "7.2.3k"
        }
      ],
      "design": {
        "components": [
          "liblely-co"
        ]
      }
    },
    {
      "identifier": "SRS-CANSW-FUN-RED-001",
      "verificationMethod": "Test",
      "text": "CANSW shall be compliant with ECSS Standard Clause 8.2.2a [AD2]",
      "note": "",
      "justification": "",
      "traces": [
        {
          "source": "AD2",
          "identifier": "8.2.2a"
        }
      ],
      "design": {
        "components": [
          "liblely-co"
        ]
      }
    },
    {
      "identifier": "SRS-CANSW-FUN-RED-110",
      "verificationMethod": "Test",
      "text": "CANSW shall be compliant with ECSS Standard Clause 8.3.1a [AD2]",
      "note": "",
      "justification": "",
      "traces": [
        {
          "source": "AD2",
          "identifier": "8.3.1a"
        }
      ],
      "design": {
        "components": [
          "liblely-co"
        ]
      }
    },
    {
      "identifier": "SRS-CANSW-FUN-RED-120",
      "verificationMethod": "Test",
      "text": "CANSW shall be compliant with ECSS Standard Clause 8.3.1b [AD2]",
      "note": "",
      "justification": "",
      "traces": [
        {
          "source": "AD2",
          "identifier": "8.3.1b"
        }
      ],
      "design": {
        "components": [
          "liblely-co"
        ]
      }
    },
    {
      "identifier": "SRS-CANSW-FUN-RED-130",
      "verificationMethod": "Test",
      "text": "CANSW shall be compliant with ECSS Standard Clause 8.3.1c [AD2]",
      "note": "",
      "justification": "",
      "traces": [
        {
          "source": "AD2",
          "identifier": "8.3.1c"
        }
      ],
      "design": {
        "components": [
          "liblely-co"
        ]
      }
    },
    {
      "identifier": "SRS-CANSW-FUN-RED-140",
      "verificationMethod": "Test",
      "text": "CANSW shall be compliant with ECSS Standard Clause 8.3.1d [AD2]",
      "note": "",
      "justification": "",
      "traces": [
        {
          "source": "AD2",
          "identifier": "8.3.1d"
        }
      ],
      "design": {
        "components": [
          "liblely-co"
        ]
      }
    },
    {
      "identifier": "SRS-CANSW-FUN-RED-210",
      "verificationMethod": "Test",
      "text": "CANSW shall be compliant with ECSS Standard Clause 8.3.2a [AD2]",
      "note": "",
      "justification": "",
      "traces": [
        {
          "source": "AD2",
          "identifier": "8.3.2a"
        }
      ],
      "design": {
        "components": [
          "liblely-co"
        ]
      }
    },
    {
      "identifier": "SRS-CANSW-FUN-RED-220",
      "verificationMethod": "Test",
      "text": "CANSW shall be compliant with ECSS Standard Clause 8.3.2b [AD2]",
      "note": "",
      "justification": "",
      "traces": [
        {
          "source": "AD2",
          "identifier": "8.3.2b"
        }
      ],
      "design": {
        "components": [
          "liblely-co"
        ]
      }
    },
    {
      "identifier": "SRS-CANSW-FUN-RED-310",
      "verificationMethod": "Test",
      "text": "CANSW shall be compliant with ECSS Standard Clause 8.3.3a [AD2]",
      "note": "",
      "justification": "",
      "traces": [
        {
          "source": "AD2",
          "identifier": "8.3.3a"
        }
      ],
      "design": {
        "components": [
          "liblely-co"
        ]
      }
    },
    {
      "identifier": "SRS-CANSW-FUN-RED-315",
      "verificationMethod": "Test",
      "text": "CANSW shall be compliant with ECSS Standard Clause 8.3.3b [AD2]",
      "note": "",
      "justification": "",
      "traces": [
        {
          "source": "AD2",
          "identifier": "8.3.3b"
        }
      ],
      "design": {
        "components": [
          "liblely-co"
        ]
      }
    },
    {
      "identifier": "SRS-CANSW-FUN-RED-320",
      "verificationMethod": "Test",
      "text": "CANSW shall be compliant with ECSS Standard Clause 8.3.3c [AD2]",
      "note": "",
      "justification": "",
      "traces": [
        {
          "source": "AD2",
          "identifier": "8.3.3c"
        }
      ],
      "design": {
        "components": [
          "liblely-co"
        ]
      }
    },
    {
      "identifier": "SRS-CANSW-FUN-RED-325",
      "verificationMethod": "Test",
      "text": "CANSW shall be compliant with ECSS Standard Clause 8.3.3d [AD2]",
      "note": "",
      "justification": "",
      "traces": [
        {
          "source": "AD2",
          "identifier": "8.3.3d"
        }
      ],
      "design": {
        "components": [
          "liblely-co"
        ]
      }
    },
    {
      "identifier": "SRS-CANSW-FUN-RED-330",
      "verificationMethod": "Test",
      "text": "CANSW shall be compliant with ECSS Standard Clause 8.3.3e [AD2]",
      "note": "",
      "justification": "",
      "traces": [
        {
          "source": "AD2",
          "identifier": "8.3.3e"
        }
      ],
      "design": {
        "components": [
          "liblely-co"
        ]
      }
    },
    {
      "identifier": "SRS-CANSW-FUN-RED-335",
      "verificationMethod": "Test",
      "text": "CANSW shall be compliant with ECSS Standard Clause 8.3.3f [AD2]",
      "note": "",
      "justification": "",
      "traces": [
        {
          "source": "AD2",
          "identifier": "8.3.3f"
        }
      ],
      "design": {
        "components": [
          "liblely-co"
        ]
      }
    },
    {
      "identifier": "SRS-CANSW-FUN-RED-340",
      "verificationMethod": "Test",
      "text": "CANSW shall be compliant with ECSS Standard Clause 8.3.3g [AD2]",
      "note": "",
      "justification": "",
      "traces": [
        {
          "source": "AD2",
          "identifier": "8.3.3g"
        }
      ],
      "design": {
        "components": [
          "liblely-co"
        ]
      }
    },
    {
      "identifier": "SRS-CANSW-FUN-RED-345",
      "verificationMethod": "Test",
      "text": "CANSW shall be compliant with ECSS Standard Clause 8.3.3h [AD2]",
      "note": "",
      "justification": "",
      "traces": [
        {
          "source": "AD2",
          "identifier": "8.3.3h"
        }
      ],
      "design": {
        "components": [
          "liblely-co"
        ]
      }
    },
    {
      "identifier": "SRS-CANSW-FUN-RED-350",
      "verificationMethod": "Test",
      "text": "CANSW shall be compliant with ECSS Standard Clause 8.3.3i [AD2]",
      "note": "",
      "justification": "",
      "traces": [
        {
          "source": "AD2",
          "identifier": "8.3.3i"
        }
      ],
      "design": {
        "components": [
          "liblely-co"
        ]
      }
    },
    {
      "identifier": "SRS-CANSW-FUN-RED-355",
      "verificationMethod": "Test",
      "text": "CANSW shall be compliant with ECSS Standard Clause 8.3.3j [AD2]",
      "note": "",
      "justification": "",
      "traces": [
        {
          "source": "AD2",
          "identifier": "8.3.3j"
        }
      ],
      "design": {
        "components": [
          "liblely-co"
        ]
      }
    },
    {
      "identifier": "SRS-CANSW-FUN-RED-360",
      "verificationMethod": "Test",
      "text": "CANSW shall be compliant with ECSS Standard Clause 8.3.3k [AD2]",
      "note": "",
      "justification": "",
      "traces": [
        {
          "source": "AD2",
          "identifier": "8.3.3k"
        }
      ],
      "design": {
        "components": [
          "liblely-co"
        ]
      }
    },
    {
      "identifier": "SRS-CANSW-FUN-RED-365",
      "verificationMethod": "Test",
      "text": "CANSW shall be compliant with ECSS Standard Clause 8.3.3l [AD2]",
      "note": "",
      "justification": "",
      "traces": [
        {
          "source": "AD2",
          "identifier": "8.3.3l"
        }
      ],
      "design": {
        "components": [
          "liblely-co"
        ]
      }
    },
    {
      "identifier": "SRS-CANSW-PER-010",
      "verificationMethod": "Test",
      "text": "CANSW unit tests shall run on standard x86-64 host with at least 8GB of RAM and Intel i5 Gen9 (or equivalent) processor.",
      "note": "",
      "justification": "Selected parameters put minimal requirements on the host machine to be no older than 5 years. Although CANSW should work fine on older machines, it might be difficult to aquire reference hardware to verify it.",
      "traces": [],
      "design": {
        "override": "Not related to software components design."
      }
    },
    {
      "identifier": "SRS-CANSW-PER-020",
      "verificationMethod": "Test",
      "text": "CANSW integration tests (Host part) shall run on standard x86-64 host with at least 8GB of RAM and Intel i5 Gen9 (or equivalent) processor.",
      "note": "",
      "justification": "Selected parameters put minimal requirements on the host machine to be no older than 5 years. Although CANSW should work fine on older machines, it might be difficult to aquire reference hardware to verify it.",
      "traces": [],
      "design": {
        "override": "Not related to software components design."
      }
    },
    {
      "identifier": "SRS-CANSW-PER-030",
      "verificationMethod": "Test",
      "text": "CANSW integration tests (HWTB part) shall run on SAMV71Q21 HWTB (or equivalent) hardware.",
      "note": "",
      "justification": "Requirement ensuring CANSW support for SAMV71Q21.",
      "traces": [],
      "design": {
        "override": "Not related to software components design."
      }
    },
    {
      "identifier": "SRS-CANSW-PER-032",
      "verificationMethod": "Test",
      "text": "CANSW integration tests (HWTB part) shall run on SAMRH71F20 HWTB (or equivalent) hardware.",
      "note": "",
      "justification": "Requirement ensuring CANSW support for SAMRH71F20.",
      "traces": [],
      "design": {
        "override": "Not related to software components design."
      }
    },
    {
      "identifier": "SRS-CANSW-PER-034",
      "verificationMethod": "Test",
      "text": "CANSW integration tests (HWTB part) shall run on SAMRH707F18 HWTB (or equivalent) hardware.",
      "note": "",
      "justification": "Requirement ensuring CANSW support for SAMRH707F18.",
      "traces": [],
      "design": {
        "override": "Not related to software components design."
      }
    },
    {
      "identifier": "SRS-CANSW-PER-036",
      "verificationMethod": "Test",
      "text": "CANSW integration tests (HWTB part) shall run on GR712RC HWTB (or equivalent) hardware.",
      "note": "The HTWB might be simulator (TSIM) based.",
      "justification": "Requirement ensuring CANSW support for GR712RC.",
      "traces": [],
      "design": {
        "override": "Not related to software components design."
      }
    },
    {
      "identifier": "SRS-CANSW-PER-040",
      "verificationMethod": "Test",
      "text": "CANSW integration tests shall execute successfully on CANbus with at least 125kbps baud rate.",
      "note": "",
      "justification": "This baud rate seems to be one of the most popular ones at it is supported by the HWTB. Higher baud rates might cause issues with inaccurate timers on SAMV71Q21 HWTB.",
      "traces": [],
      "design": {
        "override": "Not related to software components design."
      }
    },
    {
      "identifier": "SRS-CANSW-PER-050",
      "verificationMethod": "Test",
      "text": "Complete run of all CANSW integration tests shall finish in less than 5 hours.",
      "note": "",
      "justification": "It should be possible to prepare setup and execute all tests in a single work day.",
      "traces": [],
      "design": {
        "override": "Not related to software components design."
      }
    },
    {
      "identifier": "SRS-CANSW-IF-010",
      "verificationMethod": "Test",
      "text": "CANSW shall provide portable interface for interacting with CAN link.",
      "note": "Library shall accept incoming messages from any source (library shall provide a callback) and shall support sending messages into any channel (library shall support setting a sending callback).",
      "justification": "This will allow CANSW to integrate with various CAN bus hardware drivers.",
      "traces": [],
      "design": {
        "components": [
          "liblely-can"
        ]
      }
    },
    {
      "identifier": "SRS-CANSW-IF-020",
      "verificationMethod": "Test",
      "text": "CANSW shall provide portable interface for interacting with hardware clock.",
      "note": "Library shall accept \u2018current time\u2019 from any source (library shall provide a callback).",
      "justification": "This will allow CANSW to execute on various systems with different clock providers.",
      "traces": [],
      "design": {
        "components": [
          "liblely-can"
        ]
      }
    },
    {
      "identifier": "SRS-CANSW-IF-030",
      "verificationMethod": "DesignReview",
      "text": "CANSW methods shall be thread-safe.",
      "note": "Library shall not rely on threads and leave possible parallelization to the user. Using Library from a single thread shall not interfere with any other thread.",
      "justification": "Threads implementation is system specific, Library has to be portable, leaving resolving thread-safety issues to the user.",
      "traces": [],
      "design": {
        "components": [
          "liblely-co",
          "liblely-compat",
          "liblely-can",
          "liblely-util"
        ]
      }
    },
    {
      "identifier": "SRS-CANSW-IF-040",
      "verificationMethod": "Inspection",
      "text": "CANSW methods shall be re-entrant.",
      "note": "",
      "justification": "Library shall not introduce methods that would unnecessarily block parallelization. Methods accessing the same global object (e.g. Object Dictionary) have to be synchronized by the user, but the same method should be callable in parallel for separated set of objects.",
      "traces": [],
      "design": {
        "components": [
          "liblely-co",
          "liblely-compat",
          "liblely-can",
          "liblely-util"
        ]
      }
    },
    {
      "identifier": "SRS-CANSW-IF-050",
      "verificationMethod": "DesignReview",
      "text": "CANSW shall not rely on any additional external SW library.",
      "note": "The project only identified memcpy, memset and strlen as needed Standard C Library (libc) functions.",
      "justification": "Derived from ECSS requirements for critical software.",
      "traces": [],
      "design": {
        "components": [
          "liblely-compat",
          "liblely-util"
        ]
      }
    },
    {
      "identifier": "SRS-CANSW-IF-055",
      "verificationMethod": "Test",
      "text": "CANSW shall provide implementation for the following Standard C Library (libc) subset:\nmemory-to-memory copy (memcpy),\nfill a block of memory with a particular value (memset),\ncalculation for length of a string (strlen).",
      "note": "",
      "justification": "CANSW must be portable, user should be able to choose to use Standard C Library or the CANSW implementation.",
      "traces": [],
      "design": {
        "components": [
          "liblely-compat"
        ]
      }
    },
    {
      "identifier": "SRS-CANSW-IF-060",
      "verificationMethod": "DesignReview",
      "text": "CANSW shall not directly rely on any HW or OS features.",
      "note": "A dedicated abstraction layer shall be provided by the Library itself.",
      "justification": "CANSW must be portable, this can be achieved by providng abstraction layer.",
      "traces": [],
      "design": {
        "components": [
          "liblely-compat",
          "liblely-can"
        ]
      }
    },
    {
      "identifier": "SRS-CANSW-IF-070",
      "verificationMethod": "Inspection",
      "text": "CANSW binaries shall support debugging efforts by providing debugging symbols.",
      "note": "This shall be achieved by using standard compilation switches for selected target compilers and debuggers.",
      "justification": "This will allow for more convinient work with CANSW in case of debugging need.",
      "traces": [],
      "design": {
        "components": [
          "liblely-co",
          "liblely-compat",
          "liblely-can",
          "liblely-util"
        ]
      }
    },
    {
      "identifier": "SRS-CANSW-RES-010",
      "verificationMethod": "Test",
      "text": "CANSW shall execute on standard x86-64 architecture.",
      "note": "",
      "justification": "Required to execute integration tests controlled from the host machine.",
      "traces": [],
      "design": {
        "override": "Not related to software components design."
      }
    },
    {
      "identifier": "SRS-CANSW-RES-020",
      "verificationMethod": "Test",
      "text": "CANSW shall execute on SAMV71Q21.",
      "note": "Requirement shall apply to two versions of the CANSW binaries: built by ARM GCC and XC32 compiler.",
      "justification": "Project's objective - to ensure CANSW can execute on space representative hardware.",
      "traces": [],
      "design": {
        "override": "Not related to software components design."
      }
    },
    {
      "identifier": "SRS-CANSW-RES-022",
      "verificationMethod": "Test",
      "text": "CANSW shall execute on SAMRH71F20.",
      "note": "Requirement shall apply to two versions of the CANSW binaries: built by ARM GCC and XC32 compiler.",
      "justification": "Project's objective - to ensure CANSW can execute on space representative hardware.",
      "traces": [],
      "design": {
        "override": "Not related to software components design."
      }
    },
    {
      "identifier": "SRS-CANSW-RES-024",
      "verificationMethod": "Test",
      "text": "CANSW shall execute on SAMRH707F18.",
      "note": "Requirement shall apply to two versions of the CANSW binaries: built by ARM GCC and XC32 compiler.",
      "justification": "Project's objective - to ensure CANSW can execute on space representative hardware.",
      "traces": [],
      "design": {
        "override": "Not related to software components design."
      }
    },
    {
      "identifier": "SRS-CANSW-RES-026",
      "verificationMethod": "Test",
      "text": "CANSW shall execute on GR712RC.",
      "note": "",
      "justification": "Project's objective - to ensure CANSW can execute on space representative hardware.",
      "traces": [],
      "design": {
        "override": "Not related to software components design."
      }
    },
    {
      "identifier": "SRS-CANSW-DES-010",
      "verificationMethod": "DesignReview",
      "text": "CANSW C code shall use C11 standard.",
      "note": "",
      "justification": "CANSW relies on reused software which uses C11 as baseline standard.",
      "traces": [],
      "design": {
        "override": "Not related to software components design."
      }
    },
    {
      "identifier": "SRS-CANSW-DES-020",
      "verificationMethod": "DesignReview",
      "text": "CANSW shall be developed according to the following ECSS standards: ECSS-E-ST-40C [AD1] and ECSS-Q-ST-80C\u00a0[AD3].",
      "note": "Detailed tailoring of the standards can be found in SDP [RD2] and with quality process defined in SPAP [RD3] respectively",
      "justification": "CANSW must comply with space-grade criticality software requirements to be applicable for space applications.",
      "traces": [],
      "design": {
        "override": "Not related to software components design."
      }
    },
    {
      "identifier": "SRS-CANSW-POR-010",
      "verificationMethod": "Inspection",
      "text": "CANSW shall be created in the platform independent manner, using abstraction layer to separate from HW or OS specific concepts, to allow possible execution in different setup.",
      "note": "",
      "justification": "CANSW must be portable, user should be able to choose to use Standard C Library or the CANSW implementation.",
      "traces": [],
      "design": {
        "components": [
          "liblely-can",
          "liblely-compat"
        ]
      }
    },
    {
      "identifier": "SRS-CANSW-POR-020",
      "verificationMethod": "Test",
      "text": "CANSW shall compile using range of GCC compiler versions.",
      "note": "GCC versions from 4 to 13 shall be tested for compatibility (exact list available in SDP [RD2]).",
      "justification": "Ensuring higher portability options in possible future deployments.",
      "traces": [],
      "design": {
        "components": [
          "liblely-compat"
        ]
      }
    },
    {
      "identifier": "SRS-CANSW-POR-022",
      "verificationMethod": "Test",
      "text": "CANSW shall compile using XC32 compiler for ARM.",
      "note": "Compilation shall be achieved for SAMV71Q21, SAMRH71F20 and SAMRH707F18 platforms.",
      "justification": "XC32 is a compiler provided by the manufacturer for the mentioned platforms.",
      "traces": [],
      "design": {
        "components": [
          "liblely-compat"
        ]
      }
    },
    {
      "identifier": "SRS-CANSW-DAT-010",
      "verificationMethod": "Test",
      "text": "CANSW shall exchange CAN messages with external software (drivers) using structure containing:\nCAN identifier (11 or 29 bits, stored on 32bit variable),\nflags (8 bits),\npayload length (stored on 8 bit variable),\npayload (8 octets \u2013 64 bits).",
      "note": "",
      "justification": "Such structure contains all the data required to prepare CANbus packet.",
      "traces": [],
      "design": {
        "components": [
          "liblely-can"
        ]
      }
    },
    {
      "identifier": "SRS-CANSW-INS-010",
      "verificationMethod": "Test",
      "text": "CANSW shall provide Docker configuration file(s) (Dockerfile [RD7]).",
      "note": "",
      "justification": "This allows for easy replication of the build environment.",
      "traces": [],
      "design": {
        "override": "Not related to software components design."
      }
    },
    {
      "identifier": "SRS-CANSW-INS-020",
      "verificationMethod": "Inspection",
      "text": "CANSW deliverable shall contain built Docker image.",
      "note": "",
      "justification": "Availability of various packages used in Docker image might change over time.",
      "traces": [],
      "design": {
        "override": "Not related to software components design."
      }
    },
    {
      "identifier": "SRS-CANSW-INS-030",
      "verificationMethod": "Inspection",
      "text": "CANSW shall support selection of required CANopen services and features to be built using Autotools configuration options.",
      "note": "CANSW shall provide configuration script (commonly known as configure), which will allow selection of the subset of features to be used in given build of the Library. Available categories for selection shall be based on ECSS division of the features.",
      "justification": "Potential deployments of the CANSW might require tailoring of the features (e.g. to meet memory usage requirements).",
      "traces": [],
      "design": {
        "override": "Not related to software components design."
      }
    },
    {
      "identifier": "SRS-CANSW-INS-040",
      "verificationMethod": "Inspection",
      "text": "CANSW shall support configuration of the user\u2019s device using CiA 306 [RD6] standard DCF files.",
      "note": "Support shall be provided by dcf2dev code generation tool, which will generate C code from DCF descriptions. Generated code could be then used by user to properly setup the library objects.",
      "justification": "DCF files are common format supported in the CANopen ecosystem.",
      "traces": [],
      "design": {
        "components": [
          "dcf2dev"
        ]
      }
    }
  ]
}
