[
    {"title":"Tête !","data":{"rows":[[],[3],[1,1],[1,1],[1,1,1],[1,1],[3,1,1],[1,1,1],[1,1],[3]],"columns":[[2],[1,1],[1,2],[1,1],[1,1,1,1],[1,1,1],[1,1],[1,1],[1,1],[3]]},"size":{"rows":10,"columns":10}},
    {"title":"Avion ?","data":{"rows":[[1],[1],[1,1],[1,1],[1,1],[1,1],[1,1,1,1],[1,1,1,1],[1,1,1,1],[9],[],[1,1]],"columns":[[],[2],[2,1],[2,1,1],[2,4],[2,1],[2,4],[2,1,1],[2,1],[2],[],[]]},"size":{"rows":12,"columns":12}},
    {"title":"Kirby","data":{"rows":[[4],[2,2],[1,1],[1,1],[1,1],[1,1,1,1],[1,1,1,1],[1,1,1],[1,1,1,1],[1,1,1,1,1],[1,1,2],[3,2],[4,1,1],[1,6,1],[6,6]],"columns":[[4,1],[1,1,2],[2,2,1],[1,2,1],[1,7],[1,3],[1,1],[1,1],[1,2,1],[1,1,2],[1,2,1,1],[1,1,1],[1,5,1],[2,1,1,1],[5,2]]},"size":{"rows":15,"columns":15}},
    {"title":"Game Boy","data":{"rows":[[15],[2,2],[2,9,2],[2,2,2,2],[2,2,2,2],[2,2,2,2],[2,2,2,2],[2,9,2],[2,2],[2,1,2],[2,3,2],[2,1,3,2],[2,2],[2,3],[15]],"columns":[[15],[15],[1,1],[1,6,1,1],[1,6,3,1],[1,1,1,1,1],[1,1,1,1],[1,1,1,1],[1,1,1,1],[1,1,1,1,1],[1,6,1,1],[1,6,1,1],[1,2],[15],[15]]},"size":{"rows":15,"columns":15}},
    {"title":"4 x 4","data":{"rows":[[1],[2],[2],[1]],"columns":[[1],[2],[2],[1]]},"size":{"rows":4,"columns":4}},
    {"title":"Mario","data":{"rows":[[4,4],[1,2,2,1],[1,1,1,1],[1,4,4,1],[1,2,2,2,2,1],[1,5,5,1],[1,5,5,1],[1,11,1],[2,2,2,2],[2,2,1],[1,1,1,2],[3,4],[3,4],[3,4],[4,5],[4,4],[6,6],[2,11,2],[11],[3,3]],"columns":[[7],[7,7],[1,2,7],[1,3,2,3],[1,6,3],[1,1,4,4],[2,5,3],[7,3],[1,2],[1,2],[1,2],[7,3],[2,5,3],[1,1,4,4],[1,6,3],[1,3,2,3],[1,2,7],[7,7],[7],[6]]},"size":{"rows":20,"columns":20}},
    {"title":"Star","data":{"rows":[[7,7],[6,6],[6,6],[5,5],[5,5],[1,1],[1,1,1,1],[2,1,1,2],[3,3],[4,4],[3,3],[3,3],[2,1,2],[2,3,2],[1,7,1]],"columns":[[5,9],[5,7],[5,4],[5,1],[5,1],[3,1],[1,3,2],[3],[1,3,2],[3,1],[5,1],[5,1],[5,4],[5,7],[5,9]]},"size":{"rows":15,"columns":15}},
    {"title":"Toad","data":{"rows":[[6],[4,4],[5,5],[6,6],[6,6],[6,6],[5,5],[3,3],[1,8,1],[1,1,1,1],[1,1,1,1,1,1],[2,1,1,1,1,2],[3,3],[1,2,1],[1,1],[10],[2,2,2,2],[1,3,2,1],[1,3,3,1],[1,4,4,1]],"columns":[[],[],[8],[5,2,2],[6,1,2],[6,5,2,1],[6,1,2,3],[6,1,5],[4,1,2,5],[1,1,1,1],[1,1,1,1],[4,1,2,5],[6,1,5],[6,1,2,2],[6,5,2,1],[6,1,2],[5,2,2],[8],[],[]]},"size":{"rows":20,"columns":20}}
]