module historian

go 1.14

require (
	github.com/alecthomas/template v0.0.0-20190718012654-fb15b899a751
	github.com/alecthomas/units v0.0.0-20190924025748-f65c72e2690d
	github.com/mattn/go-sqlite3 v2.0.3+incompatible
	gitlab.com/buddyspencer/chameleon v0.0.0-20190823132202-b02c96509d9e
	gopkg.in/alecthomas/kingpin.v2 v2.2.6
	gopkg.in/yaml.v2 v2.2.8
)
