[
    {
        "username": "admin",
        "password": "admin",
        "firstName": "Jake",
        "lastName": "Blake",
        "gender": "MALE",
        "dateOfBirth": "31.01.1985.",
        "role": "ADMINISTRATOR",
        "isDeleted": false,
        "moto": "If not now, then when?"
    },
    {
        "username": "linda92",
        "password": "92linda",
        "firstName": "Linda",
        "lastName": "Snow",
        "gender": "FEMALE",
        "dateOfBirth": "12.04.1992.",
        "role": "ADMINISTRATOR",
        "isDeleted": false,
        "moto": "You only live once"
    }
]