NACA 65101 Airfoil cl=1.00 T=1.0% P=25.0%
  1.000000 -0.000000
  0.999753 -0.000005
  0.999013 -0.000018
  0.997780 -0.000040
  0.996056 -0.000069
  0.993842 -0.000102
  0.991141 -0.000138
  0.987955 -0.000173
  0.984288 -0.000203
  0.980143 -0.000225
  0.975525 -0.000234
  0.970438 -0.000225
  0.964887 -0.000193
  0.958878 -0.000133
  0.952417 -0.000038
  0.945510  0.000096
  0.938165  0.000276
  0.930388  0.000508
  0.922188  0.000797
  0.913573  0.001151
  0.904551  0.001575
  0.895131  0.002074
  0.885324  0.002655
  0.875137  0.003322
  0.864582  0.004080
  0.853669  0.004934
  0.842408  0.005889
  0.830812  0.006947
  0.818890  0.008111
  0.806656  0.009386
  0.794121  0.010771
  0.781297  0.012270
  0.768197  0.013882
  0.754834  0.015608
  0.741220  0.017448
  0.727370  0.019399
  0.713297  0.021461
  0.699014  0.023631
  0.684535  0.025906
  0.669875  0.028281
  0.655048  0.030753
  0.640068  0.033316
  0.624950  0.035965
  0.609709  0.038693
  0.594359  0.041495
  0.578916  0.044363
  0.563395  0.047289
  0.547810  0.050266
  0.532177  0.053286
  0.516512  0.056339
  0.500829  0.059418
  0.485143  0.062514
  0.469471  0.065618
  0.453828  0.068720
  0.438228  0.071813
  0.422680  0.074878
  0.407197  0.077875
  0.391793  0.080763
  0.376483  0.083502
  0.361282  0.086055
  0.346206  0.088385
  0.331270  0.090459
  0.316488  0.092249
  0.301876  0.093727
  0.287450  0.094869
  0.273223  0.095657
  0.259213  0.096075
  0.245433  0.096110
  0.231900  0.095756
  0.218628  0.095009
  0.205632  0.093869
  0.192927  0.092342
  0.180527  0.090437
  0.168448  0.088166
  0.156702  0.085547
  0.145304  0.082601
  0.134265  0.079352
  0.123598  0.075827
  0.113315  0.072057
  0.103427  0.068073
  0.093943  0.063911
  0.084874  0.059607
  0.076229  0.055200
  0.068016  0.050728
  0.060242  0.046231
  0.052915  0.041749
  0.046042  0.037322
  0.039629  0.032989
  0.033681  0.028788
  0.028203  0.024756
  0.023201  0.020929
  0.018678  0.017341
  0.014638  0.014022
  0.011084  0.011002
  0.008020  0.008306
  0.005447  0.005958
  0.003367  0.003977
  0.001781  0.002380
  0.000692  0.001180
  0.000098  0.000385
  0.000000  0.000000
  0.000396  0.000030
  0.001282  0.000474
  0.002657  0.001326
  0.004519  0.002576
  0.006865  0.004211
  0.009693  0.006213
  0.012999  0.008562
  0.016779  0.011234
  0.021028  0.014204
  0.025743  0.017441
  0.030916  0.020915
  0.036543  0.024592
  0.042617  0.028437
  0.049131  0.032413
  0.056078  0.036482
  0.063451  0.040606
  0.071242  0.044747
  0.079443  0.048866
  0.088045  0.052926
  0.097040  0.056888
  0.106418  0.060718
  0.116171  0.064381
  0.126291  0.067845
  0.136766  0.071078
  0.147589  0.074055
  0.158750  0.076748
  0.170240  0.079137
  0.182049  0.081201
  0.194166  0.082926
  0.206583  0.084298
  0.219289  0.085308
  0.232273  0.085953
  0.245525  0.086229
  0.259033  0.086141
  0.272786  0.085693
  0.286771  0.084897
  0.300976  0.083766
  0.315387  0.082318
  0.329992  0.080575
  0.344777  0.078562
  0.359727  0.076306
  0.374828  0.073840
  0.390064  0.071197
  0.405422  0.068414
  0.420885  0.065531
  0.436439  0.062587
  0.452064  0.059623
  0.467738  0.056659
  0.483446  0.053704
  0.499171  0.050765
  0.514899  0.047852
  0.530613  0.044973
  0.546298  0.042134
  0.561938  0.039346
  0.577518  0.036614
  0.593022  0.033947
  0.608434  0.031352
  0.623740  0.028834
  0.638923  0.026401
  0.653969  0.024058
  0.668863  0.021810
  0.683589  0.019661
  0.698134  0.017615
  0.712483  0.015677
  0.726620  0.013848
  0.740533  0.012131
  0.754208  0.010526
  0.767630  0.009035
  0.780786  0.007658
  0.793664  0.006394
  0.806251  0.005242
  0.818534  0.004199
  0.830500  0.003264
  0.842139  0.002433
  0.853438  0.001703
  0.864387  0.001069
  0.874974  0.000527
  0.885190  0.000071
  0.895024 -0.000303
  0.904466 -0.000602
  0.913507 -0.000831
  0.922140 -0.000997
  0.930354 -0.001106
  0.938142 -0.001165
  0.945497 -0.001179
  0.952410 -0.001157
  0.958877 -0.001103
  0.964890 -0.001024
  0.970443 -0.000927
  0.975532 -0.000817
  0.980151 -0.000700
  0.984295 -0.000580
  0.987962 -0.000462
  0.991146 -0.000351
  0.993846 -0.000251
  0.996059 -0.000164
  0.997782 -0.000094
  0.999014 -0.000042
  0.999753 -0.000011
  1.000000  0.000000