NACA 65115 Airfoil cl=1.00 T=15.0% P=25.0%
  1.000000 -0.000000
  0.999752  0.000037
  0.999008  0.000149
  0.997769  0.000335
  0.996037  0.000598
  0.993815  0.000937
  0.991105  0.001355
  0.987912  0.001853
  0.984239  0.002433
  0.980092  0.003099
  0.975476  0.003851
  0.970398  0.004693
  0.964865  0.005629
  0.958883  0.006660
  0.952460  0.007790
  0.945604  0.009021
  0.938325  0.010358
  0.930630  0.011803
  0.922530  0.013358
  0.914032  0.015027
  0.905148  0.016813
  0.895887  0.018717
  0.886260  0.020741
  0.876276  0.022888
  0.865947  0.025159
  0.855283  0.027555
  0.844294  0.030076
  0.832992  0.032723
  0.821388  0.035495
  0.809492  0.038391
  0.797315  0.041411
  0.784870  0.044551
  0.772166  0.047809
  0.759215  0.051183
  0.746029  0.054667
  0.732619  0.058259
  0.718995  0.061952
  0.705170  0.065741
  0.691155  0.069619
  0.676961  0.073580
  0.662600  0.077615
  0.648084  0.081717
  0.633424  0.085876
  0.618633  0.090084
  0.603722  0.094330
  0.588703  0.098603
  0.573589  0.102893
  0.558392  0.107189
  0.543124  0.111478
  0.527798  0.115749
  0.512428  0.119989
  0.497025  0.124187
  0.481603  0.128329
  0.466176  0.132403
  0.450753  0.136398
  0.435246  0.140309
  0.419621  0.144100
  0.403891  0.147726
  0.388068  0.151139
  0.372169  0.154293
  0.356210  0.157144
  0.340210  0.159647
  0.324192  0.161762
  0.308179  0.163450
  0.292200  0.164674
  0.276286  0.165405
  0.260470  0.165613
  0.244790  0.165277
  0.229284  0.164380
  0.213996  0.162912
  0.198969  0.160869
  0.184249  0.158256
  0.169879  0.155084
  0.155904  0.151371
  0.142366  0.147142
  0.129305  0.142429
  0.116756  0.137269
  0.104753  0.131706
  0.093323  0.125785
  0.082489  0.119555
  0.072271  0.113069
  0.062681  0.106378
  0.053732  0.099536
  0.045429  0.092596
  0.037776  0.085608
  0.030773  0.078623
  0.024420  0.071690
  0.018713  0.064853
  0.013646  0.058157
  0.009214  0.051641
  0.005410  0.045344
  0.002226  0.039298
 -0.000347  0.033535
 -0.002316  0.028081
 -0.003691  0.022960
 -0.004481  0.018190
 -0.004696  0.013787
 -0.004345  0.009762
 -0.003439  0.006122
 -0.001987  0.002869
  0.000000  0.000000
