date,BTC,ETH,BCH,LTC,MBPRK01,MBPRK02,MBPRK03,MBPRK04,XRP
2020-03-07,41082.0,1080.13,1543.0,277.99,110.78,112.0001,94.0001,104.3005,1.08
2020-03-08,39050.0,1015.79957,1352.26011,253.34067,110.7897,113.9699,94.0,106.09,1.01784
2020-03-09,38050.01,980.01,1305.34005,245.0,109.0,112.0002,95.0,106.21,1.00193
2020-03-10,37400.0,965.14878,1311.91939,238.73905,108.45,114.52,94.0,106.26,1.01
2020-03-11,37184.07,890.00005,1220.00001,221.65001,110.75,113.0,94.99,104.4901,0.98
2020-03-12,26500.0,600.02,875.0,164.96,108.5,111.0001,93.97,104.53,0.69899
2020-03-13,28246.0,678.97442,905.00036,189.69999,108.99,110.56,95.24,104.56,0.81
2020-03-14,27002.09,639.02000999,893.57999,181.00008,108.99,110.56,95.23,105.5,0.77209
2020-03-15,27900.0,649.76463,943.99,186.73768,108.99,114.6699,94.01,106.3599,0.79709
2020-03-16,26628.0,590.99971,901.21147,176.0405,108.68,110.75,94.12,104.6801,0.75078
2020-03-17,27300.2607,601.5,932.20999,176.67502,108.73,110.89,95.0,104.72,0.75999
2020-03-18,27616.53998,602.00288,932.0,177.03,108.77,110.87,95.2,104.7501,0.75401
2020-03-19,31618.9999,692.5,1132.99967999,200.03,112.13,111.0,95.2,106.6099,0.8215
2020-03-20,32378.00029,695.02106,1151.99,200.06015,108.8601,112.2002,95.2,106.6099,0.83972
2020-03-21,32496.71688,690.35,1134.96626999,199.14032,108.87,114.0,94.27,106.64,0.82224
2020-03-22,31194.70916,645.50512,1072.15,186.33989,111.9999,113.9699,94.27,106.63,0.78
2020-03-23,33139.99992,685.90013,1120.11178,198.49795,109.0101,111.18,94.39,104.95,0.8106
2020-03-24,33985.87414,698.9,1148.0,198.90258,112.15,113.0,94.42,106.7999,0.822
2020-03-25,33978.97991,696.93,1125.05,199.60006,112.1499,111.3103,94.6,106.8399,0.82105
2020-03-26,33990.0,696.0101,1125.23,201.2,112.43,112.8993,94.5,105.0601,0.8518
2020-03-27,32759.07138,680.77425,1092.0,195.9797,112.4,111.45,94.54,106.92,0.89005
2020-03-28,32102.6,670.13527,1100.0,198.11047,110.0,112.999,94.5401,105.1001,0.89905
2020-03-29,31994.145,670.0,1090.29,195.60006,109.18,111.43,94.54,ffill,0.875
2020-03-30,33200.06,679.0,1138.96959999,200.44999,109.31,113.8999,95.88,105.2104,0.88989
2020-03-31,32399.65793,670.56326,1124.88823,199.91971,109.4052,113.61,95.92,106.91,0.88896
2020-04-01,33395.9797,685.0,1134.9,200.29905,112.39,113.5,94.7301,107.1099,0.89694
2020-04-02,34834.43682,715.0,1180.0,204.76145,112.35,111.81,94.76,105.33,0.9125
2020-04-03,35450.0,736.34,1220.99057,208.30001,112.7999,113.5,95.0,106.9699,0.92834
2020-04-04,35555.56,743.22,1224.9896,209.35,109.49,112.0,94.8,106.96,0.93
2020-04-05,35550.00001,753.74356,1222.9,209.95043,109.5,113.5,94.8,106.96,0.92989
2020-04-06,37679.99998999,892.61,1325.87998999,230.21,109.63,112.06,94.93,105.5001,1.01475
2020-04-07,37879.99992,874.99999,1340.0,234.5,112.0,112.06,94.94,105.48,1.01699
2020-04-08,37950.0,880.55686,1360.99981,235.51388,110.0,112.06,94.92,105.48,1.0142
2020-04-09,37334.37429,858.15023,1292.0,233.05902,112.0,114.6,94.92,105.48,0.99211
2020-04-10,36005.4129,838.99999,1212.0025,223.35,109.63,112.06,94.92,105.48,0.985
2020-04-11,35600.0,823.52765,1196.00608,217.35002,109.63,112.06,94.92,105.48,0.96301
2020-04-12,35999.6889,817.01,1219.88536,216.65,109.63,ffill,94.92,ffill,0.99014
2020-04-13,35715.20019,820.0,1194.0,217.98,111.0,116.73,96.43,105.4801,0.98184
2020-04-14,35773.00491,826.94008,1170.02748,217.05471,109.64,112.21,94.92,105.4801,0.973
2020-04-15,35542.15399,810.00018,1137.2,208.62093,111.4,116.7999,96.4699,107.6599,0.94838
2020-04-16,36953.94999999,891.9897,1209.00007,218.09016,111.3999,114.9999,96.4999,105.48,0.98018
2020-04-17,36950.0,896.5998,1221.0,220.40225,111.0,112.8001,96.49,107.64,0.9904
2020-04-18,37400.00001,965.9,1254.29155999,224.06031,109.64,112.8503,96.48,105.4801,0.9987
2020-04-19,37225.99975,942.37577,1226.22103,223.2295,109.64,116.7999,96.48,105.4803,0.99746
2020-04-20,36855.0,923.5,1195.52005,217.4,111.2,113.7001,96.48,105.5,0.98516
2020-04-21,36775.0,923.62104,1195.0,218.13028,111.14,116.7799,96.44,105.5,0.9857
2020-04-22,38149.0,981.98,1239.97,224.61835,111.2,113.7606,94.99,107.4944,1.00065
2020-04-23,40144.99958,997.79778,1264.99126,230.52,109.65,116.49,95.0,105.48,1.03742
2020-04-24,41399.98,1049.64114,1293.26,241.92995,110.01,116.4,96.4899,108.01,1.05119999
2020-04-25,41489.99,1057.0,1298.99998,243.02,111.2,114.0705,94.92,108.01,1.06
2020-04-26,42091.0,1070.03005,1325.97,243.22,111.2,114.1,94.92,105.8003,1.0799
2020-04-27,43459.0,1084.52266,1333.8,247.5,109.66,114.1006,95.0001,106.5,1.09989
2020-04-28,43249.9988,1093.29,1322.01143,250.16148,109.65,114.1102,94.92,105.48,1.17
2020-04-29,46502.0101,1150.5,1400.1,261.0511,111.0,116.28,94.92,107.8899,1.1934
2020-04-30,47299.99993,1129.83,1353.99,252.79994,109.63,114.59,97.0899,107.0,1.15999999
2020-05-01,47510.0,1147.79999,1360.0,252.14138,109.6301,115.8898,97.09,106.9899,1.17005
2020-05-02,48700.0,1156.0,1378.72,259.9889,111.0,114.5501,97.0,105.4801,1.18876
2020-05-03,48350.0,1133.0,1350.51,255.4,ffill,114.75,95.2,106.0,1.172
2020-05-04,48556.02,1128.94307,1356.08,252.5,110.99,114.7503,96.6,105.48,1.18500999
2020-05-05,49669.97753,1128.0,1357.09999999,254.06,110.98,114.7512,95.5101,105.4801,1.1899
2020-05-06,52701.1945,1165.0,1390.7106,260.64999999,110.98,116.3,96.65,106.85,1.22
2020-05-07,57500.0,1235.68,1461.14,278.01004999,109.63,115.0503,97.15,105.6501,1.28
2020-05-08,54899.96901,1174.99966,1453.95101,267.14,111.1699,117.9999,95.17,107.2299,1.21954
2020-05-09,48255.0,1041.999,1328.94,239.99932,109.6301,115.0003,95.17,105.48,1.09842
2020-05-10,50496.98586,1100.0,1349.99,243.00128,109.63,114.07,95.17,107.1992,1.1375
2020-05-11,50000.0,1088.24372999,1348.99082,241.99978,109.6301,113.5501,96.9498,108.68,1.12082
2020-05-12,51654.84,1103.05,1353.0669,246.02,110.0,116.71949,95.0,105.4801,1.14999999
2020-05-13,53899.0,1161.95109,1383.30998,251.51095,110.0,115.7297,96.55,107.77,1.16001
2020-05-14,54815.98,1151.0133,1375.0,249.16165,109.64,112.5,94.9201,107.7595,1.15623
2020-05-15,54000.3126,1136.96989,1360.0,248.70054,111.14,115.49,94.9201,105.51,1.14809999
2020-05-16,55399.99,1161.48,1377.7,251.5,109.63,115.3597,94.92,105.48,1.1632
2020-05-17,55887.99939,1203.8399,1390.00087,252.13,114.82,112.86021,95.9,105.48,1.16607
2020-05-18,55057.46425,1205.99666,1390.0,254.1209,110.0001,115.32,94.95,105.48,1.16086
2020-05-19,55800.54521,1221.4499,1405.0,260.01055,110.91,115.0,97.4799,105.4801,1.175
2020-05-20,54835.19999,1205.08308,1375.0,256.47322,111.01,115.7,95.3,105.48,1.15372999
2020-05-21,51126.0,1121.0,1274.98398,242.5001,111.67,115.69,95.41,105.48,1.1022
2020-05-22,52000.0,1166.76759,1339.0,249.76571,111.68,113.5002,95.29,105.48,1.1317
2020-05-23,51600.0,1162.99102,1329.22,247.97114,111.01,113.5101,95.0,105.48,1.1222
2020-05-24,49555.02135,1126.99999,1288.94,240.0001,109.99,115.6899,94.92,ffill,1.09738
2020-05-25,49633.82293,1145.99971,1287.07354,238.992,109.63,113.0,98.07,109.23,1.08691
2020-05-26,47626.0,1085.99,1229.98,230.02343,109.63,113.0201,95.0,105.488,1.04001
2020-05-27,49091.71016,1109.12015,1244.62497,233.82,111.15,113.2301,94.92,105.5,1.06
2020-05-28,51431.0001,1204.98,1292.55,243.0,109.7106,113.3011,97.4497,108.0,1.08365
2020-05-29,50600.0,1187.10483,1272.0,238.25944,109.8106,113.0003,95.0004,105.8501,1.06519999
2020-05-30,51305.00004,1319.58936999,1322.0026,250.6602,110.0003,112.06,95.0,105.8601,1.10671
2020-05-31,51020.0,1270.99,1307.71916,248.0,114.83,112.06,97.42,105.8601,1.09949999
2020-06-01,53450.0,1315.98,1368.99,253.62011,114.83,112.0701,96.5,105.48,1.125
2020-06-02,50500.0002,1267.19585,1300.05589,244.49631,114.8299,112.3,98.38,106.0,1.06301
2020-06-03,49798.99849,1257.00001,1318.9032,244.49388,111.1302,116.9899,95.4702,107.39,1.055
2020-06-04,50299.98761,1260.13967,1334.91,243.65358,111.5004,116.0,95.5019,ffill,1.06882
2020-06-05,48799.99999,1216.95171,1303.66,236.1,111.5003,115.9885,95.5012,107.38,1.02756
2020-06-06,48700.34617,1216.54296,1276.10006,238.36581,113.75,115.9799,ffill,107.38,1.02923
2020-06-07,49100.0,1231.47977999,1287.98902,234.76,ffill,115.98,95.7,106.15,1.02802
2020-06-08,47550.00017,1206.13363,1250.09999999,228.0,114.7582,115.23,96.0,107.53,0.99737
2020-06-09,48082.0,1220.8783,1265.00021,227.9999,113.09,115.9886,96.0,105.5,1.00279
2020-06-10,49544.9899,1242.99,1290.99,236.12986,113.09,115.9881,96.95,106.99,1.0203
2020-06-11,47000.0,1188.5,1221.10001,221.65872,111.7,113.1,95.51,106.9899,0.97647
2020-06-12,48117.9999,1202.28015,1230.0,228.99,114.7399,115.97,97.4,106.99,0.99119
2020-06-13,47999.9999,1213.97775,1222.4999,227.55,114.73,112.0601,95.8101,105.48,0.98949
2020-06-14,47700.0,1181.61999999,1214.93482,224.5101,ffill,114.88,ffill,ffill,0.97
2020-06-15,48594.7,1199.27,1219.0,225.30415,112.0602,113.55,96.9,107.5199,0.98344
2020-06-16,49449.85998,1220.00757,1227.38339,226.8,114.71,112.0601,96.9,107.4899,0.9951
2020-06-17,49315.08592,1225.0,1254.08180999,229.04786,114.7,112.0601,95.4601,106.0,1.01
2020-06-18,50294.0,1231.51714999,1267.86177,230.95113,114.7197,113.0,96.89,109.57,1.02404
2020-06-19,49899.80974,1230.0,1258.1868,230.55,112.9,113.0,96.89,109.5495,1.0098
2020-06-20,49781.0,1226.5,1243.0009,231.43486,114.7197,114.47,96.8,109.5297,1.01262999
2020-06-21,49900.0,1232.62852,1245.22,231.877,112.75,114.4599,96.88,ffill,1.01
2020-06-22,50898.41092,1276.8501,1269.74,232.2501,112.08,112.06,96.8996,109.4999,1.0025
2020-06-23,50238.10404,1274.40985,1262.61179999,231.1,114.7199,115.2199,96.8889,109.4689,0.9905
2020-06-24,49702.0,1260.16978999,1250.0,228.07865,114.7099,113.87,95.0204,109.4,0.984
2020-06-25,49731.0,1254.0,1243.28001,228.41,113.76,114.03,96.8498,108.0,0.9801
2020-06-26,49890.0,1247.4774,1251.98088,233.12,112.3,112.0805,95.1601,106.75,0.99273
2020-06-27,49600.0015,1228.5,1219.69,228.40349,ffill,112.0806,97.9993,106.71,0.97459
2020-06-28,49700.16,1233.68755,1220.0,228.75768,112.31,114.0,95.8001,106.7101,0.98
2020-06-29,49839.5,1231.62217,1223.99,228.09,112.3105,114.0,97.99,108.0,0.9701
2020-06-30,50147.76992,1237.0101,1226.24529,227.6,113.0,112.08,97.995,106.7,0.9671
2020-07-01,49984.9822,1240.26018,1219.85836999,226.1,112.3105,113.95,96.2,107.9899,0.95293
2020-07-02,49489.9999,1231.93275,1204.13416,224.19961,113.77,113.96,96.3001,ffill,0.95039
2020-07-03,48999.88947,1227.3,1195.01,224.19948,113.77,113.95,97.9945,107.99,0.9585
2020-07-04,49010.25861,1229.24768,1206.74149,225.44417,112.3201,113.95,97.9945,107.9899,0.952
2020-07-05,49000.0,1220.0001,1182.54001,223.37198,112.3201,113.978,97.99,106.7001,0.94801
2020-07-06,49770.0,1277.24,1261.90255,233.0,112.3302,112.1205,98.0,106.7001,0.9988
2020-07-07,49889.0,1283.0,1268.05825,233.99,115.9198,114.9999,97.99,109.45,1.02689999
2020-07-08,50088.76,1301.1102,1280.0,241.18,114.9999,115.2894,99.7999,110.99,1.05207999
2020-07-09,49751.91484,1293.65603,1260.04,238.17989,112.5233,114.2801,98.2007,107.5018,1.079
2020-07-10,50045.45661,1300.51,1275.36926,237.72,112.5321,117.98,99.88,107.9031,1.084
2020-07-11,49825.00051,1292.69,1273.18874,239.92815,115.9199,117.98,99.89,111.07,1.07641
2020-07-12,49850.0001,1301.74,1266.47817,238.31,115.9197,114.6013,99.89,111.07,1.0767
2020-07-13,50248.77667,1301.47027,1267.11999999,237.02,115.91,117.9799,99.9999,111.2,1.07229
2020-07-14,50000.04,1290.60088,1249.0,234.66,115.91,117.97,99.9999,108.2006,1.0676
2020-07-15,49867.01,1286.0,1230.0,233.00011,113.59,117.89,98.0,108.2501,1.06575
2020-07-16,49350.0,1269.98999,1225.0,229.61867,113.1,117.97,98.0101,111.2095,1.04668999
2020-07-17,49879.97867,1268.84364,1215.02,229.22616,112.62,118.2,98.0202,111.36,1.04831
2020-07-18,49640.0001,1275.29015,1221.64646,229.74,111.0001,114.0,99.9497,111.3599,1.06212
2020-07-19,49681.1,1279.0,1219.25435,228.89,112.62,117.59,99.0,111.3499,1.0656
2020-07-20,49421.0001,1270.00001,1217.79929,228.76,112.9899,113.7,98.21,108.97,1.06002
2020-07-21,49250.0,1291.164,1200.00011,228.99131,110.9999,116.0,98.2301,111.3199,1.0402
2020-07-22,49100.0,1350.06,1226.0001,231.6,111.0,113.931,99.97,108.9701,1.04536999
2020-07-23,50000.0,1427.85323,1243.95259,233.6,111.0,118.17,100.41,108.97,1.07166
2020-07-24,49954.27654,1490.99,1237.771,238.8704,108.7305,115.21,100.4299,110.0,1.08
2020-07-25,50449.3318,1574.00001,1283.0073,248.58,110.99,115.5,100.4299,110.0,1.11999
2020-07-26,51420.0,1680.0,1285.01394,249.9714,108.9007,116.5251,100.42,108.99,1.12027
2020-07-27,54250.0,1605.36,1356.49,267.20011,108.9001,116.8502,99.48,111.0,1.1366
2020-07-28,55791.76414,1615.56,1442.01,280.0,107.0001,116.99,95.05,107.0,1.19751999
2020-07-29,57128.51119,1645.00726,1458.0021,281.5,110.97,116.9501,97.0049,110.2899,1.2249
2020-07-30,56899.99,1715.0,1492.0,288.95999999,108.0001,117.5002,97.101,109.5,1.242
2020-07-31,58960.0,1830.0,1580.0,304.39,110.8599,118.9299,98.02,107.8702,1.34813
2020-08-01,61850.02,2071.2904,1700.05593,328.99999,110.85,116.8504,96.0001,107.8702,1.59
2020-08-02,58538.93,1975.25115,1517.0,302.00000999,108.0101,116.8503,98.0,105.48,1.51338
2020-08-03,60487.99134,2090.0001,1556.00013,311.87974,108.0101,116.9003,95.06,110.11,1.64601
2020-08-04,59525.00004,2067.08262,1514.44829,303.19905999,110.0,119.9898,98.95,105.5201,1.56642
2020-08-05,61960.0,2139.99993,1549.9501,312.42777,109.9599,119.959,95.17,110.1,1.60602
2020-08-06,63549.97968,2146.98999999,1712.85,318.81,107.0,119.2999,99.8997,109.8709,1.638
2020-08-07,63349.98,2079.7701,1660.0,314.58997,106.99,119.9999,99.4998,110.0101,1.595
2020-08-08,63690.0,2130.9133,1669.0,316.25534,100.51,119.9999,97.101,112.06,1.61005
2020-08-09,65204.62,2164.98975,1698.0,320.0,106.9899,117.15,99.48,109.9803,1.6199
2020-08-10,65546.6779,2168.99969,1668.99114,319.87,109.8993,120.9409,99.4399,112.312,1.6602
2020-08-11,62000.0,2015.8735,1536.0001,296.95999999,103.559,117.1504,96.4111,110.088,1.52
2020-08-12,63848.83032,2137.88,1573.0,301.0029,108.9,119.99,97.9999,112.3827,1.54052
2020-08-13,63100.69,2269.0,1570.0804,302.89,104.1101,119.98,96.01,110.2901,1.56041
2020-08-14,64355.0,2414.9901,1610.08789,312.88,108.5,117.1714,95.18,112.55,1.63001
2020-08-15,64272.2013,2353.02722,1650.0,331.08999999,106.0,117.1715,95.9,112.5,1.638
2020-08-16,64115.24418,2343.24005,1650.0,340.99,108.0299,117.1599,95.9101,112.5502,1.63036
2020-08-17,67677.77,2399.93916,1749.0,374.91,106.0011,117.51,95.6001,106.51,1.75992
2020-08-18,66297.99999,2340.99989999,1691.93758,361.0,107.7,119.78,95.0,110.0,1.67753
2020-08-19,65650.0,2297.0,1644.56416,352.49983,106.96,117.5315,95.0201,110.0,1.64378
2020-08-20,66875.8852,2343.86983,1653.99508,352.0999,107.6895,119.8,95.5401,107.0,1.63815
2020-08-21,64502.00001,2208.29043,1624.00633,337.47777,107.2,118.0,97.6198,107.0101,1.5979
2020-08-22,65947.96,2245.0,1625.0,341.708,107.68,119.8,95.5601,107.01,1.6198
2020-08-23,65870.01964,2236.0,1618.73532,346.99,104.0502,118.7701,97.66,107.01,1.616
2020-08-24,66062.0,2294.74825999,1628.0,345.66001,109.0,118.9001,96.0001,107.0101,1.623
2020-08-25,63651.00003,2170.21999999,1553.9199,329.02,106.0,117.5304,95.6501,108.88,1.57851
2020-08-26,64120.02011,2170.0,1557.93742,331.05569,108.6,119.7497,97.63,107.01,1.57
2020-08-27,63408.20484,2159.99949,1485.43001,317.40005,108.6,117.5505,95.7,105.01,1.48939
2020-08-28,63050.01021,2156.54631,1471.0,317.99991,ffill,117.5512,95.7201,105.02,1.4885
2020-08-29,63599.97342,2192.43521999,1486.49987,318.02,108.99,117.5515,95.73,110.5,1.516
2020-08-30,63449.53011,2300.0,1512.99001,338.08999999,107.38,117.85,95.71,105.04,1.5331
2020-08-31,63900.0421,2391.99995,1511.49713,337.71992,106.0,117.6,95.72,105.0605,1.54045
2020-09-01,64500.00001,2547.99983,1555.9999,339.5,107.06,117.5516,96.97,105.1501,1.59656
2020-09-02,62299.98,2434.92290999,1454.95411,321.27999999,107.38,117.55,95.7201,105.21,1.5027
2020-09-03,56029.08064,2090.00025,1218.7455,263.69,104.072,117.5501,95.7,105.31,1.34015
2020-09-04,56674.28999,2117.32913999,1277.03671,274.59954,104.2,117.5509,95.7,105.15,1.39597
2020-09-05,54799.0,1799.92,1218.13383,256.99909,104.2,117.55,93.5,105.15,1.28768
2020-09-06,55400.02,1921.82974,1241.45049,261.99,ffill,117.55,97.05,105.15,1.30021
2020-09-07,55230.00204,1914.01981,1227.96597,261.97,104.22,117.55,95.8,109.82,1.29495
2020-09-08,54389.82815,1826.27984,1200.99618,251.99102,107.87,118.0,97.05,105.0159,1.27
2020-09-09,55436.56,1999.0,1232.33441999,262.06268999,107.87,119.5,95.9,105.01,1.31449
2020-09-10,55267.53809,1955.2901,1210.05569999,260.8,104.76,118.0,96.0,105.0,1.3045
2020-09-11,55973.7299,2009.96296,1211.18066,262.24255,108.25,118.011,95.9004,105.01,1.31519999
2020-09-12,56117.99988,2051.08,1223.19579,270.33,ffill,119.78,96.7704,105.02,1.32077
2020-09-13,55301.0,1973.91471,1216.66438,261.77,108.0,118.0103,96.7704,106.49,1.30031999
2020-09-14,57715.99237,2043.97519,1261.68311,265.17,108.01,118.491,96.8101,105.03,1.32
2020-09-15,57499.94303,1945.43,1240.28,259.4845,107.5,119.9698,96.9203,105.02,1.28858999
2020-09-16,58150.0,2018.81986,1250.025,258.64033999,109.2,117.6502,97.1009,105.02,1.3358
2020-09-17,58049.39931,2044.87402,1232.02005,258.39999999,109.2,119.89,97.5107,106.0,1.32108
2020-09-18,59550.01,2079.47989999,1272.20495,263.37,107.5,118.0,97.5701,106.99,1.36067
2020-09-19,59000.0,2076.90641999,1260.3801,262.0003,109.0,119.9,97.6302,106.99,1.36075
2020-09-20,59550.0,2057.68163,1241.00001,259.47993,ffill,118.0001,101.9675,105.03,1.33522
2020-09-21,56900.0,1894.28305,1175.0,241.66349,107.01,117.8,101.88,105.02,1.27499999
2020-09-22,58195.78209,1910.0826,1206.00077,250.21224,108.9599,117.2,101.7599,105.1,1.2881
2020-09-23,58002.33865,1841.13366,1180.00295,245.99652,107.45,119.5,89.01,105.0,1.27725
2020-09-24,59200.0,1933.80326,1203.78999,249.7744,107.01,118.0,94.65,106.92,1.29746
2020-09-25,59949.98,1968.88443,1211.10999999,254.89005,108.92,119.35,98.94,106.91,1.35
2020-09-26,59852.01,1989.78,1240.0,258.5,107.01,118.0,99.0,106.89,1.35977
2020-09-27,60423.1018,1988.5901,1270.99,259.04887,ffill,ffill,ffill,ffill,1.35697
2020-09-28,60600.09,1995.1207,1277.58537,256.35,107.01,119.4,96.5202,105.03,1.35581
2020-09-29,60889.06107,2022.21068,1280.7,256.64677999,ffill,118.0,96.5401,106.39,1.35635
2020-09-30,60855.0002,2029.95451,1265.60005,260.07002999,108.8899,118.0001,96.5401,105.021,1.36114
2020-10-01,60493.0,2009.58409,1282.57115,263.89999,108.85,117.55,96.5601,105.0,1.351
2020-10-02,60389.97974,1977.00703,1262.6391,257.86077999,107.0003,117.55,97.728,ffill,1.34517
2020-10-03,60217.85516,1984.99,1258.04,259.74462,107.0,117.55,96.9999,105.0,1.34278
2020-10-04,60636.06,2015.02,1278.99999,264.71936,107.0,117.57,96.96,106.25,1.41762
2020-10-05,60450.0,1987.17264,1259.99999,259.66042,108.83,117.56,96.699,105.0,1.41474
2020-10-06,59888.97771,1935.99999,1235.15,257.40994999,108.83,118.96,95.0,105.0,1.3842
2020-10-07,59890.0,1924.96505,1252.04397,262.52864,107.0001,117.55,94.0,105.0,1.39051
2020-10-08,61199.00001,1961.06056,1312.84999999,261.88015,107.0001,118.95,94.01,105.0,1.41851
2020-10-09,63146.99541,2064.01001,1310.88001,268.91001,107.0001,118.9599,94.9389,105.0,1.42
2020-10-10,63050.0,2047.6999,1340.61961,271.74999,107.1001,117.45,91.0,105.9795,1.41088
2020-10-11,62868.55,2052.48,1330.08999999,277.46003,107.1,117.35,91.01,105.0001,1.41652
2020-10-12,63177.77004,2136.4998,1328.26142,279.99001,107.09,117.25,91.0,105.0,1.4176
2020-10-13,63614.8974,2125.12388999,1409.95845,279.75442,ffill,117.25,91.0101,103.0,1.43
2020-10-14,64140.25999,2127.69999999,1453.74,279.09999,107.0,117.05,92.959,104.0001,1.40147
2020-10-15,65000.0,2137.99809999,1475.11031,279.24004,107.0001,116.9,90.49,104.0003,1.39877
2020-10-16,64201.05001,2105.49998999,1424.23,271.86435999,112.6,116.9,92.93,104.0,1.37054
2020-10-17,64500.00003,2100.35,1408.39998,269.29989999,107.0014,ffill,91.51,ffill,1.37129
2020-10-18,64910.0,2100.77048,1409.01,270.49948999,107.0026,117.54,92.9,ffill,1.38395
2020-10-19,66011.0136,2126.00001,1408.0,271.19,111.9999,116.85,91.53,103.51,1.38723
2020-10-20,67601.01171,2105.35628,1376.99956,265.84008,107.0109,116.9,91.53,103.0001,1.3721
2020-10-21,70010.00002,2170.77113,1471.9,301.0,107.0009,116.5303,91.53,103.0001,1.41008
2020-10-22,72127.29210999,2279.19965,1489.52235,306.4799,107.0007,116.45,92.9199,105.49,1.4265
2020-10-23,72973.97,2309.99989999,1506.98,309.99006,107.0,116.35,92.8499,105.4799,1.42213
2020-10-24,73299.9999,2300.0,1525.29604,326.99998,110.0,116.04,90.55,105.4799,1.42977
2020-10-25,73598.98,2286.05453,1512.45001,329.65928,ffill,116.34,90.59,104.0002,1.42932
2020-10-26,73527.6254,2223.0,1474.26,322.02942,107.0,114.8501,90.75,104.0,1.4
2020-10-27,78948.98,2307.96429,1519.97,338.49,107.0001,113.36,90.96,103.0,1.4399
2020-10-28,76213.8102,2237.92965999,1553.53246,322.6,107.0,113.3601,90.97,103.0,1.41019
2020-10-29,78180.67,2240.32,1535.01,318.68,107.0,113.3501,90.96,104.98,1.4099
2020-10-30,78200.0,2216.52376,1519.43998,317.15992,107.0,109.01,90.95,103.0001,1.38497
2020-10-31,79200.02,2235.78617,1511.89,320.0,107.0,109.0,90.96,103.0001,1.39
2020-11-01,79150.0,2299.0,1533.99002,322.2,ffill,109.01,90.75,103.0,1.39899
2020-11-02,77815.39999999,2211.0,1450.0,308.0,104.0701,108.9,90.5,103.0,1.36
2020-11-03,79416.0,2226.12704,1401.72036,308.92393,108.959,117.87,90.75,102.0001,1.37678
2020-11-04,80700.00999999,2305.57397,1395.0,312.94672,108.8398,117.8599,90.97,104.95,1.3655
2020-11-05,86330.69001,2377.82571999,1402.28005,335.58002,105.0,117.5,90.7501,104.93,1.38998
2020-11-06,84620.0,2489.00001,1442.52,342.00004,105.0003,117.0,90.7,104.91,1.43082
2020-11-07,81720.9838,2398.63808,1391.8788,325.13053,105.0,117.59,90.7,104.8983,1.359
2020-11-08,84397.57068,2455.44008,1441.3,328.5,ffill,116.5,90.7001,103.0,1.38392
2020-11-09,83687.51480999,2414.56054,1432.71972,322.13997999,104.5,117.0,91.5,104.8898,1.37381
2020-11-10,84185.65386999,2503.1636,1424.44,326.99999,104.5,117.5,90.75,103.0,1.39738
2020-11-11,85558.20516,2514.57011,1398.25999,319.82,104.5,117.8987,91.5,104.8898,1.39899
2020-11-12,88800.0,2529.99965,1416.2479,331.60008,107.46,117.5,90.7501,104.87,1.39998
2020-11-13,88000.04,2573.46578,1402.49,346.0,104.5,117.88,91.5,103.0101,1.478
2020-11-14,87770.9326,2515.69999999,1397.23,345.23775,107.4393,ffill,90.75,103.0001,1.49339
2020-11-15,87799.73,2481.9133,1399.97923,357.36998,104.5003,116.5,90.75,103.003,1.47182
2020-11-16,90451.05,2505.3509,1408.0,399.15864,107.47,125.0,91.5,103.0025,1.57125
2020-11-17,94800.14024,2586.00001,1389.97,400.0,105.0,125.0,90.75,103.1,1.62397
2020-11-18,96700.04078,2581.94999999,1377.0,400.66816,105.0,128.0,91.48,103.1,1.59145
2020-11-19,96719.87788,2576.67,1395.00001,439.05919,105.1005,128.99,90.75,104.8799,1.61977
2020-11-20,100000.0,2783.99999,1426.91,445.98,105.2,125.0,90.75,103.1,1.82472
2020-11-21,99410.02001,2929.29007,1523.12247,456.00003,105.2,125.0,90.25,103.0,2.45989
2020-11-22,99599.68667,3070.5197,1534.99,450.0,105.1,125.0,89.75,102.0,2.43013
2020-11-23,100619.92089,3399.51957,1858.0,494.0,112.0,128.0,91.5,103.0,3.3018
2020-11-24,103953.33905,3278.51045,1900.00102,487.20027,105.1106,125.992,89.26,102.0,3.66012
2020-11-25,101200.0,2980.02,1684.96562,428.00001,106.5055,129.0,91.45,102.01,3.31053
2020-11-26,94000.0,2850.01025,1484.54,388.0,120.47,131.8257,91.49,103.09,2.93
2020-11-27,92499.06,2800.88,1458.82,380.69,121.9995,126.5003,95.5,103.0,3.02013
2020-11-28,95395.13613,2911.00687,1492.39,396.37,122.9483,131.97,93.0006,103.0,3.3298
2020-11-29,100142.0,3155.53549,1596.0,431.3,115.0006,131.9687,95.48,104.89,3.4
2020-11-30,103601.02001,3249.99989,1670.7,471.0,120.6724,133.5865,96.96,104.8,3.46
2020-12-01,99131.17,3135.08289,1539.99,448.0,122.0,133.5865,96.9,104.0001,3.23218
2020-12-02,100614.99,3147.99,1540.40474,464.91109,121.0,132.2626,100.0,104.9898,3.2799
2020-12-03,100420.79,3190.62606,1522.99743,460.23994,120.8011,133.5865,96.8511,104.0,3.24403
2020-12-04,98399.99,3019.69654,1476.99999,421.40023,120.8442,132.4026,100.0,110.0,2.97995
2020-12-05,100208.38,3158.40478,1524.41812,440.0,120.8441,135.0772,100.0,110.0,3.17783
2020-12-06,99702.53908,3115.59504,1488.75187,432.97994,123.12,135.07,99.69,112.0,3.19
2020-12-07,98700.00001,3036.00219,1475.94599,430.0,123.14,135.4898,99.69,111.94,3.1202
2020-12-08,94998.99998,2838.10415,1369.97,396.99,123.12,132.8848,99.96,116.076,2.9
2020-12-09,96201.81,2976.23,1406.99794,402.87841,123.12,135.49,98.5,116.182,2.9882
2020-12-10,91000.0,2782.48425,1315.62003,363.1,124.0002,133.6102,96.91,116.221,2.8001
2020-12-11,94414.3,2890.96998,1365.94918,385.76,124.045,135.8419,98.0,117.88,2.78008
2020-12-12,96999.1,2910.70102,1371.99003,393.41574,124.045,135.8399,98.0,116.2598,2.56002
2020-12-13,97884.95,2990.0,1414.96991,417.11066,124.0,134.0,97.0,117.8696,2.62996
2020-12-14,99649.9999,3027.03,1422.01,430.56,124.0,132.0006,97.0,117.98,2.58
2020-12-15,99179.94909,2970.0,1455.64919,409.99,123.12,134.15,96.9001,116.6042,2.29264
2020-12-16,109300.01001,3225.0,1572.97,462.99993,123.15,133.6618,96.9001,117.9799,2.8486
2020-12-17,115999.62376,3249.9999,1590.99,549.61992,123.12,135.0301,98.05,116.6831,2.98
2020-12-18,117899.94,3319.3169,1588.9893,551.97997999,124.6338,136.5,100.9,117.97,2.94
2020-12-19,119498.9937,3278.23,1584.3,598.0,124.6338,134.1,98.0015,116.7225,2.90089
2020-12-20,120426.99,3284.0363,1857.0007,580.999,123.1201,136.5,100.1898,116.7223,2.88918
2020-12-21,118260.24008,3171.68421,1640.61,548.19994999,124.69,136.7057,98.0,116.8193,2.56999999
2020-12-22,123010.0,3276.7,1652.0,588.36888,124.6899,136.5,98.0008,116.77,2.14041
2020-12-23,121962.84609,3101.85,1522.0,541.85,123.12,136.75,98.0018,116.78,1.4518
2020-12-24,124300.0,3216.27001,1570.0,578.88851,124.6899,136.8501,100.07,116.78,1.87611
2020-12-25,131501.0,3299.98,1661.00006,679.91999999,123.1201,136.9999,98.0,116.78,1.64999
2020-12-26,142499.0,3434.99,1800.0,710.54003,124.69,135.0103,98.0505,116.79,1.5835
2020-12-27,143298.98989999,3700.00001,1830.0,689.44946,124.6899,135.03,100.0282,115.0,1.49487
2020-12-28,143402.05004,3881.5299,1899.99998,695.66817,121.0001,137.09289999,98.0001,120.0,1.25981
2020-12-29,145899.98001,3895.0,1865.14006,687.31208,124.6799,135.0201,98.15,119.9999,1.05999
2020-12-30,149860.00012,3887.39328,1829.18676,667.48969,117.3302,137.06,98.16,110.0013,1.13928
2020-12-31,152700.00003,3910.00001,1833.99,693.0,122.6,135.02,93.0,90.0331,1.16902
2021-01-01,153458.29999999,3834.37353,1792.06332,659.12992999,117.3304,135.02,94.0003,116.9897,1.23096999
2021-01-02,172189.98444999,4095.0,1891.02886,719.96,117.85,137.0695,98.73,116.98,1.1768
2021-01-03,176877.58,5239.86999,2240.93999,839.3035,118.27,135.53,94.01,110.0007,1.229
2021-01-04,174170.0,5810.40172,2185.5,834.91993,124.2397,134.0799,97.6098,110.0015,1.25655999
2021-01-05,178595.0,5750.1,2185.24512,838.57803,124.25,130.98939999,97.59,116.87,1.201
2021-01-06,198003.00001,6496.88999,2451.99941,914.50978,125.0,126.33,94.96,115.8492,1.40425
2021-01-07,208000.0,6480.0,2347.21999999,863.20016,225.0,126.26,90.01,115.0,1.73016
2021-01-08,219899.98998,6629.0,2353.7206,938.81,219.0,138.01,98.9992,142.07,1.75652
2021-01-09,223450.0,7234.05003,3345.0,998.22,249.0,160.0,98.0,164.51,1.83348
2021-01-10,195744.88531,6345.01005,2865.00002,860.0,229.99,150.06,94.08,147.0,1.62073
2021-01-11,193201.01061,5998.8995,2669.94,769.22048,130.1813,140.5,90.01,122.0,1.59488
2021-01-12,182679.87123,5671.7266,2612.5,724.98,130.1813,138.19999999,101.49,122.27,1.60008
2021-01-13,199501.09054,5969.74244,2644.98999999,778.98,130.18,140.7699,101.5,119.42,1.55008
2021-01-14,204500.24131,6427.30402,2712.20415,796.20453,130.181,142.78,101.5,117.42,1.56366
2021-01-15,194600.0,6200.01025,2579.83981,762.73,130.1813,143.68,101.5,111.0,1.5
2021-01-16,195000.38458,6661.01001,2617.31002,781.78425,130.18,140.2332,101.5,115.73,1.52632
2021-01-17,191397.84193,6527.00002,2565.0,757.00114,130.18,143.4,101.5,115.7,1.47299
2021-01-18,193774.0401,6982.0,2720.0,825.0,130.18,143.3499,101.5,114.74,1.52
2021-01-19,195000.0,7514.98,2759.02,838.83907,130.18,143.3099,101.5,115.73,1.575
2021-01-20,185984.29991,7168.53756,2601.10119,777.1,130.18,141.0,101.5,116.17,1.59038
2021-01-21,165999.96999,6289.9996,2293.2799,725.99633,130.18,140.01,101.5,114.74,1.441
2021-01-22,177600.09688,6719.93734,2367.52292,750.70666,122.0601,143.1799,101.5,114.74,1.51983
2021-01-23,177188.00946,6939.09609,2379.9,763.00191,130.18,142.4999,101.5,116.04,1.49413
2021-01-24,178758.97854,7784.0,2439.79979,787.93954,122.0001,134.53,101.5,114.7387,1.50142
2021-01-25,179802.0,7503.99011,2439.97878,762.27084,130.0,134.1,101.5,115.04,1.49479
2021-01-26,173550.01,7116.4545,2250.0,718.34,126.17,135.05,101.5,114.7387,1.44
2021-01-27,169479.98449,6958.00003,2118.08021,683.76091,122.5,138.53,101.5,114.7501,1.38
2021-01-28,181700.0,7259.97005,2180.96194,729.76201,124.17,138.53,102.1206,119.92,1.44
2021-01-29,185627.21,7379.73822,2199.77655,724.99,124.2193,139.02,104.2,118.509,1.56608
2021-01-30,185399.01932,7416.93775,2220.0,721.10063,125.0,137.0301,102.1206,118.509,2.29928
2021-01-31,185649.97825,7264.99,2201.98106,715.96416,128.9998,139.63999999,102.1206,118.509,2.6999
2021-02-01,183999.98912,7451.01,2270.11988,728.98353,126.8825,137.15,102.1303,118.6396,2.13999
2021-02-02,193502.54109,8199.99,2339.98,818.05001,124.4148,137.1842,102.1206,118.6792,2.0402
2021-02-03,201422.44641,9044.98,2392.19444,822.28702,126.97,137.261,102.13,118.42,2.09785999
2021-02-04,200999.21006,8847.99975,2310.99919,800.47968,127.0197,139.0001,102.13,121.1577,2.40478
2021-02-05,212501.10006,9200.24,2564.28066,880.0,127.0653,142.8999,105.13,121.1982,2.36439
2021-02-06,210000.00634,8935.00714,2435.01005,834.48998,124.5492,140.53,102.15,121.19,2.39299
2021-02-07,210499.97981,8626.04999999,2421.24962999,817.79,124.5492,141.99,102.15,119.92,2.30909
2021-02-08,243245.0,9152.65852,2541.20035,880.97001,124.4905,141.53,105.1383,119.9201,2.41819
2021-02-09,250779.8897,9740.01,2829.03,1018.85982,127.25,139.6,106.3499,119.92,2.63645
2021-02-10,243299.89,9489.05877,2700.0,979.95999,129.9,142.9998,106.31,121.1499,2.79013
2021-02-11,256999.91992,9608.98999,2864.08,1003.39001,129.8998,142.9498,105.2403,119.0601,3.02996
2021-02-12,258994.98,10097.73,3141.0,1104.67861999,126.1902,140.69999999,105.24,120.62,3.47
2021-02-13,259399.98,10119.98948,3989.96999,1230.69014,126.1604,141.4899,105.24,119.0,3.37638
2021-02-14,262900.0,9800.10104999,3750.00018,1134.87997,127.46,140.53,102.7001,118.92,3.15
2021-02-15,266099.98,9989.0,4053.34434,1189.88905,126.0,138.03,103.0,117.5403,3.12
2021-02-16,273999.99,9824.99926,3891.18998,1170.02027,127.42,138.035,103.99,119.4199,2.89539
2021-02-17,288909.98,10484.95,3968.0066,1305.00011,125.1201,139.99,105.4441,119.2923,3.0183
2021-02-18,284699.99997,10657.79336,3841.76967,1252.0,127.0,139.9898,105.8466,119.56,2.89121
2021-02-19,306799.97679,10814.52996,3964.5005,1335.0101,127.52,138.59549999,106.0,120.92,3.07
2021-02-20,313999.4,10886.9725,3898.99997,1294.27348,125.521,138.04,106.3299,121.9199,2.95369
2021-02-21,317000.00254,10610.00085,3864.4222,1259.9997,127.63,139.44999999,105.8812,119.65,2.9724
2021-02-22,285000.00189999,9549.85709999,3328.97,1106.93935,125.8258,139.3998,106.35,119.8415,3.02878
2021-02-23,279900.0,9078.29319,3000.0,1020.68507,128.4142,138.981,106.2156,119.89,2.73324
2021-02-24,278798.97259,8991.61295,2953.86802,1003.31012,125.9176,135.0401,103.5,119.9223,2.60022
2021-02-25,269999.9914,8529.9843,2819.96399,1017.58036,128.4499,136.5,106.2856,115.75,2.50999999
2021-02-26,267367.3369,8408.0,2797.1,997.2002,126.0085,136.04,106.3206,116.73,2.48
2021-02-27,261001.00002,8289.10233,2731.87687999,955.88263,126.01,136.05,107.27,120.9998,2.46101
2021-02-28,268000.01,8343.78,2723.71799999,967.6779,126.01,135.03,107.26,118.24,2.44546
2021-03-01,280999.9498,8920.0,2876.9199,993.99999,128.04,139.421,106.45,116.74,2.52063
2021-03-02,276999.95685,8619.46001,2964.9,1036.63362,126.2083,139.5,106.4805,120.69,2.48263
2021-03-03,289499.99,9167.35747,3005.6716,1092.16577,126.2541,134.83009999,106.5156,120.24,2.56
2021-03-04,273999.99991999,8599.95,2818.89,1010.03554,127.89,140.27,106.5506,119.24,2.67457
2021-03-05,279007.09934999,8790.01556,2872.8804,1041.51731,126.3455,142.0,106.5857,120.2981,2.63001
2021-03-06,280101.53999999,9310.99032,2865.80622,1042.05,126.3455,140.1,106.5857,120.29,2.6126
2021-03-07,285000.0,9609.99,2924.7786,1061.96166,128.8,142.3,107.2899,120.99,2.6187
