{
    "username": "t.jaeger@misumi-europe.com",
    "password": "pass",
    "name": "Nikola Ivanov",
    "url_uk": "https://misumiweb:misumimisumi@stg0-uk.misumi-ec.com",
    "url_de": "https://misumiweb:misumimisumi@stg0-de.misumi-ec.com",
    "url_it": "https://misumiweb:misumimisumi@stg0-it.misumi-ec.com",
    "url_fr": "https://misumiweb:misumimisumi@stg0-fr.misumi-ec.com"
}