<?xml version="1.0" encoding="iso-8859-1"?>
<!-- Generator: Adobe Illustrator 23.0.1, SVG Export Plug-In . SVG Version: 6.00 Build 0)  -->
<svg version="1.1" xmlns="http://www.w3.org/2000/svg" xmlns:xlink="http://www.w3.org/1999/xlink" x="0px" y="0px" width="48px"
	 height="48px" viewBox="0 0 48 48" enable-background="new 0 0 48 48" xml:space="preserve">
<g id="guides">
</g>
<g id="Layer_2">
	<g>
		<g>
			<linearGradient id="SVGID_1_" gradientUnits="userSpaceOnUse" x1="6.5884" y1="35.44" x2="6.5884" y2="27">
				<stop  offset="0" style="stop-color:#7A7D82"/>
				<stop  offset="1" style="stop-color:#A1AAB0"/>
			</linearGradient>
			<polygon fill="url(#SVGID_1_)" points="6.09,27 7.09,27 7.09,34.53 6.09,35.44 			"/>
			<linearGradient id="SVGID_2_" gradientUnits="userSpaceOnUse" x1="14.3384" y1="26" x2="14.3384" y2="25">
				<stop  offset="0" style="stop-color:#7A7D82"/>
				<stop  offset="1" style="stop-color:#A1AAB0"/>
			</linearGradient>
			<path fill="url(#SVGID_2_)" d="M17.09,25.87L16.7,26h-5.11v-1h4.98C16.73,25.3,16.9,25.59,17.09,25.87z"/>
			<linearGradient id="SVGID_3_" gradientUnits="userSpaceOnUse" x1="17.8684" y1="42" x2="17.8684" y2="31">
				<stop  offset="0" style="stop-color:#7A7D82"/>
				<stop  offset="1" style="stop-color:#A1AAB0"/>
			</linearGradient>
			<path fill="url(#SVGID_3_)" d="M23.09,31.52V42H12.65l0.91-1h8.53v-9.61L22.22,31C22.5,31.19,22.79,31.36,23.09,31.52z"/>
		</g>
		<path fill="#6A6D73" d="M41.09,30.13v9.67c0,0.66-0.54,1.2-1.2,1.2h-13.8v-8.19c-0.34-0.11-0.67-0.23-1-0.36V42h14.8
			c1.22,0,2.2-0.98,2.2-2.2V29.3C41.77,29.59,41.43,29.86,41.09,30.13z"/>
		<g>
			<path fill="#77BAFF" d="M10.5,3.25c1.52,0,2.75,1.23,2.75,2.75s-1.23,2.75-2.75,2.75S7.75,7.52,7.75,6S8.98,3.25,10.5,3.25
				 M10.5,2.25C8.43,2.25,6.75,3.93,6.75,6s1.68,3.75,3.75,3.75S14.25,8.07,14.25,6S12.57,2.25,10.5,2.25L10.5,2.25z"/>
		</g>
		<g>
			<path fill="#77BAFF" d="M7.5,18.25c1.52,0,2.75,1.23,2.75,2.75s-1.23,2.75-2.75,2.75S4.75,22.52,4.75,21S5.98,18.25,7.5,18.25
				 M7.5,17.25c-2.07,0-3.75,1.68-3.75,3.75s1.68,3.75,3.75,3.75s3.75-1.68,3.75-3.75S9.57,17.25,7.5,17.25L7.5,17.25z"/>
		</g>
		<linearGradient id="SVGID_4_" gradientUnits="userSpaceOnUse" x1="3.93" y1="7" x2="3.93" y2="5">
			<stop  offset="0" style="stop-color:#7A7D82"/>
			<stop  offset="1" style="stop-color:#A1AAB0"/>
		</linearGradient>
		<path fill="url(#SVGID_4_)" d="M5.75,6c0,0.34,0.04,0.68,0.11,1H3C2.45,7,2,6.55,2,6s0.45-1,1-1h2.86C5.79,5.32,5.75,5.66,5.75,6z
			"/>
		<linearGradient id="SVGID_5_" gradientUnits="userSpaceOnUse" x1="17.4584" y1="7" x2="17.4584" y2="5">
			<stop  offset="0" style="stop-color:#7A7D82"/>
			<stop  offset="1" style="stop-color:#A1AAB0"/>
		</linearGradient>
		<path fill="url(#SVGID_5_)" d="M19.78,5c-0.66,0.62-1.27,1.28-1.82,2h-2.82c0.07-0.32,0.11-0.66,0.11-1c0-0.34-0.04-0.68-0.11-1
			H19.78z"/>
		<linearGradient id="SVGID_6_" gradientUnits="userSpaceOnUse" x1="2.43" y1="21.99" x2="2.43" y2="20.01">
			<stop  offset="0" style="stop-color:#7A7D82"/>
			<stop  offset="1" style="stop-color:#A1AAB0"/>
		</linearGradient>
		<path fill="url(#SVGID_6_)" d="M2.75,21c0,0.34,0.04,0.67,0.11,0.99C2.37,21.92,2,21.5,2,21s0.37-0.92,0.86-0.99
			C2.79,20.33,2.75,20.66,2.75,21z"/>
		<linearGradient id="SVGID_7_" gradientUnits="userSpaceOnUse" x1="13.7084" y1="22" x2="13.7084" y2="20">
			<stop  offset="0" style="stop-color:#7A7D82"/>
			<stop  offset="1" style="stop-color:#A1AAB0"/>
		</linearGradient>
		<path fill="url(#SVGID_7_)" d="M14.8,20c0.12,0.69,0.28,1.35,0.48,2h-3.14c0.07-0.32,0.11-0.66,0.11-1c0-0.34-0.04-0.68-0.11-1
			H14.8z"/>
		<linearGradient id="SVGID_8_" gradientUnits="userSpaceOnUse" x1="7.68" y1="15" x2="7.68" y2="13">
			<stop  offset="0" style="stop-color:#7A7D82"/>
			<stop  offset="1" style="stop-color:#A1AAB0"/>
		</linearGradient>
		<path fill="url(#SVGID_8_)" d="M13.25,14c0,0.34,0.04,0.68,0.11,1H3c-0.55,0-1-0.45-1-1s0.45-1,1-1h10.36
			C13.29,13.32,13.25,13.66,13.25,14z"/>
		<linearGradient id="SVGID_9_" gradientUnits="userSpaceOnUse" x1="34.0884" y1="19" x2="34.0884" y2="9">
			<stop  offset="0" style="stop-color:#7A7D82"/>
			<stop  offset="1" style="stop-color:#A1AAB0"/>
		</linearGradient>
		<path fill="url(#SVGID_9_)" d="M33.09,13v2h-4v-2H33.09z M39.09,13h-4v2h4V13z M33.09,19h2v-4h-2V19z M35.09,9h-2v4h2V9z
			 M33.09,13v2h2v-2H33.09z M33.09,13v2h2v-2H33.09z"/>
		
			<rect x="32.59" y="29.5" transform="matrix(6.123234e-17 -1 1 6.123234e-17 -1.4116 68.5884)" fill-rule="evenodd" clip-rule="evenodd" fill="#6A6D73" width="2" height="11"/>
		<g>
			<path fill="none" d="M31.03,3.06c-7.72,0-14,6.28-14,14c0,7.72,6.28,14,14,14s14-6.28,14-14C45.03,9.34,38.75,3.06,31.03,3.06z
				 M31.03,29.06c-6.62,0-12-5.38-12-12s5.38-12,12-12s12,5.38,12,12S37.64,29.06,31.03,29.06z"/>
			<circle fill="none" cx="31.03" cy="17.06" r="11.5"/>
			<path fill="#6A6D73" d="M31.03,5.06c-6.62,0-12,5.38-12,12s5.38,12,12,12s12-5.38,12-12S37.64,5.06,31.03,5.06z M31.03,28.56
				c-6.34,0-11.5-5.16-11.5-11.5s5.16-11.5,11.5-11.5s11.5,5.16,11.5,11.5S37.37,28.56,31.03,28.56z"/>
			<path fill="#6A6D73" d="M31.03,2.56c-8,0-14.5,6.5-14.5,14.5c0,3.64,1.36,6.96,3.58,9.51l-1.32,1.32l1.41,1.41l1.32-1.32
				c2.55,2.22,5.87,3.58,9.51,3.58c8,0,14.5-6.5,14.5-14.5S39.02,2.56,31.03,2.56z M31.03,31.06c-7.72,0-14-6.28-14-14
				c0-7.72,6.28-14,14-14s14,6.28,14,14C45.03,24.78,38.75,31.06,31.03,31.06z"/>
		</g>
		<linearGradient id="SVGID_10_" gradientUnits="userSpaceOnUse" x1="2.6488" y1="36.3091" x2="20.9097" y2="36.3091">
			<stop  offset="0" style="stop-color:#7A7D82"/>
			<stop  offset="1" style="stop-color:#A1AAB0"/>
		</linearGradient>
		<path fill="url(#SVGID_10_)" d="M19.23,28.32l0.54,0.54l-0.44,1.33L6.63,44.16C6.46,44.34,6.24,44.44,6,44.44
			c-0.23,0-0.44-0.09-0.6-0.25l-1.5-1.5c-0.17-0.17-0.25-0.39-0.25-0.62c0.01-0.24,0.1-0.45,0.28-0.61l13.96-12.69L19.23,28.32
			 M19.5,27.18l-2.12,0.71L3.26,40.72c-0.78,0.71-0.81,1.93-0.06,2.68l1.5,1.5c0.36,0.36,0.84,0.54,1.31,0.54c0.5,0,1-0.2,1.37-0.61
			L20.2,30.71l0.71-2.12L19.5,27.18L19.5,27.18z"/>
	</g>
</g>
</svg>
