<?xml version="1.0" encoding="iso-8859-1"?>
<!-- Generator: Adobe Illustrator 23.0.1, SVG Export Plug-In . SVG Version: 6.00 Build 0)  -->
<svg version="1.1" xmlns="http://www.w3.org/2000/svg" xmlns:xlink="http://www.w3.org/1999/xlink" x="0px" y="0px" width="32px"
	 height="32px" viewBox="0 0 32 32" enable-background="new 0 0 32 32" xml:space="preserve">
<g id="guides">
</g>
<g id="Layer_2">
	<g>
		<path fill-rule="evenodd" clip-rule="evenodd" fill="#77BAFF" d="M30.8,16.37l-9.67,9.28C20.72,26.02,20,25.74,20,25.19V18H9.6
			C9.27,18,9,17.73,9,17.4v-2.8C9,14.27,9.27,14,9.6,14H20V6.63c0-0.55,0.72-0.84,1.13-0.46l9.67,9.28
			C31.07,15.7,31.07,16.11,30.8,16.37z"/>
		<g>
			<linearGradient id="SVGID_1_" gradientUnits="userSpaceOnUse" x1="0.1757" y1="22.8243" x2="13.8243" y2="9.1757">
				<stop  offset="0" style="stop-color:#7A7D82"/>
				<stop  offset="1" style="stop-color:#A1AAB0"/>
			</linearGradient>
			<path fill-rule="evenodd" clip-rule="evenodd" fill="url(#SVGID_1_)" d="M12,10.4V7.6C12,7.27,11.73,7,11.4,7H6H5H2.6
				C2.27,7,2,7.27,2,7.6v16.8C2,24.73,2.27,25,2.6,25H5h1h5.4c0.33,0,0.6-0.27,0.6-0.6v-2.8c0-0.33-0.27-0.6-0.6-0.6H6V11h5.4
				C11.73,11,12,10.73,12,10.4z"/>
		</g>
	</g>
</g>
</svg>
