<?xml version="1.0" encoding="iso-8859-1"?>
<!-- Generator: Adobe Illustrator 23.0.1, SVG Export Plug-In . SVG Version: 6.00 Build 0)  -->
<svg version="1.1" xmlns="http://www.w3.org/2000/svg" xmlns:xlink="http://www.w3.org/1999/xlink" x="0px" y="0px" width="32px"
	 height="32px" viewBox="0 0 32 32" enable-background="new 0 0 32 32" xml:space="preserve">
<g id="guides">
</g>
<g id="Layer_2">
	<g>
		<linearGradient id="SVGID_1_" gradientUnits="userSpaceOnUse" x1="16" y1="30" x2="16" y2="2">
			<stop  offset="0" style="stop-color:#7A7D82"/>
			<stop  offset="1" style="stop-color:#A1AAB0"/>
		</linearGradient>
		<path fill-rule="evenodd" clip-rule="evenodd" fill="url(#SVGID_1_)" d="M26,13v15.5c0,0.83-0.67,1.5-1.5,1.5h-17
			C6.67,30,6,29.33,6,28.5v-25C6,2.67,6.67,2,7.5,2H15v8.5c0,1.38,1.12,2.5,2.5,2.5H26z"/>
	</g>
	<path fill="#6A6D73" d="M17.5,12H26L16,2v8.5C16,11.33,16.67,12,17.5,12z"/>
	<rect x="4" y="17" fill-rule="evenodd" clip-rule="evenodd" fill="#6A6D73" width="22" height="11"/>
	<g>
		<path fill="#FFFFFF" d="M11.14,24.78c0,0.27-0.05,0.53-0.16,0.78c-0.1,0.25-0.25,0.47-0.43,0.66c-0.18,0.19-0.4,0.34-0.65,0.46
			c-0.25,0.11-0.51,0.17-0.79,0.17c-0.25,0-0.5-0.03-0.74-0.1s-0.47-0.18-0.68-0.34c-0.2-0.16-0.37-0.37-0.5-0.64
			C7.06,25.49,7,25.15,7,24.74v-4.52c0-0.29,0.05-0.56,0.15-0.81c0.1-0.25,0.24-0.47,0.43-0.66s0.4-0.33,0.66-0.44
			c0.26-0.1,0.54-0.16,0.85-0.16c0.29,0,0.56,0.05,0.81,0.16c0.25,0.1,0.47,0.25,0.65,0.44s0.33,0.42,0.43,0.68
			c0.1,0.26,0.16,0.55,0.16,0.86v0.62H9.63v-0.55c0-0.18-0.05-0.34-0.14-0.48c-0.1-0.14-0.23-0.2-0.41-0.2
			c-0.23,0-0.38,0.07-0.46,0.22c-0.07,0.15-0.11,0.33-0.11,0.56v4.2c0,0.18,0.04,0.34,0.12,0.47c0.08,0.13,0.22,0.19,0.43,0.19
			c0.13,0,0.25-0.04,0.38-0.13c0.12-0.09,0.19-0.26,0.19-0.52V24.1h1.51V24.78z"/>
		<path fill="#FFFFFF" d="M17.05,24.26c0,0.37-0.04,0.71-0.11,1.03c-0.08,0.32-0.2,0.59-0.37,0.82c-0.17,0.23-0.4,0.41-0.68,0.54
			c-0.28,0.13-0.62,0.19-1.03,0.19c-0.31,0-0.6-0.05-0.86-0.16c-0.26-0.11-0.49-0.26-0.69-0.45c-0.2-0.19-0.35-0.42-0.46-0.67
			s-0.16-0.53-0.16-0.83v-0.61h1.51v0.54c0,0.17,0.05,0.32,0.15,0.46c0.1,0.14,0.27,0.2,0.51,0.2c0.17,0,0.3-0.03,0.39-0.08
			c0.09-0.05,0.16-0.12,0.2-0.21c0.04-0.09,0.07-0.2,0.08-0.33c0.01-0.13,0.01-0.27,0.01-0.43c0-0.19-0.01-0.35-0.02-0.46
			c-0.01-0.12-0.04-0.21-0.08-0.29c-0.04-0.08-0.1-0.14-0.17-0.19c-0.08-0.05-0.18-0.1-0.31-0.15l-0.84-0.35
			c-0.54-0.23-0.91-0.53-1.1-0.89c-0.19-0.36-0.29-0.82-0.29-1.37c0-0.34,0.05-0.65,0.14-0.95c0.09-0.3,0.23-0.55,0.41-0.77
			c0.18-0.22,0.41-0.39,0.68-0.52c0.27-0.12,0.59-0.19,0.96-0.19c0.32,0,0.61,0.06,0.87,0.17c0.26,0.12,0.48,0.27,0.67,0.46
			s0.33,0.41,0.43,0.65c0.1,0.24,0.15,0.49,0.15,0.74v0.74h-1.51V20.5c0-0.22-0.05-0.42-0.14-0.58c-0.1-0.16-0.27-0.24-0.52-0.24
			c-0.13,0-0.23,0.03-0.32,0.08c-0.08,0.05-0.15,0.12-0.19,0.2s-0.07,0.18-0.09,0.28s-0.02,0.21-0.02,0.32
			c0,0.14,0.01,0.25,0.02,0.35c0.01,0.1,0.04,0.18,0.07,0.25s0.09,0.13,0.16,0.19c0.07,0.05,0.17,0.1,0.3,0.15l0.9,0.35
			c0.28,0.1,0.51,0.23,0.68,0.37c0.18,0.14,0.31,0.31,0.41,0.51c0.1,0.2,0.16,0.42,0.2,0.67C17.03,23.65,17.05,23.94,17.05,24.26z"
			/>
		<path fill="#FFFFFF" d="M21.37,26.77h-1.33l-1.73-8.54h1.61l0.79,5.29h0.01l0.8-5.29h1.6L21.37,26.77z"/>
	</g>
	<rect x="4" y="16" fill-rule="evenodd" clip-rule="evenodd" fill="#77BAFF" width="22" height="1"/>
</g>
</svg>
