<?xml version="1.0" encoding="iso-8859-1"?>
<!-- Generator: Adobe Illustrator 23.0.1, SVG Export Plug-In . SVG Version: 6.00 Build 0)  -->
<svg version="1.1" xmlns="http://www.w3.org/2000/svg" xmlns:xlink="http://www.w3.org/1999/xlink" x="0px" y="0px" width="32px"
	 height="32px" viewBox="0 0 32 32" enable-background="new 0 0 32 32" xml:space="preserve">
<g id="guides">
</g>
<g id="Layer_2">
	<g>
		<path fill="#6A6D73" d="M7.81,26L26,7.81c0.39-0.39,1.02-0.39,1.41,0l0,0c0.39,0.39,0.39,1.02,0,1.41L9.22,27.41
			c-0.39,0.39-1.02,0.39-1.41,0h0C7.42,27.02,7.42,26.39,7.81,26z"/>
		<circle fill="#77BAFF" cx="23.5" cy="23.5" r="3.5"/>
		<linearGradient id="SVGID_1_" gradientUnits="userSpaceOnUse" x1="3.0251" y1="20.9749" x2="7.9749" y2="16.0251">
			<stop  offset="0" style="stop-color:#7A7D82"/>
			<stop  offset="1" style="stop-color:#A1AAB0"/>
		</linearGradient>
		<circle fill="url(#SVGID_1_)" cx="5.5" cy="18.5" r="3.5"/>
		<linearGradient id="SVGID_2_" gradientUnits="userSpaceOnUse" x1="6.0251" y1="10.9749" x2="10.9749" y2="6.0251">
			<stop  offset="0" style="stop-color:#7A7D82"/>
			<stop  offset="1" style="stop-color:#A1AAB0"/>
		</linearGradient>
		<circle fill="url(#SVGID_2_)" cx="8.5" cy="8.5" r="3.5"/>
		<linearGradient id="SVGID_3_" gradientUnits="userSpaceOnUse" x1="16.0251" y1="7.9749" x2="20.9749" y2="3.0251">
			<stop  offset="0" style="stop-color:#7A7D82"/>
			<stop  offset="1" style="stop-color:#A1AAB0"/>
		</linearGradient>
		<circle fill="url(#SVGID_3_)" cx="18.5" cy="5.5" r="3.5"/>
	</g>
</g>
</svg>
