<?xml version="1.0" encoding="iso-8859-1"?>
<!-- Generator: Adobe Illustrator 23.0.1, SVG Export Plug-In . SVG Version: 6.00 Build 0)  -->
<svg version="1.1" xmlns="http://www.w3.org/2000/svg" xmlns:xlink="http://www.w3.org/1999/xlink" x="0px" y="0px" width="32px"
	 height="32px" viewBox="0 0 32 32" enable-background="new 0 0 32 32" xml:space="preserve">
<g id="guides">
</g>
<g id="Layer_2">
	<path fill-rule="evenodd" clip-rule="evenodd" fill="#6A6D73" d="M28,9.62V26.5c0,0.82-0.67,1.5-1.5,1.5h-21
		C4.67,28,4,27.32,4,26.5v-21C4,4.67,4.68,4,5.5,4H10v7h12V4h0.38c0.4,0,0.78,0.16,1.06,0.44l4.12,4.12C27.84,8.84,28,9.22,28,9.62z
		"/>
	<g>
		<rect x="7" y="15" fill-rule="evenodd" clip-rule="evenodd" fill="#D1D1D3" width="18" height="11"/>
	</g>
	<g>
		<linearGradient id="SVGID_1_" gradientUnits="userSpaceOnUse" x1="16" y1="10" x2="16" y2="4">
			<stop  offset="0" style="stop-color:#7A7D82"/>
			<stop  offset="1" style="stop-color:#A1AAB0"/>
		</linearGradient>
		<path fill-rule="evenodd" clip-rule="evenodd" fill="url(#SVGID_1_)" d="M11,4v5.6c0,0.22,0.18,0.4,0.4,0.4h9.2
			c0.22,0,0.4-0.18,0.4-0.4V4H11z M19,9h-2V5h2V9z"/>
	</g>
	<rect x="8" y="23" fill-rule="evenodd" clip-rule="evenodd" fill="#77BAFF" width="16" height="1"/>
	<rect x="8" y="20" fill-rule="evenodd" clip-rule="evenodd" fill="#77BAFF" width="16" height="1"/>
	<rect x="8" y="17" fill-rule="evenodd" clip-rule="evenodd" fill="#77BAFF" width="16" height="1"/>
</g>
</svg>
