<?xml version="1.0" encoding="iso-8859-1"?>
<!-- Generator: Adobe Illustrator 23.0.1, SVG Export Plug-In . SVG Version: 6.00 Build 0)  -->
<svg version="1.1" xmlns="http://www.w3.org/2000/svg" xmlns:xlink="http://www.w3.org/1999/xlink" x="0px" y="0px" width="48px"
	 height="48px" viewBox="0 0 48 48" enable-background="new 0 0 48 48" xml:space="preserve">
<g id="guides">
</g>
<g id="Layer_2">
	<g>
		<g>
			<path fill-rule="evenodd" clip-rule="evenodd" fill="#6A6D73" d="M38.98,15H7v3.42c-0.72,0.78-1.21,1.74-1.41,2.8l-1.23,6.95
				L2.59,11.25C2.45,10,3.37,9,4.6,9h8.38c0.89,0,1.79,0.27,2.58,0.75l2.38,1.5c0.8,0.48,1.7,0.75,2.58,0.75h15.89
				c1.24,0,2.36,1.01,2.49,2.25L38.98,15z"/>
			<path fill-rule="evenodd" clip-rule="evenodd" fill="#77BAFF" d="M41,6v12H11.24c-1.99,0-3.83,1.53-4.18,3.5L7,21.84V6H41z"/>
			<g>
				
					<linearGradient id="SVGID_1_" gradientUnits="userSpaceOnUse" x1="24.9002" y1="39" x2="24.9002" y2="20" gradientTransform="matrix(1 0 -0.1763 1 5.9951 0)">
					<stop  offset="0" style="stop-color:#7A7D82"/>
					<stop  offset="1" style="stop-color:#A1AAB0"/>
				</linearGradient>
				<path fill-rule="evenodd" clip-rule="evenodd" fill="url(#SVGID_1_)" d="M39.72,39H8.22c-1.24,0-2.07-0.99-1.85-2.19l2.64-14.62
					C9.23,20.99,10.43,20,11.66,20h31.5c1.24,0,2.07,0.99,1.85,2.19l-2.64,14.62C42.15,38.01,40.96,39,39.72,39z"/>
			</g>
		</g>
		<rect x="10" y="9" fill-rule="evenodd" clip-rule="evenodd" fill="#FFFFFF" width="4" height="2"/>
		<rect x="16" y="9" fill-rule="evenodd" clip-rule="evenodd" fill="#FFFFFF" width="22" height="2"/>
		<rect x="10" y="13" fill-rule="evenodd" clip-rule="evenodd" fill="#FFFFFF" width="4" height="2"/>
		<rect x="16" y="13" fill-rule="evenodd" clip-rule="evenodd" fill="#FFFFFF" width="22" height="2"/>
	</g>
</g>
</svg>
