<?xml version="1.0" encoding="utf-8"?>
<!-- Generator: Adobe Illustrator 24.2.3, SVG Export Plug-In . SVG Version: 6.00 Build 0)  -->
<svg version="1.1" id="Layer_1" xmlns="http://www.w3.org/2000/svg" xmlns:xlink="http://www.w3.org/1999/xlink" x="0px" y="0px"
	 viewBox="0 0 1100 1100" enable-background="new 0 0 1100 1100" xml:space="preserve">
<g id="Layer_5">
	<path d="M231.6,835.1v111.7h-24.9v-14.4c-4.2,5.3-9.8,9.4-16,11.9c-6.7,2.7-13.8,4.1-21,4c-10.2,0.2-20.2-2.3-29.2-7.1
		c-8.5-4.6-15.5-11.6-20.1-20.1c-4.8-8.7-7.2-18.7-7.2-30.1c0-11.4,2.4-21.4,7.2-30c4.7-8.4,11.6-15.4,20.1-20
		c9-4.8,19-7.3,29.2-7.1c6.9-0.1,13.6,1.2,20,3.8c6,2.5,11.4,6.3,15.8,11.1v-13.5H231.6z M196.5,916.2c6.3-6.4,9.4-14.8,9.4-25.3
		c0-10.5-3.1-18.9-9.4-25.3c-6.3-6.4-14.2-9.6-23.8-9.6s-17.5,3.2-23.7,9.6c-6.2,6.4-9.3,14.8-9.3,25.3c0,10.5,3.1,18.9,9.3,25.3
		c6.2,6.4,14.1,9.6,23.7,9.6C182.3,925.8,190.2,922.6,196.5,916.2z"/>
	<path d="M277.6,940.9c-8.9-4.6-16.4-11.7-21.5-20.4c-10.3-18.3-10.3-40.7,0-59.1c5.1-8.6,12.6-15.6,21.4-20.3
		c9.1-4.9,19.6-7.3,31.3-7.3c11,0,20.7,2.2,29,6.7c8.1,4.3,14.7,11,18.7,19.2l-20.1,11.7c-2.9-4.9-7-8.9-12-11.6
		c-4.9-2.6-10.3-3.9-15.9-3.9c-9.8,0-17.8,3.2-24.3,9.5s-9.6,14.8-9.6,25.4c0,10.6,3.2,19.1,9.5,25.4s14.5,9.5,24.4,9.5
		c5.5,0.1,10.9-1.3,15.8-3.8c5-2.7,9.1-6.7,12-11.6l20.1,11.7c-4.2,8.2-10.8,15-18.9,19.3c-8.3,4.5-17.9,6.8-28.8,6.8
		C297.9,948.4,287.2,945.9,277.6,940.9z"/>
	<path d="M397.5,940.9c-8.9-4.6-16.4-11.7-21.5-20.4c-10.3-18.3-10.3-40.7,0-59.1c5.1-8.6,12.6-15.6,21.4-20.3
		c9.1-4.9,19.5-7.3,31.3-7.3c11,0,20.7,2.2,29,6.7c8.1,4.3,14.7,11,18.7,19.2l-20.1,11.7c-2.9-4.9-7-8.9-12-11.6
		c-4.9-2.6-10.3-3.9-15.9-3.9c-9.8,0-17.8,3.2-24.3,9.5s-9.6,14.8-9.6,25.4c0,10.6,3.2,19.1,9.5,25.4c6.3,6.3,14.5,9.5,24.4,9.5
		c5.5,0.1,10.9-1.3,15.8-3.8c5-2.7,9.1-6.7,12-11.6l20.1,11.7c-4.2,8.2-10.8,15-18.9,19.3c-8.3,4.5-17.9,6.8-28.8,6.8
		C417.8,948.4,407.1,945.9,397.5,940.9z"/>
	<path d="M607,835.1v111.7h-24.9v-14.2c-4.2,5.1-9.6,9-15.7,11.6c-6.4,2.7-13.3,4.1-20.3,4.1c-14.9,0-26.7-4.1-35.2-12.4
		c-8.6-8.3-12.9-20.6-12.9-36.9v-63.8h26.1v60.2c0,10,2.3,17.5,6.8,22.5s11,7.4,19.3,7.4c9.3,0,16.8-2.9,22.3-8.7s8.3-14.1,8.3-25
		v-56.5H607z"/>
	<path d="M697.5,833.8v24.9c-2-0.4-4-0.6-6.1-0.6c-10.2,0-18.1,3-23.8,8.9c-5.7,5.9-8.6,14.5-8.6,25.6v54.2h-26.1V835.1h24.9v16.3
		C665.3,839.7,678.6,833.8,697.5,833.8z"/>
	<path d="M721,812.2c-6.2-5.9-6.4-15.6-0.6-21.8c0.2-0.2,0.4-0.4,0.6-0.6c3.2-3,7.5-4.6,11.9-4.5c4.4-0.1,8.6,1.4,11.9,4.3
		c3.1,2.7,4.9,6.6,4.8,10.8c0.1,4.4-1.6,8.6-4.7,11.6c-3.2,3.2-7.5,4.9-12,4.7C728.5,816.8,724.2,815.2,721,812.2z M719.8,835.1
		h26.1v111.7h-26.2L719.8,835.1z"/>
	<path d="M800.2,940.9c-9-4.6-16.4-11.7-21.5-20.4c-10.3-18.3-10.3-40.7,0-59.1c5.1-8.6,12.5-15.6,21.4-20.3
		c9.1-4.9,19.6-7.3,31.3-7.3c11,0,20.7,2.2,29,6.7c8.1,4.3,14.6,11,18.6,19.2l-20,11.7c-2.9-4.9-7-8.9-12-11.6
		c-4.9-2.6-10.3-3.9-15.8-3.9c-9.8,0-17.8,3.2-24.2,9.5c-6.4,6.3-9.6,14.8-9.6,25.4c0,10.6,3.2,19.1,9.5,25.4s14.5,9.5,24.4,9.5
		c5.5,0.1,10.9-1.3,15.8-3.8c5-2.7,9.1-6.7,12-11.6l20.1,11.7c-4.2,8.2-10.8,15-18.9,19.3c-8.3,4.5-17.9,6.8-28.8,6.8
		C820.5,948.4,809.8,945.9,800.2,940.9z"/>
	<path d="M909.6,944.7c-8.7-2.4-15.6-5.4-20.7-9l10-19.9c5.6,3.6,11.7,6.3,18.1,8.1c6.8,2,13.8,3,20.8,3c15.6,0,23.4-4.1,23.4-12.3
		c0-3.9-2-6.6-6-8.2c-4-1.5-10.4-3-19.1-4.4c-7.6-1-15.1-2.7-22.5-4.8c-5.8-1.8-11-5.1-15.1-9.5c-4.2-4.5-6.4-10.8-6.4-18.9
		c0-10.6,4.4-19.1,13.3-25.4c8.9-6.3,20.8-9.5,35.9-9.5c7.7,0,15.5,0.9,23,2.6c7.7,1.7,13.9,4.1,18.8,7l-10,19.9
		c-9.7-5.6-20.8-8.5-32-8.4c-7.7,0-13.5,1.2-17.5,3.5c-4,2.3-6,5.3-6,9.1c0,4.2,2.1,7.1,6.4,8.9c4.3,1.7,10.8,3.4,19.8,4.9
		c7.4,1.1,14.8,2.7,22,4.8c5.6,1.8,10.7,4.9,14.7,9.2c4.1,4.3,6.2,10.5,6.2,18.4c0,10.4-4.5,18.8-13.6,25.1
		c-9.1,6.3-21.4,9.4-37,9.4C927.2,948.2,918.2,947,909.6,944.7z"/>
	<path d="M550,151.8c102.9,0,188.3,79.6,195.7,182.2c-19.9,0.3-39.7,3.4-58.8,9.3c-5.1,1.5-10.1,3.3-15,5.2v-0.6
		c0-67.3-54.6-121.9-121.9-121.9S428,280.5,428,347.9c0,0,0,0,0,0v0.6c-5.8-2.3-11.7-4.3-17.6-6c-18.2-5.4-37.1-8.2-56-8.5
		C361.7,231.4,447.1,151.8,550,151.8z"/>
	<path d="M873.5,417.5c-51.4-51.5-129.1-66.3-195.9-37.1h-0.1c-22.3,9.7-42.3,23.9-58.9,41.6l-191,191l0,0l-0.7,0.7l-2,2l0,0
		c-40.3,40.1-105.5,40-145.7-0.3c-40.1-40.3-40-105.5,0.3-145.7c29.8-29.7,74.8-38.3,113.5-21.6v0c5.8,2.5,11.4,5.6,16.6,9.1
		c3.2-26.8,22.2-49.1,48.2-56.5c-10.9-8.1-22.7-15-35.2-20.4h-0.1c-89.7-38.9-194,2.3-232.9,92.1s2.3,194,92.1,232.9
		c66.7,28.9,144.3,14.1,195.7-37.3l0.1,0.1l195.4-195.5l-2.9-2.9l2.9,2.7c9.6-10.3,21.3-18.6,34.2-24.2v0
		c52.3-22.7,113.1,1.2,135.8,53.5c22.7,52.3-1.2,113.1-53.5,135.8c-40.1,17.5-86.9,7.7-116.7-24.3l0.1-0.1l-44-43.9l-52.5,52.5
		l44,43.9l0,0c67.3,71,179.5,74,250.5,6.7s74-179.5,6.7-250.5C876.2,420.2,874.8,418.9,873.5,417.5L873.5,417.5z"/>
	<circle cx="476" cy="465.1" r="47.6"/>
</g>
</svg>
