flightID,time,xMax,yMax,zMax,flightDistance
Flight00001,51.02,-3588.4757685506956,10733.4344636645,2470.0657159291964,11317.41020407303
Flight00002,38.45,-1219.4529458564907,-3785.945912385268,1570.3676155010085,3977.4931726735613
Flight00003,62.3,-11470.070802441713,2824.6537598593986,3829.3922211661265,11812.755524267557
Flight00004,63.77,10329.54697302592,3110.089321451451,4089.852816808421,10787.594553715637
Flight00005,118.94,-4402.26724619421,36195.08548411778,11024.207702369902,36461.81797592528
Flight00006,80.37,23192.399990300088,14585.480928031784,4764.092075886844,27397.51213544855
Flight00007,114.35,-23126.592555493513,3914.0336745216337,11707.38013446957,23455.467226919554
Flight00008,48.31,1264.9911418976133,-4842.824815387184,2472.7195342658006,5005.312655729844
Flight00009,136.01,36534.26246313784,-2320.9034400500245,14753.175758966812,36607.907977696275
Flight00010,175.33,38265.396073312935,28572.13636093496,24122.316360425546,47755.70660010565
Flight00011,47.76,-8397.003015442167,2866.9639464767884,2285.416694543005,8872.944376684813
Flight00012,118.05,-9045.82569448727,9222.283523036842,12969.59375935692,12918.106512733317
Flight00013,149.94,-39371.18827466425,-7533.616669338694,17500.07587664117,40085.48173939784
Flight00014,162.09,-41864.76834334628,15089.676287026588,19870.270168476414,44501.204016175805
Flight00015,147.46,8518.440255068439,-16141.61884515223,18514.255400222093,18251.457019135323
Flight00016,178.26,-24554.73435960786,12868.651263183861,26881.836778468165,27722.5028596689
Flight00017,181.62,49829.24343390352,12236.615828915386,25974.511264284873,51309.72878645608
Flight00018,52.54,8149.140172044297,-8164.187787439316,2628.09494519602,11535.26973122863
Flight00019,63.4,395.0834486176124,10790.718366014453,4040.201548482491,10797.94859156188
Flight00020,130.6,20797.17504336265,-22265.391181032708,14325.228519104629,30467.52589608607
Flight00021,199.66,-36599.83429058675,-33456.96603822628,32580.177354922966,49587.4625947067
Flight00022,50.9,-243.61676507005473,10045.918127354678,2556.097578085066,10048.87158589145
Flight00023,73.51,-20984.670533065244,1734.9809590165655,4417.522113149691,21056.271187212773
Flight00024,79.09,-14002.080981415054,-8282.626053086504,5902.102874147198,16268.379333706616
Flight00025,104.05,11178.685487812763,-9856.23335954197,10289.089485301713,14903.299811557965
Flight00026,54.91,11409.176744065751,-2460.546932534059,2901.355216423638,11671.486845493746
Flight00027,211.98,-34906.58065539795,5453.187506302978,37896.56813675708,35329.96783229078
Flight00028,127.75,-11242.914598683457,-4481.5944064686,14849.729675653607,12103.215155378353
Flight00029,63.4,11903.16907837885,10804.270324325225,3558.1243281532575,16075.375309757752
Flight00030,67.93,-899.220510753964,-5535.649394285247,4807.7320926764605,5608.2093170112
Flight00031,48.0,-6099.9561654627105,4258.485666803339,2375.8225111322968,7439.365926941356
Flight00032,96.15,27982.67436697589,3196.214604639525,7455.477552210181,28164.62058198407
Flight00033,103.86,-17769.348794076323,-6571.620088273827,10032.817149987091,18945.604956035208
Flight00034,204.68,38029.55796723106,12039.448708428858,34755.755086935154,39889.793235687204
Flight00035,89.78,9083.24913106058,-9793.045887222996,7835.354396875455,13356.989276261622
Flight00036,70.87,-1994.0457343223131,11055.234809582558,5035.124745613999,11233.629648763348
Flight00037,31.61,-2107.9542515501516,3101.8719695383397,1046.647279714599,3750.3440964844835
Flight00038,71.39,-15414.716978027067,11058.70715452606,4373.306709246229,18971.25466178349
Flight00039,37.15,-4011.2886388062407,272.3377183421647,1461.375729680304,4020.522898411081
Flight00040,64.4,6891.116393731937,6667.847957293524,4231.289489052339,9588.93537018289
Flight00041,189.83,-30221.647852536164,-38891.934077796825,28780.057002447276,49253.7362565968
Flight00042,56.49,-10239.288118897264,2137.9672071132013,3185.4069280114713,10460.11113518791
Flight00043,95.92,-18996.176032685322,2873.609186213855,8530.416964878195,19212.29641713507
Flight00044,62.84,-15272.30106365331,-7819.165723817117,3343.008603904067,17157.579444530704
Flight00045,43.2,-500.48135574343274,-7720.158621432796,1881.1897174992318,7736.364180125566
Flight00046,43.99,2380.212306092396,8007.050189859737,1927.2570228321397,8353.338456270436
Flight00047,111.14,-9089.746248326534,33058.604648406115,9637.626099585279,34285.490052769914
Flight00048,44.7,-736.281169652051,1817.8516253360854,2157.075918463133,1961.2991848571291
Flight00049,45.83,-5838.242594906766,-8086.331321296396,2007.4425426293283,9973.6568436438
Flight00050,54.98,-17141.79301895801,-976.3602520020121,2375.2552433585224,17169.57621045106
