@startuml
!define DARKBLUE
!includeurl https://raw.githubusercontent.com/Drakemor/RedDress-PlantUML/master/style.puml

entity User {
    * int id
    * string email
    * string password
    * array roles
    * bool isVerified
    string username
    string firstname
    string lastname
    UploadedFile photo
    string validationToken
    string resetPasswordToken
}

entity Trick {
    * int id
    * string name
    * string description
    * TrickGroup group
    UploadedFile[] images
    string[] videosLinks
    * datetime createdAt
    * User createdBy
    datetime updatedAt
    User updatedBy
    Comment[] comments
    * string slug
}

entity TrickGroup {
    * int id
    * string name
}

entity Comment {
    * User createdBy
    * datetime createdAt
    * string message
}

Comment }o--|| Trick
TrickGroup ||--o{ Trick
User ||--o{ Comment
User }o--|{ Trick
User }o--|{ Trick

@enduml