@startuml

!define DARKBLUE
!includeurl https://raw.githubusercontent.com/Drakemor/RedDress-PlantUML/master/style.puml

actor User
control App
database Db

User -> App : Request post detail page
App -> App : check if authenticated
alt is authenticated
    App --> User : return post detail page with comment form
    User -> App : post a comment
    App -> App : check if form data is valid
    alt form data is valid
        App -> Db : persist new comment
        Db --> App : return success
        App --> User : return success message
    else form data is not valid
        App --> User : return post detail page with form and errors
    end
else is not authenticated
    App --> User : return post detail page with login page link
end

@enduml