@startuml
!define DARKBLUE
!includeurl https://raw.githubusercontent.com/Drakemor/RedDress-PlantUML/master/style.puml

class Database {
    string DEFAULT_FETCH_MODE
    static Database _instance
    array config
    PDO db
    void __construct(YAMLParser)
    void __destruct()
    PDO connect()
    PDOStatement query(string query, array params, string|null classname)
    PDOStatement fetch(PDOStatement stmt, integer|null mode)
    array fetchAll(PDOStatement stmt, integer|null mode)
    bool|PDOStatement prepare(string query)
    mixed exec(PDOStatement stmt, array parameters)
    string getDsn()
    static Database getInstance()
    PDO getDb()
}
class EntityRepository {
    Database db
    string classname
    string tablename
    array fields
    void __construct(YAMLParser parser, Database db, string classname)
    void processMetadata(array metadata)
    EntityInterface find(string|integer id, array parsedEntities)
    EntityInterface[]|null findAll(array parsedEntities)
    EntityInterface[]|null findBy(array fields, array parsedEntities)
    string insert(EntityInterface entity)
    mixed update(EntityInterface entity)
    bool|integer delete(EntityInterface entity)
    array|null getField(string name)
    array getFields()
    QueryBuilder createQueryBuilder(string|null alias)
    EntityInterface hydrateObject(array|object result, array parsedEntities)
    EntityInterface[] hydrateMany(array|object result, array parsedEntities)
}
class QueryBuilder {
    string query
    string select
    string from
    string where
    string orderBy
    string join
    string groupBy
    string limit
    string alias
    array parameters
    Database db
    void __construct(string tablename, string alias)
    QueryBuilder getQuery()
    array getResult()
    mixed|null getSingleResult()
    QueryBuilder select(string select)
    QueryBuilder where(string condition)
    QueryBuilder orWhere(string condition)
    QueryBuilder andWhere(string condition)
    QueryBuilder orderBy(string field, string order)
    QueryBuilder addOrderBy(string field, string order)
    QueryBuilder setParameters(array parameters)
    string getAlias()
}

Database --|> EntityRepository
QueryBuilder --o EntityRepository


@enduml