^C:\GAMEDEV\17.5\CONSOLEAPPLICATION1\CONSOLEAPPLICATION1\CONSOLEAPPLICATION1.CPP
C:\GAMEDEV\17.5\CONSOLEAPPLICATION1\CONSOLEAPPLICATION1\X64\DEBUG\VC143.PDB
C:\GAMEDEV\17.5\CONSOLEAPPLICATION1\CONSOLEAPPLICATION1\X64\DEBUG\VC143.IDB
C:\GAMEDEV\17.5\CONSOLEAPPLICATION1\CONSOLEAPPLICATION1\X64\DEBUG\CONSOLEAPPLICATION1.OBJ
