12.12.2017 02:59:59 - Preparing Test Run interoperability_17316219_Geodetick&yacute; a kartografick&yacute; &uacute;stav Bratislava_tn-ro:RoadLink (initiated Tue Dec 12 02:59:59 CET 2017)
12.12.2017 02:59:59 - Resolving Executable Test Suite dependencies
12.12.2017 02:59:59 - Preparing 11 Test Task:
12.12.2017 02:59:59 -  TestTask 1 (803b2ef0-feae-47d4-bfbc-287998ada305)
12.12.2017 02:59:59 -  will perform tests on Test Object 'get.xml' by using Executable Test Suite 'Conformance class: INSPIRE GML encoding (EID: 545f9e49-009b-4114-9333-7ca26413b5d4, V: 0.2.1 )'
12.12.2017 02:59:59 -  with parameters: 
12.12.2017 02:59:59 - etf.testcases = *
12.12.2017 02:59:59 -  TestTask 2 (8310ef4b-f5d0-4dee-ae56-a82ebf7a0224)
12.12.2017 02:59:59 -  will perform tests on Test Object 'get.xml' by using Executable Test Suite 'Conformance class: INSPIRE GML application schemas, General requirements (EID: 09820daf-62b2-4fa3-a95f-56a0d2b7c4d8, V: 0.2.4 )'
12.12.2017 02:59:59 -  with parameters: 
12.12.2017 02:59:59 - etf.testcases = *
12.12.2017 02:59:59 -  TestTask 3 (6f10473b-296d-4467-8fe0-0f9ae7801e1d)
12.12.2017 02:59:59 -  will perform tests on Test Object 'get.xml' by using Executable Test Suite 'LAZY.9af1c865-1cf0-43ff-9250-069df01b0948'
12.12.2017 02:59:59 -  with parameters: 
12.12.2017 02:59:59 - etf.testcases = *
12.12.2017 02:59:59 -  TestTask 4 (4bda4389-aa64-49b4-921e-4aa7485c7d7e)
12.12.2017 02:59:59 -  will perform tests on Test Object 'get.xml' by using Executable Test Suite 'LAZY.4441cbde-371f-4899-90b3-145f4fd08ebc'
12.12.2017 02:59:59 -  with parameters: 
12.12.2017 02:59:59 - etf.testcases = *
12.12.2017 02:59:59 -  TestTask 5 (9ed0cc11-03cf-452c-86ce-98f1d22ee2b4)
12.12.2017 02:59:59 -  will perform tests on Test Object 'get.xml' by using Executable Test Suite 'Conformance class: Application schema, Road Transport Networks (EID: 14986e54-74c4-43b0-979b-d0d3e5cd0e8c, V: 0.2.1 )'
12.12.2017 02:59:59 -  with parameters: 
12.12.2017 02:59:59 - etf.testcases = *
12.12.2017 02:59:59 -  TestTask 6 (9d46e64c-7025-4d18-819b-7fa9a10b4b81)
12.12.2017 02:59:59 -  will perform tests on Test Object 'get.xml' by using Executable Test Suite 'LAZY.61070ae8-13cb-4303-a340-72c8b877b00a'
12.12.2017 02:59:59 -  with parameters: 
12.12.2017 02:59:59 - etf.testcases = *
12.12.2017 02:59:59 -  TestTask 7 (9a9545f2-a7c8-4069-8e67-8308d824bb79)
12.12.2017 02:59:59 -  will perform tests on Test Object 'get.xml' by using Executable Test Suite 'Conformance class: Data consistency, Transport Networks (EID: 733af9a0-312b-4f71-9aa2-977cd2134d23, V: 0.2.2 )'
12.12.2017 02:59:59 -  with parameters: 
12.12.2017 02:59:59 - etf.testcases = *
12.12.2017 02:59:59 -  TestTask 8 (61f7aa9a-40f2-4416-a5f0-24e93b3626f3)
12.12.2017 02:59:59 -  will perform tests on Test Object 'get.xml' by using Executable Test Suite 'LAZY.499937ea-0590-42d2-bd7a-1cafff35ecdb'
12.12.2017 02:59:59 -  with parameters: 
12.12.2017 02:59:59 - etf.testcases = *
12.12.2017 02:59:59 -  TestTask 9 (3f9893a8-4216-4926-8df4-2b48b9ca02ea)
12.12.2017 02:59:59 -  will perform tests on Test Object 'get.xml' by using Executable Test Suite 'Conformance class: Information accessibility, Transport Networks (EID: df5db9a4-b15f-4193-a6ff-6e9951af46f5, V: 0.2.1 )'
12.12.2017 02:59:59 -  with parameters: 
12.12.2017 02:59:59 - etf.testcases = *
12.12.2017 02:59:59 -  TestTask 10 (f6e9061b-76a1-485e-884c-25de77e03bc1)
12.12.2017 02:59:59 -  will perform tests on Test Object 'get.xml' by using Executable Test Suite 'LAZY.63f586f0-080c-493b-8ca2-9919427440cc'
12.12.2017 02:59:59 -  with parameters: 
12.12.2017 02:59:59 - etf.testcases = *
12.12.2017 02:59:59 -  TestTask 11 (4e1640f4-351c-4e52-a1d8-37a345744136)
12.12.2017 02:59:59 -  will perform tests on Test Object 'get.xml' by using Executable Test Suite 'Conformance class: Reference systems, Transport Networks (EID: 9d35024d-9dd7-43a9-afff-d5aea5f51595, V: 0.2.0 )'
12.12.2017 02:59:59 -  with parameters: 
12.12.2017 02:59:59 - etf.testcases = *
12.12.2017 02:59:59 - Test Tasks prepared and ready to be executed. Waiting for the scheduler to start.
12.12.2017 02:59:59 - Setting state to CREATED
12.12.2017 02:59:59 - Changed state from CREATED to INITIALIZING
12.12.2017 03:00:00 - Starting TestRun.058f9bb9-4475-4104-8d88-fad2bd607a26 at 2017-12-12T03:00:01+01:00
12.12.2017 03:00:01 - Changed state from INITIALIZING to INITIALIZED
12.12.2017 03:00:01 - TestRunTask initialized
12.12.2017 03:00:01 - Creating new tests databases to speed up tests.
12.12.2017 03:00:01 - Skipping schema validation because no schema file has been set in the test suite. Data are only checked for well-formedness.
12.12.2017 03:00:01 - Optimizing last database etf-tdb-8dfa845a-f791-4650-8bab-b40248d1dec6-0 
12.12.2017 03:00:01 - Import completed
12.12.2017 03:00:03 - Validation ended with 0 error(s)
12.12.2017 03:00:03 - Compiling test script
12.12.2017 03:00:03 - Starting XQuery tests
12.12.2017 03:00:03 - "Testing 1 features"
12.12.2017 03:00:03 - "Executing Test Suite: /home/tomcat/.etf/projects/ets-repository/data-encoding/inspire-gml/ets-inspire-gml-bsxets.xml"
12.12.2017 03:00:03 - "Statistics table: 0 ms"
12.12.2017 03:00:03 - "Test Suite 'Conformance class: INSPIRE GML encoding' started"
12.12.2017 03:00:03 - "Test Case 'Basic tests' started"
12.12.2017 03:00:03 - "Test Assertion 'gml.a.1: Errors loading the XML documents': PASSED - 0 ms"
12.12.2017 03:00:03 - "Test Assertion 'gml.a.2: Document root element': PASSED - 0 ms"
12.12.2017 03:00:03 - "Test Assertion 'gml.a.3: Character encoding': NOT_APPLICABLE"
12.12.2017 03:00:03 - "Test Case 'Basic tests' finished: PASSED"
12.12.2017 03:00:03 - "Test Suite 'Conformance class: INSPIRE GML encoding' finished: PASSED"
12.12.2017 03:00:03 - Releasing resources
12.12.2017 03:00:03 - TestRunTask initialized
12.12.2017 03:00:03 - Recreating new tests databases as the Test Object has changed!
12.12.2017 03:00:03 - Skipping schema validation because no schema file has been set in the test suite. Data are only checked for well-formedness.
12.12.2017 03:00:03 - Optimizing last database etf-tdb-8dfa845a-f791-4650-8bab-b40248d1dec6-0 
12.12.2017 03:00:03 - Import completed
12.12.2017 03:00:03 - Validation ended with 0 error(s)
12.12.2017 03:00:03 - Compiling test script
12.12.2017 03:00:03 - Starting XQuery tests
12.12.2017 03:00:03 - "Testing 1 features"
12.12.2017 03:00:03 - "Indexing features (parsing errors: 0): 38 ms"
12.12.2017 03:00:03 - "Executing Test Suite: /home/tomcat/.etf/projects/ets-repository/data/schemas/ets-schemas-bsxets.xml"
12.12.2017 03:00:03 - "Statistics table: 1 ms"
12.12.2017 03:00:03 - "Test Suite 'Conformance class: INSPIRE GML application schemas, General requirements' started"
12.12.2017 03:00:03 - "Test Case 'Schema' started"
12.12.2017 03:00:03 - "Test Assertion 'gmlas.a.1: Mapping of source data to INSPIRE': PASSED_MANUAL"
12.12.2017 03:00:03 - "Test Assertion 'gmlas.a.2: Modelling of additional spatial object types': PASSED_MANUAL"
12.12.2017 03:00:03 - "Test Case 'Schema' finished: PASSED_MANUAL"
12.12.2017 03:00:03 - "Test Case 'Schema validation' started"
12.12.2017 03:00:03 - "Test Assertion 'gmlas.b.1: xsi:schemaLocation attribute': PASSED - 1 ms"
12.12.2017 03:00:03 - "Validating get.xml"
12.12.2017 03:00:10 - "Duration: 6889 ms. Errors: 9."
12.12.2017 03:00:10 - "Test Assertion 'gmlas.b.2: validate XML documents': FAILED - 6890 ms"
12.12.2017 03:00:10 - "Test Case 'Schema validation' finished: FAILED"
12.12.2017 03:00:10 - "Test Case 'GML model' started"
12.12.2017 03:00:10 - "Test Assertion 'gmlas.c.1: Consistency with the GML model': PASSED - 0 ms"
12.12.2017 03:00:10 - "Test Assertion 'gmlas.c.2: nilReason attributes require xsi:nil=true': PASSED - 0 ms"
12.12.2017 03:00:10 - "Test Assertion 'gmlas.c.3: nilReason values': PASSED - 0 ms"
12.12.2017 03:00:10 - "Test Case 'GML model' finished: PASSED"
12.12.2017 03:00:10 - "Test Case 'Simple features' started"
12.12.2017 03:00:10 - "Test Assertion 'gmlas.d.1: No spatial topology objects': PASSED - 1 ms"
12.12.2017 03:00:10 - "Test Assertion 'gmlas.d.2: No non-linear interpolation': PASSED - 0 ms"
12.12.2017 03:00:10 - "Test Assertion 'gmlas.d.3: Surface geometry elements': PASSED - 0 ms"
12.12.2017 03:00:10 - "Test Assertion 'gmlas.d.4: No non-planar interpolation': PASSED - 0 ms"
12.12.2017 03:00:10 - "Test Assertion 'gmlas.d.5: Geometry elements': PASSED - 1 ms"
12.12.2017 03:00:10 - "Test Assertion 'gmlas.d.6: Point coordinates in gml:pos': PASSED - 0 ms"
12.12.2017 03:00:10 - "Test Assertion 'gmlas.d.7: Curve/Surface coordinates in gml:posList': PASSED - 0 ms"
12.12.2017 03:00:10 - "Test Assertion 'gmlas.d.8: No array property elements': PASSED - 0 ms"
12.12.2017 03:00:10 - "Test Assertion 'gmlas.d.9: 1, 2 or 3 coordinate dimensions': PASSED - 0 ms"
12.12.2017 03:00:10 - "Test Assertion 'gmlas.d.10: Validate geometries (1)': PASSED - 34 ms"
12.12.2017 03:00:10 - "Test Assertion 'gmlas.d.11: Validate geometries (2)': PASSED - 0 ms"
12.12.2017 03:00:10 - "Test Case 'Simple features' finished: PASSED"
12.12.2017 03:00:10 - "Test Case 'Code list values in basic data types' started"
12.12.2017 03:00:10 - "Test Assertion 'gmlas.e.1: GrammaticalNumber attributes': PASSED - 26 ms"
12.12.2017 03:00:10 - "Test Assertion 'gmlas.e.2: GrammaticalGender attributes': PASSED - 18 ms"
12.12.2017 03:00:10 - "Test Assertion 'gmlas.e.3: NameStatus attributes': PASSED - 4 ms"
12.12.2017 03:00:10 - "Test Assertion 'gmlas.e.4: Nativeness attributes': PASSED - 3 ms"
12.12.2017 03:00:10 - "Test Case 'Code list values in basic data types' finished: PASSED"
12.12.2017 03:00:10 - "Test Case 'Constraints' started"
12.12.2017 03:00:10 - "Test Assertion 'gmlas.f.1: At least one of the two attributes pronunciationSoundLink and pronunciationIPA shall not be void': PASSED - 0 ms"
12.12.2017 03:00:10 - "Test Case 'Constraints' finished: PASSED"
12.12.2017 03:00:10 - "Test Suite 'Conformance class: INSPIRE GML application schemas, General requirements' finished: FAILED"
12.12.2017 03:00:11 - Releasing resources
12.12.2017 03:00:11 - TestRunTask initialized
12.12.2017 03:00:11 - Skipping schema validation because no schema file has been set in the test suite. Data are only checked for well-formedness.
12.12.2017 03:00:11 - Validation ended with 0 error(s)
12.12.2017 03:00:11 - Compiling test script
12.12.2017 03:00:11 - Starting XQuery tests
12.12.2017 03:00:11 - "Testing 1 features"
12.12.2017 03:00:11 - "Indexing features (parsing errors: 0): 37 ms"
12.12.2017 03:00:11 - "Executing Test Suite: /home/tomcat/.etf/projects/ets-repository/data-tn/tn-gml/ets-tn-gml-bsxets.xml"
12.12.2017 03:00:11 - "Statistics table: 0 ms"
12.12.2017 03:00:11 - "Test Suite 'Conformance class: GML application schemas, Transport Networks' started"
12.12.2017 03:00:11 - "Test Case 'Basic test' started"
12.12.2017 03:00:11 - "Test Assertion 'tn-gml.a.1: Transport Network feature in dataset': PASSED - 1 ms"
12.12.2017 03:00:11 - "Test Case 'Basic test' finished: PASSED"
12.12.2017 03:00:11 - "Test Suite 'Conformance class: GML application schemas, Transport Networks' finished: PASSED"
12.12.2017 03:00:11 - Releasing resources
12.12.2017 03:00:11 - TestRunTask initialized
12.12.2017 03:00:11 - Skipping schema validation because no schema file has been set in the test suite. Data are only checked for well-formedness.
12.12.2017 03:00:11 - Validation ended with 0 error(s)
12.12.2017 03:00:11 - Compiling test script
12.12.2017 03:00:11 - Starting XQuery tests
12.12.2017 03:00:11 - "Testing 1 features"
12.12.2017 03:00:11 - "Indexing features (parsing errors: 0): 38 ms"
12.12.2017 03:00:11 - "Executing Test Suite: /home/tomcat/.etf/projects/ets-repository/data-tn/tn-as/ets-tn-as-bsxets.xml"
12.12.2017 03:00:11 - "Statistics table: 0 ms"
12.12.2017 03:00:11 - "Test Suite 'Conformance class: Application schema, Transport Networks Common' started"
12.12.2017 03:00:11 - "Test Case 'Code list values' started"
12.12.2017 03:00:11 - "Test Assertion 'tn-as.a.1: AccessRestrictionValue attributes': PASSED - 6 ms"
12.12.2017 03:00:11 - "Test Assertion 'tn-as.a.2: RestrictionTypeValue attributes': PASSED - 19 ms"
12.12.2017 03:00:11 - "Test Case 'Code list values' finished: PASSED"
12.12.2017 03:00:11 - "Test Case 'Constraints' started"
12.12.2017 03:00:11 - "Test Assertion 'tn-as.b.1: TrafficFlowDirection can only be associated with a spatial object of the type Link or LinkSequence.': PASSED - 0 ms"
12.12.2017 03:00:11 - "Test Assertion 'tn-as.b.2: All transport areas have an external object identifier.': PASSED - 0 ms"
12.12.2017 03:00:11 - "Test Assertion 'tn-as.b.3: All transport links have an external object identifier.': PASSED - 0 ms"
12.12.2017 03:00:11 - "Test Assertion 'tn-as.b.4: All transport link sequences have an external object identifier.': PASSED - 0 ms"
12.12.2017 03:00:11 - "Test Assertion 'tn-as.b.5: All transport link sets have an external object identifier.': PASSED - 0 ms"
12.12.2017 03:00:11 - "Test Assertion 'tn-as.b.6: All transport nodes have an external object identifier.': PASSED - 0 ms"
12.12.2017 03:00:11 - "Test Assertion 'tn-as.b.7: All transport points have an external object identifier.': PASSED - 0 ms"
12.12.2017 03:00:11 - "Test Assertion 'tn-as.b.8: All transport properties have an external object identifier.': PASSED - 0 ms"
12.12.2017 03:00:11 - "Test Assertion 'tn-as.b.9: A transport link sequence must be composed of transport links that all belong to the same transport network.': PASSED - 0 ms"
12.12.2017 03:00:11 - "Test Assertion 'tn-as.b.10: A transport link set must be composed of transport links and or transport link sequences that all belong to the same transport network.': PASSED - 0 ms"
12.12.2017 03:00:11 - "Test Case 'Constraints' finished: PASSED"
12.12.2017 03:00:11 - "Test Case 'Geometry' started"
12.12.2017 03:00:11 - "Test Assertion 'tn-as.c.1: No free transport nodes': PASSED - 0 ms"
12.12.2017 03:00:11 - "Test Assertion 'tn-as.c.2: Intersections only at crossings': PASSED_MANUAL"
12.12.2017 03:00:11 - "Test Case 'Geometry' finished: PASSED_MANUAL"
12.12.2017 03:00:11 - "Test Case 'Network connectivity' started"
12.12.2017 03:00:11 - "Test Assertion 'tn-as.d.1: Connectivity at crossings': PASSED_MANUAL"
12.12.2017 03:00:11 - "Test Assertion 'tn-as.d.2: Unconnected nodes': PASSED_MANUAL"
12.12.2017 03:00:11 - "Test Assertion 'tn-as.d.3: Connectivity tolerance': PASSED_MANUAL"
12.12.2017 03:00:11 - "Test Case 'Network connectivity' finished: PASSED_MANUAL"
12.12.2017 03:00:11 - "Test Case 'Object References' started"
12.12.2017 03:00:11 - "Test Assertion 'tn-as.e.1: Linear references': PASSED_MANUAL"
12.12.2017 03:00:11 - "Test Assertion 'tn-as.e.2: Inter-modal connections': PASSED - 0 ms"
12.12.2017 03:00:11 - "Test Case 'Object References' finished: PASSED_MANUAL"
12.12.2017 03:00:11 - "Test Suite 'Conformance class: Application schema, Transport Networks Common' finished: PASSED_MANUAL"
12.12.2017 03:00:11 - Releasing resources
12.12.2017 03:00:11 - TestRunTask initialized
12.12.2017 03:00:11 - Skipping schema validation because no schema file has been set in the test suite. Data are only checked for well-formedness.
12.12.2017 03:00:11 - Validation ended with 0 error(s)
12.12.2017 03:00:11 - Compiling test script
12.12.2017 03:00:11 - Starting XQuery tests
12.12.2017 03:00:11 - "Testing 1 features"
12.12.2017 03:00:11 - "Executing Test Suite: /home/tomcat/.etf/projects/ets-repository/data-tn/tn-ro-as/ets-tn-ro-as-bsxets.xml"
12.12.2017 03:00:11 - "Statistics table: 1 ms"
12.12.2017 03:00:11 - "Test Suite 'Conformance class: Application schema, Road Transport Networks' started"
12.12.2017 03:00:11 - "Test Case 'Code list values' started"
12.12.2017 03:00:11 - "Test Assertion 'tn-ro-as.a.1: AreaConditionValue attributes': PASSED - 14 ms"
12.12.2017 03:00:11 - "Test Assertion 'tn-ro-as.a.2: FormOfRoadNodeValue attributes': PASSED - 20 ms"
12.12.2017 03:00:11 - "Test Assertion 'tn-ro-as.a.3: FormOfWayValue attributes': PASSED - 20 ms"
12.12.2017 03:00:11 - "Test Assertion 'tn-ro-as.a.4: RoadPartValue attributes': PASSED - 18 ms"
12.12.2017 03:00:11 - "Test Assertion 'tn-ro-as.a.5: RoadServiceTypeValue attributes': PASSED - 11 ms"
12.12.2017 03:00:12 - "Test Assertion 'tn-ro-as.a.6: RoadSurfaceCategoryValue attributes': PASSED - 12 ms"
12.12.2017 03:00:12 - "Test Assertion 'tn-ro-as.a.7: ServiceFacilityValue attributes': PASSED - 12 ms"
12.12.2017 03:00:12 - "Test Assertion 'tn-ro-as.a.8: SpeedLimitSourceValue attributes': PASSED - 11 ms"
12.12.2017 03:00:12 - "Test Assertion 'tn-ro-as.a.9: VehicleTypeValue attributes': PASSED - 24 ms"
12.12.2017 03:00:12 - "Test Assertion 'tn-ro-as.a.10: WeatherConditionValue attributes': PASSED - 9 ms"
12.12.2017 03:00:12 - "Test Case 'Code list values' finished: PASSED"
12.12.2017 03:00:12 - "Test Case 'Constraints' started"
12.12.2017 03:00:12 - "Test Assertion 'tn-ro-as.b.1: FormOfWay can only be associated with a spatial object that is part of a road transport network.': PASSED - 1 ms"
12.12.2017 03:00:12 - "Test Assertion 'tn-ro-as.b.2: FunctionalRoadClass can only be associated with a spatial object that is part of a road transport network.': PASSED - 0 ms"
12.12.2017 03:00:12 - "Test Assertion 'tn-ro-as.b.3: NumberOfLanes can only be associated with a spatial object that is part of a road transport network.': PASSED - 0 ms"
12.12.2017 03:00:12 - "Test Assertion 'tn-ro-as.b.4: RoadName can only be associated with a spatial object that is part of a road transport network.': PASSED - 0 ms"
12.12.2017 03:00:12 - "Test Assertion 'tn-ro-as.b.5: RoadSurfaceCategory can only be associated with a spatial object that is part of a road transport network.': PASSED - 0 ms"
12.12.2017 03:00:12 - "Test Assertion 'tn-ro-as.b.6: RoadWidth can only be associated with a spatial object that is part of a road transport network.': PASSED - 0 ms"
12.12.2017 03:00:12 - "Test Assertion 'tn-ro-as.b.7: SpeedLimit can only be associated with a spatial object that is part of a road transport network.': PASSED - 0 ms"
12.12.2017 03:00:12 - "Test Assertion 'tn-ro-as.b.8: RoadServiceType can only be associated with a spatial object of the type RoadServiceArea or RoadNode (when formOfRoadNode=roadServiceArea)': PASSED - 0 ms"
12.12.2017 03:00:12 - "Test Case 'Constraints' finished: PASSED"
12.12.2017 03:00:12 - "Test Case 'Link centrelines' started"
12.12.2017 03:00:12 - "Test Assertion 'tn-ro-as.c.1: Link centrelines test': PASSED_MANUAL"
12.12.2017 03:00:12 - "Test Case 'Link centrelines' finished: PASSED_MANUAL"
12.12.2017 03:00:12 - "Test Suite 'Conformance class: Application schema, Road Transport Networks' finished: PASSED_MANUAL"
12.12.2017 03:00:12 - Releasing resources
12.12.2017 03:00:12 - TestRunTask initialized
12.12.2017 03:00:12 - Skipping schema validation because no schema file has been set in the test suite. Data are only checked for well-formedness.
12.12.2017 03:00:12 - Validation ended with 0 error(s)
12.12.2017 03:00:12 - Compiling test script
12.12.2017 03:00:12 - Starting XQuery tests
12.12.2017 03:00:12 - "Testing 1 features"
12.12.2017 03:00:12 - "Indexing features (parsing errors: 0): 38 ms"
12.12.2017 03:00:12 - "Executing Test Suite: /home/tomcat/.etf/projects/ets-repository/data/data-consistency/ets-data-consistency-bsxets.xml"
12.12.2017 03:00:12 - "Statistics table: 0 ms"
12.12.2017 03:00:12 - "Test Suite 'Conformance class: Data consistency, General requirements' started"
12.12.2017 03:00:12 - "Test Case 'Version consistency' started"
12.12.2017 03:00:12 - "Test Assertion 'dc.a.1: Version lifespan plausible': PASSED - 0 ms"
12.12.2017 03:00:12 - "Test Assertion 'dc.a.2: Unique identifier persistency': PASSED_MANUAL"
12.12.2017 03:00:12 - "Test Assertion 'dc.a.3: Spatial object type stable': PASSED_MANUAL"
12.12.2017 03:00:12 - "Test Case 'Version consistency' finished: PASSED_MANUAL"
12.12.2017 03:00:12 - "Test Case 'Temporal consistency' started"
12.12.2017 03:00:12 - "Test Assertion 'dc.b.1: Valid time plausible': PASSED - 0 ms"
12.12.2017 03:00:12 - "Test Case 'Temporal consistency' finished: PASSED"
12.12.2017 03:00:12 - "Test Suite 'Conformance class: Data consistency, General requirements' finished: PASSED_MANUAL"
12.12.2017 03:00:12 - Releasing resources
12.12.2017 03:00:12 - TestRunTask initialized
12.12.2017 03:00:12 - Skipping schema validation because no schema file has been set in the test suite. Data are only checked for well-formedness.
12.12.2017 03:00:12 - Validation ended with 0 error(s)
12.12.2017 03:00:12 - Compiling test script
12.12.2017 03:00:12 - Starting XQuery tests
12.12.2017 03:00:12 - "Testing 1 features"
12.12.2017 03:00:12 - "Indexing features (parsing errors: 0): 36 ms"
12.12.2017 03:00:12 - "Executing Test Suite: /home/tomcat/.etf/projects/ets-repository/data-tn/tn-dc/ets-tn-dc-bsxets.xml"
12.12.2017 03:00:12 - "Statistics table: 0 ms"
12.12.2017 03:00:12 - "Test Suite 'Conformance class: Data consistency, Transport Networks' started"
12.12.2017 03:00:12 - "Test Case 'Spatial consistency' started"
12.12.2017 03:00:12 - "Test Assertion 'tn-dc.a.1: Each Transport Network Link or Node geometry is within a Network Area geometry (Road Transport Networks)': PASSED - 0 ms"
12.12.2017 03:00:12 - "Test Assertion 'tn-dc.a.2: Each Transport Network Link or Node geometry is within a Network Area geometry (Railway Transport Networks)': PASSED - 0 ms"
12.12.2017 03:00:12 - "Test Assertion 'tn-dc.a.3: Each Transport Network Link or Node geometry is within a Network Area geometry (Waterway Transport Networks)': PASSED - 0 ms"
12.12.2017 03:00:12 - "Test Assertion 'tn-dc.a.4: Each Transport Network Link or Node geometry is within a Network Area geometry (Air Transport Networks)': PASSED - 0 ms"
12.12.2017 03:00:12 - "Test Assertion 'tn-dc.a.5: Manual review': PASSED_MANUAL"
12.12.2017 03:00:12 - "Test Case 'Spatial consistency' finished: PASSED_MANUAL"
12.12.2017 03:00:12 - "Test Suite 'Conformance class: Data consistency, Transport Networks' finished: PASSED_MANUAL"
12.12.2017 03:00:12 - Releasing resources
12.12.2017 03:00:12 - TestRunTask initialized
12.12.2017 03:00:12 - Skipping schema validation because no schema file has been set in the test suite. Data are only checked for well-formedness.
12.12.2017 03:00:12 - Validation ended with 0 error(s)
12.12.2017 03:00:12 - Compiling test script
12.12.2017 03:00:12 - Starting XQuery tests
12.12.2017 03:00:12 - "Testing 1 features"
12.12.2017 03:00:12 - "Indexing features (parsing errors: 0): 38 ms"
12.12.2017 03:00:12 - "Executing Test Suite: /home/tomcat/.etf/projects/ets-repository/data/information-accessibility/ets-information-accessibility-bsxets.xml"
12.12.2017 03:00:12 - "Statistics table: 1 ms"
12.12.2017 03:00:12 - "Test Suite 'Conformance class: Information accessibility, General requirements' started"
12.12.2017 03:00:12 - "Test Case 'Coordinate reference systems (CRS)' started"
12.12.2017 03:00:12 - "Test Assertion 'ia.a.1: CRS publicly accessible via HTTP': FAILED - 1 ms"
12.12.2017 03:00:12 - "Test Case 'Coordinate reference systems (CRS)' finished: FAILED"
12.12.2017 03:00:12 - "Test Suite 'Conformance class: Information accessibility, General requirements' finished: FAILED"
12.12.2017 03:00:13 - Releasing resources
12.12.2017 03:00:13 - TestRunTask initialized
12.12.2017 03:00:13 - Skipping schema validation because no schema file has been set in the test suite. Data are only checked for well-formedness.
12.12.2017 03:00:13 - Validation ended with 0 error(s)
12.12.2017 03:00:13 - Compiling test script
12.12.2017 03:00:13 - Starting XQuery tests
12.12.2017 03:00:13 - "Testing 1 features"
12.12.2017 03:00:13 - "Executing Test Suite: /home/tomcat/.etf/projects/ets-repository/data-tn/tn-ia/ets-tn-ia-bsxets.xml"
12.12.2017 03:00:13 - "Statistics table: 0 ms"
12.12.2017 03:00:13 - "Test Suite 'Conformance class: Information accessibility, Transport Networks' started"
12.12.2017 03:00:13 - "Test Case 'Code lists' started"
12.12.2017 03:00:13 - "Test Assertion 'tn-ia.a.1: Code list extensions accessible': PASSED - 0 ms"
12.12.2017 03:00:13 - "Test Case 'Code lists' finished: PASSED"
12.12.2017 03:00:13 - "Test Case 'Feature references' started"
12.12.2017 03:00:13 - "Test Assertion 'tn-ia.b.1: MarkerPost.route': PASSED - 0 ms"
12.12.2017 03:00:13 - "Test Assertion 'tn-ia.b.2: TransportLinkSet.post': PASSED - 0 ms"
12.12.2017 03:00:13 - "Test Case 'Feature references' finished: PASSED"
12.12.2017 03:00:13 - "Test Suite 'Conformance class: Information accessibility, Transport Networks' finished: PASSED"
12.12.2017 03:00:13 - Releasing resources
12.12.2017 03:00:13 - TestRunTask initialized
12.12.2017 03:00:13 - Skipping schema validation because no schema file has been set in the test suite. Data are only checked for well-formedness.
12.12.2017 03:00:13 - Validation ended with 0 error(s)
12.12.2017 03:00:13 - Compiling test script
12.12.2017 03:00:13 - Starting XQuery tests
12.12.2017 03:00:13 - "Testing 1 features"
12.12.2017 03:00:13 - "Indexing features (parsing errors: 0): 36 ms"
12.12.2017 03:00:13 - "Executing Test Suite: /home/tomcat/.etf/projects/ets-repository/data/reference-systems/ets-reference-systems-bsxets.xml"
12.12.2017 03:00:13 - "Statistics table: 1 ms"
12.12.2017 03:00:13 - "Test Suite 'Conformance class: Reference systems, General requirements' started"
12.12.2017 03:00:13 - "Test Case 'Spatial reference systems' started"
12.12.2017 03:00:13 - "Test Assertion 'rs.a.1: Spatial reference systems in feature geometries': FAILED - 0 ms"
12.12.2017 03:00:13 - "Test Assertion 'rs.a.2: Default spatial reference systems in feature collections': PASSED - 0 ms"
12.12.2017 03:00:13 - "Test Case 'Spatial reference systems' finished: FAILED"
12.12.2017 03:00:13 - "Test Case 'Temporal reference systems' started"
12.12.2017 03:00:13 - "Test Assertion 'rs.a.3: Temporal reference systems in features': PASSED - 0 ms"
12.12.2017 03:00:13 - "Test Case 'Temporal reference systems' finished: PASSED"
12.12.2017 03:00:13 - "Test Suite 'Conformance class: Reference systems, General requirements' finished: FAILED"
12.12.2017 03:00:13 - Releasing resources
12.12.2017 03:00:13 - TestRunTask initialized
12.12.2017 03:00:13 - Skipping schema validation because no schema file has been set in the test suite. Data are only checked for well-formedness.
12.12.2017 03:00:13 - Validation ended with 0 error(s)
12.12.2017 03:00:13 - Compiling test script
12.12.2017 03:00:13 - Starting XQuery tests
12.12.2017 03:00:13 - "Testing 1 features"
12.12.2017 03:00:13 - "Executing Test Suite: /home/tomcat/.etf/projects/ets-repository/data-tn/tn-rs/ets-tn-rs-bsxets.xml"
12.12.2017 03:00:13 - "Statistics table: 0 ms"
12.12.2017 03:00:13 - "Test Suite 'Conformance class: Reference systems, Transport Networks' started"
12.12.2017 03:00:13 - "Test Case 'Additional theme-specific rules for reference systems' started"
12.12.2017 03:00:13 - "Test Assertion 'tn-rs.a.1: Test always passes': PASSED - 0 ms"
12.12.2017 03:00:13 - "Test Case 'Additional theme-specific rules for reference systems' finished: PASSED"
12.12.2017 03:00:13 - "Test Suite 'Conformance class: Reference systems, Transport Networks' finished: PASSED"
12.12.2017 03:00:14 - Releasing resources
12.12.2017 03:00:14 - Changed state from INITIALIZED to RUNNING
12.12.2017 03:00:14 - Duration: 14sec
12.12.2017 03:00:14 - TestRun finished
12.12.2017 03:00:14 - Changed state from RUNNING to COMPLETED
