05.12.2017 08:09:28 - Preparing Test Run interoperability_17058520_&Scaron;t&aacute;tna ochrana pr&iacute;rody Slovenskej republiky_ps-f:ProtectedSite (initiated Tue Dec 05 08:09:28 CET 2017)
05.12.2017 08:09:28 - Resolving Executable Test Suite dependencies
05.12.2017 08:09:28 - Preparing 10 Test Task:
05.12.2017 08:09:28 -  TestTask 1 (28b3bb0d-05b5-4aeb-b9c3-80158c180c5b)
05.12.2017 08:09:28 -  will perform tests on Test Object 'ows.xml' by using Executable Test Suite 'LAZY.545f9e49-009b-4114-9333-7ca26413b5d4'
05.12.2017 08:09:28 -  with parameters: 
05.12.2017 08:09:28 - etf.testcases = *
05.12.2017 08:09:28 -  TestTask 2 (c178341f-c4d3-45f8-aedf-dc4f61c16e35)
05.12.2017 08:09:28 -  will perform tests on Test Object 'ows.xml' by using Executable Test Suite 'LAZY.09820daf-62b2-4fa3-a95f-56a0d2b7c4d8'
05.12.2017 08:09:28 -  with parameters: 
05.12.2017 08:09:28 - etf.testcases = *
05.12.2017 08:09:28 -  TestTask 3 (d4669789-fba7-41ed-82f1-87a603d903b1)
05.12.2017 08:09:28 -  will perform tests on Test Object 'ows.xml' by using Executable Test Suite 'LAZY.8222c253-8468-4b94-a46b-2d1af1698a65'
05.12.2017 08:09:28 -  with parameters: 
05.12.2017 08:09:28 - etf.testcases = *
05.12.2017 08:09:28 -  TestTask 4 (3c8dc21b-6d22-4a87-8653-6c2b2abdb6bb)
05.12.2017 08:09:28 -  will perform tests on Test Object 'ows.xml' by using Executable Test Suite 'Conformance class: Application schema, Protected Sites Simple (EID: 4c53a8c7-7cac-4531-982b-d03eb48ffa77, V: 0.2.1 )'
05.12.2017 08:09:28 -  with parameters: 
05.12.2017 08:09:28 - etf.testcases = *
05.12.2017 08:09:28 -  TestTask 5 (9b95bbca-f8f2-4861-a8e1-bed104c9ade4)
05.12.2017 08:09:28 -  will perform tests on Test Object 'ows.xml' by using Executable Test Suite 'LAZY.61070ae8-13cb-4303-a340-72c8b877b00a'
05.12.2017 08:09:28 -  with parameters: 
05.12.2017 08:09:28 - etf.testcases = *
05.12.2017 08:09:28 -  TestTask 6 (42979085-1d83-4518-b6dd-52f7f5b01c2d)
05.12.2017 08:09:28 -  will perform tests on Test Object 'ows.xml' by using Executable Test Suite 'Conformance class: Data consistency, Protected Sites (EID: 7831c8b4-f666-4534-838a-137b30bfecbe, V: 0.2.0 )'
05.12.2017 08:09:28 -  with parameters: 
05.12.2017 08:09:28 - etf.testcases = *
05.12.2017 08:09:28 -  TestTask 7 (b97a2110-615f-427a-bc9a-c566f1e4b094)
05.12.2017 08:09:28 -  will perform tests on Test Object 'ows.xml' by using Executable Test Suite 'LAZY.499937ea-0590-42d2-bd7a-1cafff35ecdb'
05.12.2017 08:09:28 -  with parameters: 
05.12.2017 08:09:28 - etf.testcases = *
05.12.2017 08:09:28 -  TestTask 8 (a7b18f22-ef6f-4171-a5c6-803842e1f2a5)
05.12.2017 08:09:28 -  will perform tests on Test Object 'ows.xml' by using Executable Test Suite 'Conformance class: Information accessibility, Protected Sites (EID: b529e8fa-b9f8-4758-acea-1d2af744599f, V: 0.2.2 )'
05.12.2017 08:09:28 -  with parameters: 
05.12.2017 08:09:28 - etf.testcases = *
05.12.2017 08:09:28 -  TestTask 9 (02cf4c7e-9b24-47ad-8788-5596c983b165)
05.12.2017 08:09:28 -  will perform tests on Test Object 'ows.xml' by using Executable Test Suite 'LAZY.63f586f0-080c-493b-8ca2-9919427440cc'
05.12.2017 08:09:28 -  with parameters: 
05.12.2017 08:09:28 - etf.testcases = *
05.12.2017 08:09:28 -  TestTask 10 (48ae1bae-e6aa-4444-9337-f23f1016825b)
05.12.2017 08:09:28 -  will perform tests on Test Object 'ows.xml' by using Executable Test Suite 'Conformance class: Reference systems, Protected Sites (EID: 828410c1-53f2-4683-bded-481ad9d4d3e9, V: 0.2.0 )'
05.12.2017 08:09:28 -  with parameters: 
05.12.2017 08:09:28 - etf.testcases = *
05.12.2017 08:09:28 - Test Tasks prepared and ready to be executed. Waiting for the scheduler to start.
05.12.2017 08:09:28 - Setting state to CREATED
05.12.2017 08:09:28 - Changed state from CREATED to INITIALIZING
05.12.2017 08:09:28 - Starting TestRun.12ae1eee-afa0-4033-9f40-b25d973ee033 at 2017-12-05T08:09:30+01:00
05.12.2017 08:09:30 - Changed state from INITIALIZING to INITIALIZED
05.12.2017 08:09:30 - TestRunTask initialized
05.12.2017 08:09:30 - Creating new tests databases to speed up tests.
05.12.2017 08:09:30 - Skipping schema validation because no schema file has been set in the test suite. Data are only checked for well-formedness.
05.12.2017 08:09:30 - Optimizing last database etf-tdb-cb44d3b7-30eb-49b8-bc5c-8c7b8fc5393e-0 
05.12.2017 08:09:30 - Import completed
05.12.2017 08:09:31 - Validation ended with 0 error(s)
05.12.2017 08:09:31 - Compiling test script
05.12.2017 08:09:31 - Starting XQuery tests
05.12.2017 08:09:31 - "Testing 1 features"
05.12.2017 08:09:31 - "Executing Test Suite: /home/tomcat/.etf/projects/ets-repository/data-encoding/inspire-gml/ets-inspire-gml-bsxets.xml"
05.12.2017 08:09:31 - "Statistics table: 0 ms"
05.12.2017 08:09:31 - "Test Suite 'Conformance class: INSPIRE GML encoding' started"
05.12.2017 08:09:31 - "Test Case 'Basic tests' started"
05.12.2017 08:09:31 - "Test Assertion 'gml.a.1: Errors loading the XML documents': PASSED - 0 ms"
05.12.2017 08:09:31 - "Test Assertion 'gml.a.2: Document root element': PASSED - 1 ms"
05.12.2017 08:09:31 - "Test Assertion 'gml.a.3: Character encoding': NOT_APPLICABLE"
05.12.2017 08:09:31 - "Test Case 'Basic tests' finished: PASSED"
05.12.2017 08:09:31 - "Test Suite 'Conformance class: INSPIRE GML encoding' finished: PASSED"
05.12.2017 08:09:33 - Releasing resources
05.12.2017 08:09:33 - TestRunTask initialized
05.12.2017 08:09:33 - Recreating new tests databases as the Test Object has changed!
05.12.2017 08:09:33 - Skipping schema validation because no schema file has been set in the test suite. Data are only checked for well-formedness.
05.12.2017 08:09:33 - Optimizing last database etf-tdb-cb44d3b7-30eb-49b8-bc5c-8c7b8fc5393e-0 
05.12.2017 08:09:33 - Import completed
05.12.2017 08:09:33 - Validation ended with 0 error(s)
05.12.2017 08:09:33 - Compiling test script
05.12.2017 08:09:33 - Starting XQuery tests
05.12.2017 08:09:34 - "Testing 1 features"
05.12.2017 08:09:34 - "Indexing features (parsing errors: 0): 148 ms"
05.12.2017 08:09:34 - "Executing Test Suite: /home/tomcat/.etf/projects/ets-repository/data/schemas/ets-schemas-bsxets.xml"
05.12.2017 08:09:34 - "Statistics table: 0 ms"
05.12.2017 08:09:34 - "Test Suite 'Conformance class: INSPIRE GML application schemas, General requirements' started"
05.12.2017 08:09:34 - "Test Case 'Schema' started"
05.12.2017 08:09:34 - "Test Assertion 'gmlas.a.1: Mapping of source data to INSPIRE': PASSED_MANUAL"
05.12.2017 08:09:34 - "Test Assertion 'gmlas.a.2: Modelling of additional spatial object types': PASSED_MANUAL"
05.12.2017 08:09:34 - "Test Case 'Schema' finished: PASSED_MANUAL"
05.12.2017 08:09:34 - "Test Case 'Schema validation' started"
05.12.2017 08:09:34 - "Test Assertion 'gmlas.b.1: xsi:schemaLocation attribute': PASSED - 0 ms"
05.12.2017 08:09:34 - "Validating ows.xml"
05.12.2017 08:09:44 - "Duration: 10641 ms. Errors: 40."
05.12.2017 08:09:44 - "Test Assertion 'gmlas.b.2: validate XML documents': FAILED - 10644 ms"
05.12.2017 08:09:44 - "Test Case 'Schema validation' finished: FAILED"
05.12.2017 08:09:44 - "Test Case 'GML model' started"
05.12.2017 08:09:44 - "Test Assertion 'gmlas.c.1: Consistency with the GML model': PASSED - 0 ms"
05.12.2017 08:09:44 - "Test Assertion 'gmlas.c.2: nilReason attributes require xsi:nil=true': FAILED - 1 ms"
05.12.2017 08:09:44 - "Test Assertion 'gmlas.c.3: nilReason values': PASSED - 0 ms"
05.12.2017 08:09:44 - "Test Case 'GML model' finished: FAILED"
05.12.2017 08:09:44 - "Test Case 'Simple features' started"
05.12.2017 08:09:44 - "Test Assertion 'gmlas.d.1: No spatial topology objects': PASSED - 1 ms"
05.12.2017 08:09:44 - "Test Assertion 'gmlas.d.2: No non-linear interpolation': PASSED - 0 ms"
05.12.2017 08:09:44 - "Test Assertion 'gmlas.d.3: Surface geometry elements': PASSED - 0 ms"
05.12.2017 08:09:44 - "Test Assertion 'gmlas.d.4: No non-planar interpolation': PASSED - 0 ms"
05.12.2017 08:09:44 - "Test Assertion 'gmlas.d.5: Geometry elements': PASSED - 1 ms"
05.12.2017 08:09:44 - "Test Assertion 'gmlas.d.6: Point coordinates in gml:pos': PASSED - 0 ms"
05.12.2017 08:09:44 - "Test Assertion 'gmlas.d.7: Curve/Surface coordinates in gml:posList': PASSED - 1 ms"
05.12.2017 08:09:44 - "Test Assertion 'gmlas.d.8: No array property elements': PASSED - 0 ms"
05.12.2017 08:09:44 - "Test Assertion 'gmlas.d.9: 1, 2 or 3 coordinate dimensions': PASSED - 0 ms"
05.12.2017 08:09:45 - "Test Assertion 'gmlas.d.10: Validate geometries (1)': FAILED - 179 ms"
05.12.2017 08:09:45 - "Test Assertion 'gmlas.d.11: Validate geometries (2)': PASSED - 0 ms"
05.12.2017 08:09:45 - "Test Case 'Simple features' finished: FAILED"
05.12.2017 08:09:45 - "Test Case 'Code list values in basic data types' started"
05.12.2017 08:09:45 - "Test Assertion 'gmlas.e.1: GrammaticalNumber attributes': PASSED - 8 ms"
05.12.2017 08:09:45 - "Test Assertion 'gmlas.e.2: GrammaticalGender attributes': PASSED - 4 ms"
05.12.2017 08:09:45 - "Test Assertion 'gmlas.e.3: NameStatus attributes': PASSED - 7 ms"
05.12.2017 08:09:45 - "Test Assertion 'gmlas.e.4: Nativeness attributes': PASSED - 8 ms"
05.12.2017 08:09:45 - "Test Case 'Code list values in basic data types' finished: PASSED"
05.12.2017 08:09:45 - "Test Case 'Constraints' started"
05.12.2017 08:09:45 - "Test Assertion 'gmlas.f.1: At least one of the two attributes pronunciationSoundLink and pronunciationIPA shall not be void': FAILED - 0 ms"
05.12.2017 08:09:45 - "Test Case 'Constraints' finished: FAILED"
05.12.2017 08:09:45 - "Test Suite 'Conformance class: INSPIRE GML application schemas, General requirements' finished: FAILED"
05.12.2017 08:09:47 - Releasing resources
05.12.2017 08:09:47 - TestRunTask initialized
05.12.2017 08:09:47 - Skipping schema validation because no schema file has been set in the test suite. Data are only checked for well-formedness.
05.12.2017 08:09:47 - Validation ended with 0 error(s)
05.12.2017 08:09:47 - Compiling test script
05.12.2017 08:09:47 - Starting XQuery tests
05.12.2017 08:09:47 - "Testing 1 features"
05.12.2017 08:09:47 - "Executing Test Suite: /home/tomcat/.etf/projects/ets-repository/data-ps/ps-gml/ets-ps-gml-bsxets.xml"
05.12.2017 08:09:47 - "Statistics table: 0 ms"
05.12.2017 08:09:47 - "Test Suite 'Conformance class: GML application schemas, Protected Sites' started"
05.12.2017 08:09:47 - "Test Case 'Basic test' started"
05.12.2017 08:09:47 - "Test Assertion 'ps-gml.a.1: Protected site feature in dataset': PASSED - 0 ms"
05.12.2017 08:09:47 - "Test Case 'Basic test' finished: PASSED"
05.12.2017 08:09:47 - "Test Suite 'Conformance class: GML application schemas, Protected Sites' finished: PASSED"
05.12.2017 08:09:47 - Releasing resources
05.12.2017 08:09:47 - TestRunTask initialized
05.12.2017 08:09:47 - Skipping schema validation because no schema file has been set in the test suite. Data are only checked for well-formedness.
05.12.2017 08:09:47 - Validation ended with 0 error(s)
05.12.2017 08:09:47 - Compiling test script
05.12.2017 08:09:47 - Starting XQuery tests
05.12.2017 08:09:47 - "Testing 1 features"
05.12.2017 08:09:47 - "Executing Test Suite: /home/tomcat/.etf/projects/ets-repository/data-ps/ps-as/ets-ps-as-bsxets.xml"
05.12.2017 08:09:47 - "Statistics table: 0 ms"
05.12.2017 08:09:47 - "Test Suite 'Conformance class: Application schema, Protected Sites Simple' started"
05.12.2017 08:09:47 - "Test Case 'Code list values' started"
05.12.2017 08:09:47 - "Test Assertion 'ps-as.a.1: extensions to code lists in property 'ps:designation'': PASSED - 77 ms"
05.12.2017 08:09:47 - "Test Assertion 'ps-as.a.2: extensions to code lists in property 'ps:designationScheme'': PASSED - 0 ms"
05.12.2017 08:09:47 - "Test Case 'Code list values' finished: PASSED"
05.12.2017 08:09:47 - "Test Case 'Constraints' started"
05.12.2017 08:09:47 - "Test Assertion 'ps-as.b.1: Sites must use designations from an appropriate designation scheme': PASSED - 115 ms"
05.12.2017 08:09:47 - "Test Case 'Constraints' finished: PASSED"
05.12.2017 08:09:47 - "Test Suite 'Conformance class: Application schema, Protected Sites Simple' finished: PASSED"
05.12.2017 08:09:48 - Releasing resources
05.12.2017 08:09:48 - TestRunTask initialized
05.12.2017 08:09:48 - Skipping schema validation because no schema file has been set in the test suite. Data are only checked for well-formedness.
05.12.2017 08:09:48 - Validation ended with 0 error(s)
05.12.2017 08:09:48 - Compiling test script
05.12.2017 08:09:48 - Starting XQuery tests
05.12.2017 08:09:48 - "Testing 1 features"
05.12.2017 08:09:48 - "Indexing features (parsing errors: 0): 164 ms"
05.12.2017 08:09:48 - "Executing Test Suite: /home/tomcat/.etf/projects/ets-repository/data/data-consistency/ets-data-consistency-bsxets.xml"
05.12.2017 08:09:48 - "Statistics table: 0 ms"
05.12.2017 08:09:48 - "Test Suite 'Conformance class: Data consistency, General requirements' started"
05.12.2017 08:09:48 - "Test Case 'Version consistency' started"
05.12.2017 08:09:48 - "Test Assertion 'dc.a.1: Version lifespan plausible': PASSED - 0 ms"
05.12.2017 08:09:48 - "Test Assertion 'dc.a.2: Unique identifier persistency': PASSED_MANUAL"
05.12.2017 08:09:48 - "Test Assertion 'dc.a.3: Spatial object type stable': PASSED_MANUAL"
05.12.2017 08:09:48 - "Test Case 'Version consistency' finished: PASSED_MANUAL"
05.12.2017 08:09:48 - "Test Case 'Temporal consistency' started"
05.12.2017 08:09:48 - "Test Assertion 'dc.b.1: Valid time plausible': PASSED - 0 ms"
05.12.2017 08:09:48 - "Test Case 'Temporal consistency' finished: PASSED"
05.12.2017 08:09:48 - "Test Suite 'Conformance class: Data consistency, General requirements' finished: PASSED_MANUAL"
05.12.2017 08:09:49 - Releasing resources
05.12.2017 08:09:49 - TestRunTask initialized
05.12.2017 08:09:49 - Skipping schema validation because no schema file has been set in the test suite. Data are only checked for well-formedness.
05.12.2017 08:09:49 - Validation ended with 0 error(s)
05.12.2017 08:09:49 - Compiling test script
05.12.2017 08:09:49 - Starting XQuery tests
05.12.2017 08:09:49 - "Testing 1 features"
05.12.2017 08:09:49 - "Executing Test Suite: /home/tomcat/.etf/projects/ets-repository/data-ps/ps-dc/ets-ps-dc-bsxets.xml"
05.12.2017 08:09:49 - "Statistics table: 1 ms"
05.12.2017 08:09:49 - "Test Suite 'Conformance class: Data consistency, Protected Sites' started"
05.12.2017 08:09:49 - "Test Case 'Additional theme-specific consistency rules' started"
05.12.2017 08:09:49 - "Test Assertion 'ps-dc.a.1: Test always passes': PASSED - 0 ms"
05.12.2017 08:09:49 - "Test Case 'Additional theme-specific consistency rules' finished: PASSED"
05.12.2017 08:09:49 - "Test Suite 'Conformance class: Data consistency, Protected Sites' finished: PASSED"
05.12.2017 08:09:49 - Releasing resources
05.12.2017 08:09:49 - TestRunTask initialized
05.12.2017 08:09:49 - Skipping schema validation because no schema file has been set in the test suite. Data are only checked for well-formedness.
05.12.2017 08:09:49 - Validation ended with 0 error(s)
05.12.2017 08:09:49 - Compiling test script
05.12.2017 08:09:49 - Starting XQuery tests
05.12.2017 08:09:49 - "Testing 1 features"
05.12.2017 08:09:50 - "Indexing features (parsing errors: 0): 137 ms"
05.12.2017 08:09:50 - "Executing Test Suite: /home/tomcat/.etf/projects/ets-repository/data/information-accessibility/ets-information-accessibility-bsxets.xml"
05.12.2017 08:09:50 - "Statistics table: 0 ms"
05.12.2017 08:09:50 - "Test Suite 'Conformance class: Information accessibility, General requirements' started"
05.12.2017 08:09:50 - "Test Case 'Coordinate reference systems (CRS)' started"
05.12.2017 08:09:50 - "Test Assertion 'ia.a.1: CRS publicly accessible via HTTP': FAILED - 1 ms"
05.12.2017 08:09:50 - "Test Case 'Coordinate reference systems (CRS)' finished: FAILED"
05.12.2017 08:09:50 - "Test Suite 'Conformance class: Information accessibility, General requirements' finished: FAILED"
05.12.2017 08:09:50 - Releasing resources
05.12.2017 08:09:50 - TestRunTask initialized
05.12.2017 08:09:50 - Skipping schema validation because no schema file has been set in the test suite. Data are only checked for well-formedness.
05.12.2017 08:09:50 - Validation ended with 0 error(s)
05.12.2017 08:09:50 - Compiling test script
05.12.2017 08:09:50 - Starting XQuery tests
05.12.2017 08:09:50 - "Testing 1 features"
05.12.2017 08:09:50 - "Executing Test Suite: /home/tomcat/.etf/projects/ets-repository/data-ps/ps-ia/ets-ps-ia-bsxets.xml"
05.12.2017 08:09:50 - "Statistics table: 0 ms"
05.12.2017 08:09:50 - "Test Suite 'Conformance class: Information accessibility, Protected Sites' started"
05.12.2017 08:09:50 - "Test Case 'Code lists' started"
05.12.2017 08:09:50 - "Test Assertion 'ps-ia.a.1: Code list extensions accessible': PASSED - 0 ms"
05.12.2017 08:09:50 - "Test Case 'Code lists' finished: PASSED"
05.12.2017 08:09:50 - "Test Suite 'Conformance class: Information accessibility, Protected Sites' finished: PASSED"
05.12.2017 08:09:51 - Releasing resources
05.12.2017 08:09:51 - TestRunTask initialized
05.12.2017 08:09:51 - Skipping schema validation because no schema file has been set in the test suite. Data are only checked for well-formedness.
05.12.2017 08:09:51 - Validation ended with 0 error(s)
05.12.2017 08:09:51 - Compiling test script
05.12.2017 08:09:51 - Starting XQuery tests
05.12.2017 08:09:51 - "Testing 1 features"
05.12.2017 08:09:51 - "Indexing features (parsing errors: 0): 133 ms"
05.12.2017 08:09:51 - "Executing Test Suite: /home/tomcat/.etf/projects/ets-repository/data/reference-systems/ets-reference-systems-bsxets.xml"
05.12.2017 08:09:51 - "Statistics table: 0 ms"
05.12.2017 08:09:51 - "Test Suite 'Conformance class: Reference systems, General requirements' started"
05.12.2017 08:09:51 - "Test Case 'Spatial reference systems' started"
05.12.2017 08:09:51 - "Test Assertion 'rs.a.1: Spatial reference systems in feature geometries': FAILED - 1 ms"
05.12.2017 08:09:51 - "Test Assertion 'rs.a.2: Default spatial reference systems in feature collections': PASSED - 0 ms"
05.12.2017 08:09:51 - "Test Case 'Spatial reference systems' finished: FAILED"
05.12.2017 08:09:51 - "Test Case 'Temporal reference systems' started"
05.12.2017 08:09:51 - "Test Assertion 'rs.a.3: Temporal reference systems in features': PASSED - 0 ms"
05.12.2017 08:09:51 - "Test Case 'Temporal reference systems' finished: PASSED"
05.12.2017 08:09:51 - "Test Suite 'Conformance class: Reference systems, General requirements' finished: FAILED"
05.12.2017 08:09:52 - Releasing resources
05.12.2017 08:09:52 - TestRunTask initialized
05.12.2017 08:09:52 - Skipping schema validation because no schema file has been set in the test suite. Data are only checked for well-formedness.
05.12.2017 08:09:52 - Validation ended with 0 error(s)
05.12.2017 08:09:52 - Compiling test script
05.12.2017 08:09:52 - Starting XQuery tests
05.12.2017 08:09:52 - "Testing 1 features"
05.12.2017 08:09:52 - "Executing Test Suite: /home/tomcat/.etf/projects/ets-repository/data-ps/ps-rs/ets-ps-rs-bsxets.xml"
05.12.2017 08:09:52 - "Statistics table: 0 ms"
05.12.2017 08:09:52 - "Test Suite 'Conformance class: Reference systems, Protected Sites' started"
05.12.2017 08:09:52 - "Test Case 'Additional theme-specific rules for reference systems' started"
05.12.2017 08:09:52 - "Test Assertion 'ps-rs.a.1: Test always passes': PASSED - 0 ms"
05.12.2017 08:09:52 - "Test Case 'Additional theme-specific rules for reference systems' finished: PASSED"
05.12.2017 08:09:52 - "Test Suite 'Conformance class: Reference systems, Protected Sites' finished: PASSED"
05.12.2017 08:09:52 - Releasing resources
05.12.2017 08:09:52 - Changed state from INITIALIZED to RUNNING
05.12.2017 08:09:52 - Duration: 24sec
05.12.2017 08:09:52 - TestRun finished
05.12.2017 08:09:52 - Changed state from RUNNING to COMPLETED
