12.12.2017 21:45:50 - Preparing Test Run metadata_17316219_Geodetick&yacute; a kartografick&yacute; &uacute;stav Bratislava_INSPIRE Zobrazovacia služba &ndash; Dopravn&eacute; siete (initiated Tue Dec 12 21:45:50 CET 2017)
12.12.2017 21:45:50 - Resolving Executable Test Suite dependencies
12.12.2017 21:45:50 - Preparing 2 Test Task:
12.12.2017 21:45:50 -  TestTask 1 (a7ea17d7-a30b-40f2-8b60-14816d48c3fc)
12.12.2017 21:45:50 -  will perform tests on Test Object 'GetRecordByIdResponse.xml' by using Executable Test Suite 'LAZY.e3500038-e37c-4dcf-806c-6bc82d585b3b'
12.12.2017 21:45:50 -  with parameters: 
12.12.2017 21:45:50 - etf.testcases = *
12.12.2017 21:45:50 -  TestTask 2 (74397b9e-1c9c-4f69-9f3e-4b1060dc93c5)
12.12.2017 21:45:50 -  will perform tests on Test Object 'GetRecordByIdResponse.xml' by using Executable Test Suite 'Conformance class: INSPIRE Profile based on EN ISO 19115 and EN ISO 19119 (EID: ec7323d5-d8f0-4cfe-b23a-b826df86d58c, V: 0.2.5 )'
12.12.2017 21:45:50 -  with parameters: 
12.12.2017 21:45:50 - etf.testcases = *
12.12.2017 21:45:50 - Test Tasks prepared and ready to be executed. Waiting for the scheduler to start.
12.12.2017 21:45:50 - Setting state to CREATED
12.12.2017 21:45:50 - Changed state from CREATED to INITIALIZING
12.12.2017 21:45:50 - Starting TestRun.1c8cb899-0ed3-48ac-bd73-23c550a9cb01 at 2017-12-12T21:45:51+01:00
12.12.2017 21:45:51 - Changed state from INITIALIZING to INITIALIZED
12.12.2017 21:45:51 - TestRunTask initialized
12.12.2017 21:45:51 - Creating new tests databases to speed up tests.
12.12.2017 21:45:51 - Skipping schema validation because no schema file has been set in the test suite. Data are only checked for well-formedness.
12.12.2017 21:45:51 - Optimizing last database etf-tdb-bf908be2-f28f-4765-a5b5-8aa6eec55b06-0 
12.12.2017 21:45:51 - Import completed
12.12.2017 21:45:52 - Validation ended with 0 error(s)
12.12.2017 21:45:52 - Compiling test script
12.12.2017 21:45:52 - Starting XQuery tests
12.12.2017 21:45:52 - "Testing 1 records"
12.12.2017 21:45:52 - "Executing Test Suite: /home/tomcat/.etf/projects/ets-repository/metadata/xml/ets-md-xml-bsxets.xml"
12.12.2017 21:45:52 - "Statistics table: 0 ms"
12.12.2017 21:45:52 - "Test Suite 'Conformance class: XML encoding of ISO 19115/19119 metadata' started"
12.12.2017 21:45:52 - "Test Case 'Schema validation' started"
12.12.2017 21:45:53 - "Validating file GetRecordByIdResponse.xml: 1850 ms"
12.12.2017 21:45:53 - "Test Assertion 'md-xml.a.1: Validate XML documents': PASSED - 1850 ms"
12.12.2017 21:45:53 - "Test Case 'Schema validation' finished: PASSED"
12.12.2017 21:45:53 - "Test Suite 'Conformance class: XML encoding of ISO 19115/19119 metadata' finished: PASSED"
12.12.2017 21:45:54 - Releasing resources
12.12.2017 21:45:54 - TestRunTask initialized
12.12.2017 21:45:54 - Recreating new tests databases as the Test Object has changed!
12.12.2017 21:45:54 - Skipping schema validation because no schema file has been set in the test suite. Data are only checked for well-formedness.
12.12.2017 21:45:54 - Optimizing last database etf-tdb-bf908be2-f28f-4765-a5b5-8aa6eec55b06-0 
12.12.2017 21:45:54 - Import completed
12.12.2017 21:45:54 - Validation ended with 0 error(s)
12.12.2017 21:45:54 - Compiling test script
12.12.2017 21:45:54 - Starting XQuery tests
12.12.2017 21:45:54 - "Testing 1 records"
12.12.2017 21:45:54 - "Executing Test Suite: /home/tomcat/.etf/projects/ets-repository/metadata/iso/ets-md-iso-bsxets.xml"
12.12.2017 21:45:54 - "Statistics table: 0 ms"
12.12.2017 21:45:54 - "Test Suite 'Conformance class: INSPIRE Profile based on EN ISO 19115 and EN ISO 19119' started"
12.12.2017 21:45:54 - "Test Case 'Common tests' started"
12.12.2017 21:45:54 - "Test Assertion 'md-iso.a.1: Title': PASSED - 0 ms"
12.12.2017 21:45:54 - "Test Assertion 'md-iso.a.2: Abstract': PASSED - 0 ms"
12.12.2017 21:45:54 - "Test Assertion 'md-iso.a.3: Access and use conditions': PASSED_MANUAL - 0 ms"
12.12.2017 21:45:54 - "Test Assertion 'md-iso.a.4: Public access': PASSED - 0 ms"
12.12.2017 21:45:54 - "Test Assertion 'md-iso.a.5: Specification': PASSED - 0 ms"
12.12.2017 21:45:54 - "Test Assertion 'md-iso.a.6: Language': PASSED - 0 ms"
12.12.2017 21:45:54 - "Test Assertion 'md-iso.a.7: Metadata contact': PASSED - 0 ms"
12.12.2017 21:45:54 - "Test Assertion 'md-iso.a.8: Metadata contact role': PASSED - 1 ms"
12.12.2017 21:45:54 - "Test Assertion 'md-iso.a.9: Resource creation date': PASSED - 0 ms"
12.12.2017 21:45:54 - "Test Assertion 'md-iso.a.10: Responsible party contact info': PASSED - 0 ms"
12.12.2017 21:45:54 - "Test Assertion 'md-iso.a.11: Responsible party role': PASSED - 0 ms"
12.12.2017 21:45:54 - "Test Case 'Common tests' finished: PASSED_MANUAL"
12.12.2017 21:45:54 - "Test Case 'Hierarchy level' started"
12.12.2017 21:45:54 - "Test Assertion 'md-iso.b.1: Hierarchy': PASSED - 0 ms"
12.12.2017 21:45:54 - "Test Case 'Hierarchy level' finished: PASSED"
12.12.2017 21:45:54 - "Test Case 'Dataset (series) tests' started"
12.12.2017 21:45:54 - "Test Assertion 'md-iso.c.1: Dataset identification': PASSED - 0 ms"
12.12.2017 21:45:54 - "Test Assertion 'md-iso.c.2: Dataset language': PASSED - 0 ms"
12.12.2017 21:45:54 - "Test Assertion 'md-iso.c.3: Dataset linkage': PASSED - 0 ms"
12.12.2017 21:45:54 - "Test Assertion 'md-iso.c.4: Dataset conformity': PASSED - 0 ms"
12.12.2017 21:45:54 - "Test Assertion 'md-iso.c.5: Dataset topic': PASSED - 0 ms"
12.12.2017 21:45:54 - "Test Assertion 'md-iso.c.6: Dataset geographic Bounding box': PASSED - 0 ms"
12.12.2017 21:45:54 - "Test Assertion 'md-iso.c.7: Dataset lineage': PASSED - 0 ms"
12.12.2017 21:45:54 - "Test Case 'Dataset (series) tests' finished: PASSED"
12.12.2017 21:45:54 - "Test Case 'Service tests' started"
12.12.2017 21:45:54 - "Test Assertion 'md-iso.d.1: Service type': PASSED - 0 ms"
12.12.2017 21:45:54 - "Checking URL: 'https://zbgisws.skgeodesy.sk/inspire_transport_networks_wms/service.svc/get'"
12.12.2017 21:45:54 - "Checking URL: 'https://zbgis.skgeodesy.sk/mkzbgis/?addWMS=https://zbgisws.skgeodesy.sk/inspire_transport_networks_wms/service.svc/get'"
12.12.2017 21:45:54 - "Test Assertion 'md-iso.d.2: Service linkage': PASSED_MANUAL - 555 ms"
12.12.2017 21:45:54 - "Checking URL: 'https://zbgisws.skgeodesy.sk/zbgiscsw/service.svc/get?REQUEST=GetRecordById&amp;SERVICE=CSW&amp;VERSION=2.0.2&amp;OUTPUTSCHEMA=http://www.isotc211.org/2005/gmd&amp;ELEMENTSETNAME=full&amp;Id=https://data.gov.sk/set/rpi/gmd/17316219/SK_UGKK_..."
12.12.2017 21:45:55 - "Test Assertion 'md-iso.d.3: Coupled resource': PASSED - 508 ms"
12.12.2017 21:45:55 - "Test Case 'Service tests' finished: PASSED_MANUAL"
12.12.2017 21:45:55 - "Test Case 'Keywords' started"
12.12.2017 21:45:55 - "Test Assertion 'md-iso.e.1: Keywords': PASSED - 0 ms"
12.12.2017 21:45:55 - "Test Case 'Keywords' finished: PASSED"
12.12.2017 21:45:55 - "Test Case 'Keywords - details' started"
12.12.2017 21:45:55 - "Test Assertion 'md-iso.f.1: Dataset keyword': PASSED - 0 ms"
12.12.2017 21:45:55 - "Checking URL: 'http://inspire.ec.europa.eu/metadata-codelist/SpatialDataServiceCategory/SpatialDataServiceCategory.en.atom'"
12.12.2017 21:45:55 - "Test Assertion 'md-iso.f.2: Service keyword': PASSED - 24 ms"
12.12.2017 21:45:55 - "Test Assertion 'md-iso.f.3: Keywords in vocabulary grouped': PASSED - 0 ms"
12.12.2017 21:45:55 - "Test Assertion 'md-iso.f.4: Vocabulary information': PASSED - 0 ms"
12.12.2017 21:45:55 - "Test Case 'Keywords - details' finished: PASSED"
12.12.2017 21:45:55 - "Test Case 'Temporal extent' started"
12.12.2017 21:45:55 - "Test Assertion 'md-iso.g.1: Temporal extent': PASSED - 0 ms"
12.12.2017 21:45:55 - "Test Case 'Temporal extent' finished: PASSED"
12.12.2017 21:45:55 - "Test Case 'Temporal extent - details' started"
12.12.2017 21:45:55 - "Test Assertion 'md-iso.h.1: Temporal date': PASSED - 0 ms"
12.12.2017 21:45:55 - "Test Case 'Temporal extent - details' finished: PASSED"
12.12.2017 21:45:55 - "Test Suite 'Conformance class: INSPIRE Profile based on EN ISO 19115 and EN ISO 19119' finished: PASSED_MANUAL"
12.12.2017 21:45:56 - Releasing resources
12.12.2017 21:45:56 - Changed state from INITIALIZED to RUNNING
12.12.2017 21:45:56 - Duration: 5sec
12.12.2017 21:45:56 - TestRun finished
12.12.2017 21:45:56 - Changed state from RUNNING to COMPLETED
