12.12.2017 02:41:05 - Preparing Test Run downloadService_17316219_Geodetick&yacute; a kartografick&yacute; &uacute;stav Bratislava_INSPIRE Download Service - Transport Networks (initiated Tue Dec 12 02:41:05 CET 2017)
12.12.2017 02:41:05 - Resolving Executable Test Suite dependencies
12.12.2017 02:41:05 - Preparing 2 Test Task:
12.12.2017 02:41:05 -  TestTask 1 (23936555-c915-402b-85d4-cd233b4299c8)
12.12.2017 02:41:05 -  will perform tests on Test Object 'INSPIRE Download Service - Transport Networks' by using Executable Test Suite 'WFS 2.0 (OGC 09-025r2/ISO 19142) Conformance Test Suite (EID: 95a1b6fc-2b55-3d43-9502-3b8b605bda10, V: 1.26.0 )'
12.12.2017 02:41:05 -  with parameters: 
12.12.2017 02:41:05 - etf.testcases = *
12.12.2017 02:41:05 -  TestTask 2 (13ccef7a-da1c-4e9e-8730-b7a6e8aae0c4)
12.12.2017 02:41:05 -  will perform tests on Test Object 'INSPIRE Download Service - Transport Networks' by using Executable Test Suite 'Conformance Class: Download Service - Direct WFS (EID: ed2d3501-d700-4ff9-b9bf-070dece8ddbd, V: 1.0.2 )'
12.12.2017 02:41:05 -  with parameters: 
12.12.2017 02:41:05 - etf.testcases = *
12.12.2017 02:41:05 - Test Tasks prepared and ready to be executed. Waiting for the scheduler to start.
12.12.2017 02:41:05 - Setting state to CREATED
12.12.2017 02:41:05 - Changed state from CREATED to INITIALIZING
12.12.2017 02:41:05 - Starting TestRun.b34486a0-374e-4a56-bf77-4f1207aab23b at 2017-12-12T02:41:07+01:00
12.12.2017 02:41:07 - Changed state from INITIALIZING to INITIALIZED
12.12.2017 02:41:07 - TestRunTask initialized
12.12.2017 02:41:07 - Invoking TEAM Engine remotely. This may take a while. Progress messages are not supported.
12.12.2017 02:41:07 - Timeout is set to: 20min
12.12.2017 02:42:44 - Results received.
12.12.2017 02:42:44 - Internal ETS model updated.
12.12.2017 02:42:44 - Transforming results.
12.12.2017 02:42:44 - 11 of 111 assertions passed
12.12.2017 02:42:45 - Releasing resources
12.12.2017 02:42:45 - Project Properties: 
12.12.2017 02:42:45 - etf.testcases - * 
12.12.2017 02:42:45 - serviceEndpoint - https://zbgisws.skgeodesy.sk/inspire_transport_networks_wfs/service.svc/get?ACCEPTVERSIONS=2.0.0&request=GetCapabilities&service=WFS&VERSION=2.0.0 
12.12.2017 02:42:45 - username -  
12.12.2017 02:42:45 - authUser -  
12.12.2017 02:42:45 - authMethod - basic 
12.12.2017 02:42:45 - TestRunTask initialized
12.12.2017 02:42:53 ERROR Service returned an exception: Operation request contains an invalid parameter value.
12.12.2017 02:42:53 ERROR Assertion failed with error 'TR.unexpectedException'
12.12.2017 02:42:53 ERROR Assertion failed with error 'TR.initializationAndBasicChecksFailed'
12.12.2017 02:42:53 ERROR Assertion failed with error 'TR.initializationAndBasicChecksFailed'
12.12.2017 02:42:53 ERROR Assertion failed with error 'TR.initializationAndBasicChecksFailed'
12.12.2017 02:42:53 - Releasing resources
12.12.2017 02:42:53 - Changed state from INITIALIZED to RUNNING
12.12.2017 02:42:53 - Duration: 1min
12.12.2017 02:42:53 - TestRun finished
12.12.2017 02:42:53 - Changed state from RUNNING to COMPLETED
