22.11.2017 22:16:03 - Preparing Test Run downloadService (initiated Wed Nov 22 22:16:03 CET 2017)
22.11.2017 22:16:03 - Resolving Executable Test Suite dependencies
22.11.2017 22:16:03 - Preparing 2 Test Task:
22.11.2017 22:16:03 -  TestTask 1 (43f0df3d-1d82-4375-a39c-33b0b1747d74)
22.11.2017 22:16:03 -  will perform tests on Test Object 'SK_SOP_INSPIRE_Download_Service' by using Executable Test Suite 'WFS 2.0 (OGC 09-025r2/ISO 19142) Conformance Test Suite (EID: 95a1b6fc-2b55-3d43-9502-3b8b605bda10, V: 1.26.0 )'
22.11.2017 22:16:03 -  with parameters: 
22.11.2017 22:16:03 - etf.testcases = *
22.11.2017 22:16:03 -  TestTask 2 (ba6bfb20-5d41-43b4-bf05-bb1a07d82826)
22.11.2017 22:16:03 -  will perform tests on Test Object 'SK_SOP_INSPIRE_Download_Service' by using Executable Test Suite 'Conformance Class: Download Service - Direct WFS (EID: ed2d3501-d700-4ff9-b9bf-070dece8ddbd, V: 1.0.0 )'
22.11.2017 22:16:03 -  with parameters: 
22.11.2017 22:16:03 - etf.testcases = *
22.11.2017 22:16:03 - Test Tasks prepared and ready to be executed. Waiting for the scheduler to start.
22.11.2017 22:16:03 - Setting state to CREATED
22.11.2017 22:16:03 - Changed state from CREATED to INITIALIZING
22.11.2017 22:16:10 - Starting TestRun.a29cc247-4bdb-44e2-ba11-a69030a91bac at 2017-11-22T22:16:11+01:00
22.11.2017 22:16:11 - Changed state from INITIALIZING to INITIALIZED
22.11.2017 22:16:11 - TestRunTask initialized
22.11.2017 22:16:11 - Invoking TEAM Engine remotely. This may take a while. Progress messages are not supported.
22.11.2017 22:16:11 - Timeout is set to: 20min
22.11.2017 22:16:20 - Results received.
22.11.2017 22:16:22 - Internal ETS model updated.
22.11.2017 22:16:22 - Transforming results.
22.11.2017 22:16:22 - 2 of 210 assertions passed
22.11.2017 22:16:24 - Releasing resources
22.11.2017 22:16:24 - Project Properties: 
22.11.2017 22:16:24 - etf.testcases - * 
22.11.2017 22:16:24 - serviceEndpoint - http://inspire.biomonitoring.sk/geoserver/ows?ACCEPTVERSIONS=2.0.0&request=GetCapabilities&service=wfs&VERSION=2.0.0 
22.11.2017 22:16:24 - username -  
22.11.2017 22:16:24 - authUser -  
22.11.2017 22:16:24 - authMethod - basic 
22.11.2017 22:16:24 - TestRunTask initialized
22.11.2017 22:16:30 ERROR Assertion failed with error 'TR.missingElement'
22.11.2017 22:16:30 ERROR Assertion failed with error 'TR.missingElement'
22.11.2017 22:16:30 ERROR Assertion failed with error 'TR.missingElement'
22.11.2017 22:16:30 - Releasing resources
22.11.2017 22:16:30 - Changed state from INITIALIZED to RUNNING
22.11.2017 22:16:31 - Duration: 28sec
22.11.2017 22:16:31 - TestRun finished
22.11.2017 22:16:31 - Changed state from RUNNING to COMPLETED
