31.01.2018 22:51:44 - Preparing Test Run downloadService_17316219_Geodetick&yacute;akartografick&yacute;&uacute;stavBratislava(GK&Uacute;)_INSPIRE Download Service - Administrative Units (initiated Wed Jan 31 22:51:44 CET 2018)
31.01.2018 22:51:44 - Resolving Executable Test Suite dependencies
31.01.2018 22:51:44 - Preparing 2 Test Task:
31.01.2018 22:51:44 -  TestTask 1 (8a2e6116-35cd-4a93-86ca-ef0351e0caee)
31.01.2018 22:51:44 -  will perform tests on Test Object 'INSPIRE Download Service - Administrative Units' by using Executable Test Suite 'WFS 2.0 (OGC 09-025r2/ISO 19142) Conformance Test Suite (EID: 95a1b6fc-2b55-3d43-9502-3b8b605bda10, V: 1.26.0 )'
31.01.2018 22:51:44 -  with parameters: 
31.01.2018 22:51:44 - etf.testcases = *
31.01.2018 22:51:45 -  TestTask 2 (11b88c64-7078-4a09-b021-adfe7a21272d)
31.01.2018 22:51:45 -  will perform tests on Test Object 'INSPIRE Download Service - Administrative Units' by using Executable Test Suite 'Conformance Class: Download Service - Direct WFS (EID: ed2d3501-d700-4ff9-b9bf-070dece8ddbd, V: 1.0.2 )'
31.01.2018 22:51:45 -  with parameters: 
31.01.2018 22:51:45 - etf.testcases = *
31.01.2018 22:51:45 - Test Tasks prepared and ready to be executed. Waiting for the scheduler to start.
31.01.2018 22:51:45 - Setting state to CREATED
31.01.2018 22:51:45 - Changed state from CREATED to INITIALIZING
31.01.2018 22:51:48 - Starting TestRun.c5ea60f7-4085-454b-b0fa-d8d99c56b774 at 2018-01-31T22:51:50+01:00
31.01.2018 22:51:50 - Changed state from INITIALIZING to INITIALIZED
31.01.2018 22:51:50 - TestRunTask initialized
31.01.2018 22:51:50 - Invoking TEAM Engine remotely. This may take a while. Progress messages are not supported.
31.01.2018 22:51:50 - Timeout is set to: 20min
