06.02.2018 23:05:32 - Preparing Test Run interoperability_17316219_Geodetick&yacute;akartografick&yacute;&uacute;stavBratislava_tn-a:SurfaceComposition (initiated Tue Feb 06 23:05:32 CET 2018)
06.02.2018 23:05:32 - Resolving Executable Test Suite dependencies
06.02.2018 23:05:32 - Preparing 11 Test Task:
06.02.2018 23:05:32 -  TestTask 1 (b5784a60-f728-4e40-bd68-a0fae2b3a14a)
06.02.2018 23:05:32 -  will perform tests on Test Object 'get.xml' by using Executable Test Suite 'Conformance class: INSPIRE GML application schemas, General requirements (EID: 09820daf-62b2-4fa3-a95f-56a0d2b7c4d8, V: 0.2.4 )'
06.02.2018 23:05:32 -  with parameters: 
06.02.2018 23:05:32 - etf.testcases = *
06.02.2018 23:05:32 -  TestTask 2 (cd1f17bf-7721-470f-99aa-8678f517a08d)
06.02.2018 23:05:32 -  will perform tests on Test Object 'get.xml' by using Executable Test Suite 'LAZY.9af1c865-1cf0-43ff-9250-069df01b0948'
06.02.2018 23:05:32 -  with parameters: 
06.02.2018 23:05:32 - etf.testcases = *
06.02.2018 23:05:32 -  TestTask 3 (343086e6-2da3-4ddc-9ea4-be32b4eccac6)
06.02.2018 23:05:32 -  will perform tests on Test Object 'get.xml' by using Executable Test Suite 'LAZY.4441cbde-371f-4899-90b3-145f4fd08ebc'
06.02.2018 23:05:32 -  with parameters: 
06.02.2018 23:05:32 - etf.testcases = *
06.02.2018 23:05:32 -  TestTask 4 (e3a92705-4afa-4c7d-bf27-e32d5568958b)
06.02.2018 23:05:32 -  will perform tests on Test Object 'get.xml' by using Executable Test Suite 'Conformance class: Application schema, Air Transport Networks (EID: 6800c834-b4e0-4631-9209-73530fb9ccee, V: 0.2.1 )'
06.02.2018 23:05:32 -  with parameters: 
06.02.2018 23:05:32 - etf.testcases = *
06.02.2018 23:05:32 -  TestTask 5 (f426cf0a-c0a0-4965-931b-cee98bfae574)
06.02.2018 23:05:32 -  will perform tests on Test Object 'get.xml' by using Executable Test Suite 'LAZY.545f9e49-009b-4114-9333-7ca26413b5d4'
06.02.2018 23:05:32 -  with parameters: 
06.02.2018 23:05:32 - etf.testcases = *
06.02.2018 23:05:32 -  TestTask 6 (b5a52d80-ef7a-4f11-ad9a-38e7ddd70dd8)
06.02.2018 23:05:32 -  will perform tests on Test Object 'get.xml' by using Executable Test Suite 'LAZY.61070ae8-13cb-4303-a340-72c8b877b00a'
06.02.2018 23:05:32 -  with parameters: 
06.02.2018 23:05:32 - etf.testcases = *
06.02.2018 23:05:32 -  TestTask 7 (9de404e6-3e1e-4a29-b413-419ff0b04a0a)
06.02.2018 23:05:32 -  will perform tests on Test Object 'get.xml' by using Executable Test Suite 'Conformance class: Data consistency, Transport Networks (EID: 733af9a0-312b-4f71-9aa2-977cd2134d23, V: 0.2.2 )'
06.02.2018 23:05:32 -  with parameters: 
06.02.2018 23:05:32 - etf.testcases = *
06.02.2018 23:05:32 -  TestTask 8 (c4e81666-face-4a2e-9bae-ef1781bd7ae3)
06.02.2018 23:05:32 -  will perform tests on Test Object 'get.xml' by using Executable Test Suite 'LAZY.499937ea-0590-42d2-bd7a-1cafff35ecdb'
06.02.2018 23:05:32 -  with parameters: 
06.02.2018 23:05:32 - etf.testcases = *
06.02.2018 23:05:32 -  TestTask 9 (9a07f3c4-1551-4f1c-bb2e-3ef3dd65e05a)
06.02.2018 23:05:32 -  will perform tests on Test Object 'get.xml' by using Executable Test Suite 'Conformance class: Information accessibility, Transport Networks (EID: df5db9a4-b15f-4193-a6ff-6e9951af46f5, V: 0.2.2 )'
06.02.2018 23:05:32 -  with parameters: 
06.02.2018 23:05:32 - etf.testcases = *
06.02.2018 23:05:32 -  TestTask 10 (9fbdbaf6-79dc-4e42-bc2f-070c644afeca)
06.02.2018 23:05:32 -  will perform tests on Test Object 'get.xml' by using Executable Test Suite 'LAZY.63f586f0-080c-493b-8ca2-9919427440cc'
06.02.2018 23:05:32 -  with parameters: 
06.02.2018 23:05:32 - etf.testcases = *
06.02.2018 23:05:33 -  TestTask 11 (061aac3d-1341-40af-bad9-89a4d3cc395f)
06.02.2018 23:05:33 -  will perform tests on Test Object 'get.xml' by using Executable Test Suite 'Conformance class: Reference systems, Transport Networks (EID: 9d35024d-9dd7-43a9-afff-d5aea5f51595, V: 0.2.0 )'
06.02.2018 23:05:33 -  with parameters: 
06.02.2018 23:05:33 - etf.testcases = *
06.02.2018 23:05:33 - Test Tasks prepared and ready to be executed. Waiting for the scheduler to start.
06.02.2018 23:05:33 - Setting state to CREATED
06.02.2018 23:05:33 - Changed state from CREATED to INITIALIZING
06.02.2018 23:05:33 - Starting TestRun.f6fef3de-d5c8-4010-b551-0f3295676ba4 at 2018-02-06T23:05:35+01:00
06.02.2018 23:05:35 - Changed state from INITIALIZING to INITIALIZED
06.02.2018 23:05:35 - TestRunTask initialized
06.02.2018 23:05:35 - Creating new tests databases to speed up tests.
06.02.2018 23:05:35 - Skipping schema validation because no schema file has been set in the test suite. Data are only checked for well-formedness.
06.02.2018 23:05:35 - Optimizing last database etf-tdb-38cff815-a3de-4dc8-99ca-aabe6be25d8a-0 
06.02.2018 23:05:35 - Import completed
06.02.2018 23:05:38 - Validation ended with 0 error(s)
06.02.2018 23:05:38 - Compiling test script
06.02.2018 23:05:38 - Starting XQuery tests
06.02.2018 23:05:38 - "Testing 1 features"
06.02.2018 23:05:38 - "Indexing features (parsing errors: 0): 0 ms"
06.02.2018 23:05:38 - "Executing Test Suite: /home/tomcat/.etf/projects/ets-repository/data/schemas/ets-schemas-bsxets.xml"
06.02.2018 23:05:38 - "Statistics table: 0 ms"
06.02.2018 23:05:38 - "Test Suite 'Conformance class: INSPIRE GML application schemas, General requirements' started"
06.02.2018 23:05:38 - "Test Case 'Schema' started"
06.02.2018 23:05:38 - "Test Assertion 'gmlas.a.1: Mapping of source data to INSPIRE': PASSED_MANUAL"
06.02.2018 23:05:38 - "Test Assertion 'gmlas.a.2: Modelling of additional spatial object types': PASSED_MANUAL"
06.02.2018 23:05:38 - "Test Case 'Schema' finished: PASSED_MANUAL"
06.02.2018 23:05:38 - "Test Case 'Schema validation' started"
06.02.2018 23:05:38 - "Test Assertion 'gmlas.b.1: xsi:schemaLocation attribute': PASSED - 0 ms"
06.02.2018 23:05:38 - "Validating get.xml"
06.02.2018 23:05:47 - "Duration: 8809 ms. Errors: 0."
06.02.2018 23:05:47 - "Test Assertion 'gmlas.b.2: validate XML documents': PASSED - 8820 ms"
06.02.2018 23:05:47 - "Test Case 'Schema validation' finished: PASSED"
06.02.2018 23:05:47 - "Test Case 'GML model' started"
06.02.2018 23:05:47 - "Test Assertion 'gmlas.c.1: Consistency with the GML model': PASSED - 1 ms"
06.02.2018 23:05:47 - "Test Assertion 'gmlas.c.2: nilReason attributes require xsi:nil=true': PASSED - 0 ms"
06.02.2018 23:05:47 - "Test Assertion 'gmlas.c.3: nilReason values': PASSED - 0 ms"
06.02.2018 23:05:47 - "Test Case 'GML model' finished: PASSED"
06.02.2018 23:05:47 - "Test Case 'Simple features' started"
06.02.2018 23:05:47 - "Test Assertion 'gmlas.d.1: No spatial topology objects': PASSED - 0 ms"
06.02.2018 23:05:47 - "Test Assertion 'gmlas.d.2: No non-linear interpolation': PASSED - 0 ms"
06.02.2018 23:05:47 - "Test Assertion 'gmlas.d.3: Surface geometry elements': PASSED - 1 ms"
06.02.2018 23:05:47 - "Test Assertion 'gmlas.d.4: No non-planar interpolation': PASSED - 0 ms"
06.02.2018 23:05:47 - "Test Assertion 'gmlas.d.5: Geometry elements': PASSED - 0 ms"
06.02.2018 23:05:47 - "Test Assertion 'gmlas.d.6: Point coordinates in gml:pos': PASSED - 0 ms"
06.02.2018 23:05:47 - "Test Assertion 'gmlas.d.7: Curve/Surface coordinates in gml:posList': PASSED - 0 ms"
06.02.2018 23:05:47 - "Test Assertion 'gmlas.d.8: No array property elements': PASSED - 0 ms"
06.02.2018 23:05:47 - "Test Assertion 'gmlas.d.9: 1, 2 or 3 coordinate dimensions': PASSED - 0 ms"
06.02.2018 23:05:47 - "Test Assertion 'gmlas.d.10: Validate geometries (1)': PASSED - 58 ms"
06.02.2018 23:05:47 - "Test Assertion 'gmlas.d.11: Validate geometries (2)': PASSED - 0 ms"
06.02.2018 23:05:47 - "Test Case 'Simple features' finished: PASSED"
06.02.2018 23:05:47 - "Test Case 'Code list values in basic data types' started"
06.02.2018 23:05:47 - "Test Assertion 'gmlas.e.1: GrammaticalNumber attributes': PASSED - 54 ms"
06.02.2018 23:05:47 - "Test Assertion 'gmlas.e.2: GrammaticalGender attributes': PASSED - 11 ms"
06.02.2018 23:05:47 - "Test Assertion 'gmlas.e.3: NameStatus attributes': PASSED - 6 ms"
06.02.2018 23:05:47 - "Test Assertion 'gmlas.e.4: Nativeness attributes': PASSED - 14 ms"
06.02.2018 23:05:47 - "Test Case 'Code list values in basic data types' finished: PASSED"
06.02.2018 23:05:47 - "Test Case 'Constraints' started"
06.02.2018 23:05:47 - "Test Assertion 'gmlas.f.1: At least one of the two attributes pronunciationSoundLink and pronunciationIPA shall not be void': PASSED - 0 ms"
06.02.2018 23:05:47 - "Test Case 'Constraints' finished: PASSED"
06.02.2018 23:05:47 - "Test Suite 'Conformance class: INSPIRE GML application schemas, General requirements' finished: PASSED_MANUAL"
06.02.2018 23:05:48 - Releasing resources
06.02.2018 23:05:48 - TestRunTask initialized
06.02.2018 23:05:48 - Recreating new tests databases as the Test Object has changed!
06.02.2018 23:05:48 - Skipping schema validation because no schema file has been set in the test suite. Data are only checked for well-formedness.
06.02.2018 23:05:48 - Optimizing last database etf-tdb-38cff815-a3de-4dc8-99ca-aabe6be25d8a-0 
06.02.2018 23:05:48 - Import completed
06.02.2018 23:05:48 - Validation ended with 0 error(s)
06.02.2018 23:05:48 - Compiling test script
06.02.2018 23:05:48 - Starting XQuery tests
06.02.2018 23:05:48 - "Testing 1 features"
06.02.2018 23:05:48 - "Indexing features (parsing errors: 0): 0 ms"
06.02.2018 23:05:48 - "Executing Test Suite: /home/tomcat/.etf/projects/ets-repository/data-tn/tn-gml/ets-tn-gml-bsxets.xml"
06.02.2018 23:05:48 - "Statistics table: 0 ms"
06.02.2018 23:05:48 - "Test Suite 'Conformance class: GML application schemas, Transport Networks' started"
06.02.2018 23:05:48 - "Test Case 'Basic test' started"
06.02.2018 23:05:48 - "Test Assertion 'tn-gml.a.1: Transport Network feature in dataset': PASSED - 1 ms"
06.02.2018 23:05:48 - "Test Case 'Basic test' finished: PASSED"
06.02.2018 23:05:48 - "Test Suite 'Conformance class: GML application schemas, Transport Networks' finished: PASSED"
06.02.2018 23:05:48 - Releasing resources
06.02.2018 23:05:48 - TestRunTask initialized
06.02.2018 23:05:48 - Skipping schema validation because no schema file has been set in the test suite. Data are only checked for well-formedness.
06.02.2018 23:05:48 - Validation ended with 0 error(s)
06.02.2018 23:05:48 - Compiling test script
06.02.2018 23:05:48 - Starting XQuery tests
06.02.2018 23:05:48 - "Testing 1 features"
06.02.2018 23:05:48 - "Indexing features (parsing errors: 0): 0 ms"
06.02.2018 23:05:48 - "Executing Test Suite: /home/tomcat/.etf/projects/ets-repository/data-tn/tn-as/ets-tn-as-bsxets.xml"
06.02.2018 23:05:48 - "Statistics table: 1 ms"
06.02.2018 23:05:48 - "Test Suite 'Conformance class: Application schema, Transport Networks Common' started"
06.02.2018 23:05:48 - "Test Case 'Code list values' started"
06.02.2018 23:05:48 - "Test Assertion 'tn-as.a.1: AccessRestrictionValue attributes': PASSED - 6 ms"
06.02.2018 23:05:48 - "Test Assertion 'tn-as.a.2: RestrictionTypeValue attributes': PASSED - 5 ms"
06.02.2018 23:05:48 - "Test Case 'Code list values' finished: PASSED"
06.02.2018 23:05:48 - "Test Case 'Constraints' started"
06.02.2018 23:05:48 - "Test Assertion 'tn-as.b.1: TrafficFlowDirection can only be associated with a spatial object of the type Link or LinkSequence.': PASSED - 0 ms"
06.02.2018 23:05:48 - "Test Assertion 'tn-as.b.2: All transport areas have an external object identifier.': PASSED - 0 ms"
06.02.2018 23:05:48 - "Test Assertion 'tn-as.b.3: All transport links have an external object identifier.': PASSED - 0 ms"
06.02.2018 23:05:48 - "Test Assertion 'tn-as.b.4: All transport link sequences have an external object identifier.': PASSED - 0 ms"
06.02.2018 23:05:48 - "Test Assertion 'tn-as.b.5: All transport link sets have an external object identifier.': PASSED - 0 ms"
06.02.2018 23:05:48 - "Test Assertion 'tn-as.b.6: All transport nodes have an external object identifier.': PASSED - 0 ms"
06.02.2018 23:05:48 - "Test Assertion 'tn-as.b.7: All transport points have an external object identifier.': PASSED - 0 ms"
06.02.2018 23:05:48 - "Test Assertion 'tn-as.b.8: All transport properties have an external object identifier.': PASSED - 0 ms"
06.02.2018 23:05:48 - "Test Assertion 'tn-as.b.9: A transport link sequence must be composed of transport links that all belong to the same transport network.': PASSED - 0 ms"
06.02.2018 23:05:48 - "Test Assertion 'tn-as.b.10: A transport link set must be composed of transport links and or transport link sequences that all belong to the same transport network.': PASSED - 0 ms"
06.02.2018 23:05:48 - "Test Case 'Constraints' finished: PASSED"
06.02.2018 23:05:48 - "Test Case 'Geometry' started"
06.02.2018 23:05:48 - "Test Assertion 'tn-as.c.1: No free transport nodes': PASSED - 1 ms"
06.02.2018 23:05:48 - "Test Assertion 'tn-as.c.2: Intersections only at crossings': PASSED_MANUAL"
06.02.2018 23:05:48 - "Test Case 'Geometry' finished: PASSED_MANUAL"
06.02.2018 23:05:48 - "Test Case 'Network connectivity' started"
06.02.2018 23:05:48 - "Test Assertion 'tn-as.d.1: Connectivity at crossings': PASSED_MANUAL"
06.02.2018 23:05:48 - "Test Assertion 'tn-as.d.2: Unconnected nodes': PASSED_MANUAL"
06.02.2018 23:05:48 - "Test Assertion 'tn-as.d.3: Connectivity tolerance': PASSED_MANUAL"
06.02.2018 23:05:48 - "Test Case 'Network connectivity' finished: PASSED_MANUAL"
06.02.2018 23:05:48 - "Test Case 'Object References' started"
06.02.2018 23:05:48 - "Test Assertion 'tn-as.e.1: Linear references': PASSED_MANUAL"
06.02.2018 23:05:48 - "Test Assertion 'tn-as.e.2: Inter-modal connections': PASSED - 0 ms"
06.02.2018 23:05:48 - "Test Case 'Object References' finished: PASSED_MANUAL"
06.02.2018 23:05:48 - "Test Suite 'Conformance class: Application schema, Transport Networks Common' finished: PASSED_MANUAL"
06.02.2018 23:05:49 - Releasing resources
06.02.2018 23:05:49 - TestRunTask initialized
06.02.2018 23:05:49 - Skipping schema validation because no schema file has been set in the test suite. Data are only checked for well-formedness.
06.02.2018 23:05:49 - Validation ended with 0 error(s)
06.02.2018 23:05:49 - Compiling test script
06.02.2018 23:05:49 - Starting XQuery tests
06.02.2018 23:05:49 - "Testing 1 features"
06.02.2018 23:05:49 - "Executing Test Suite: /home/tomcat/.etf/projects/ets-repository/data-tn/tn-a-as/ets-tn-a-as-bsxets.xml"
06.02.2018 23:05:49 - "Statistics table: 0 ms"
06.02.2018 23:05:49 - "Test Suite 'Conformance class: Application schema, Air Transport Networks' started"
06.02.2018 23:05:49 - "Test Case 'Code list values' started"
06.02.2018 23:05:49 - "Test Assertion 'tn-a-as.a.1: AerodromeCategoryValue attributes': PASSED - 5 ms"
06.02.2018 23:05:49 - "Test Assertion 'tn-a-as.a.2: AerodromeTypeValue attributes': PASSED - 5 ms"
06.02.2018 23:05:49 - "Test Assertion 'tn-a-as.a.3: AirRouteLinkClassValue attributes': PASSED - 4 ms"
06.02.2018 23:05:49 - "Test Assertion 'tn-a-as.a.4: AirRouteTypeValue attributes': PASSED - 4 ms"
06.02.2018 23:05:49 - "Test Assertion 'tn-a-as.a.5: AirUseRestrictionValue attributes': PASSED - 3 ms"
06.02.2018 23:05:49 - "Test Assertion 'tn-a-as.a.6: AirspaceAreaTypeValue attributes': PASSED - 5 ms"
06.02.2018 23:05:49 - "Test Assertion 'tn-a-as.a.7: NavaidTypeValue attributes': PASSED - 5 ms"
06.02.2018 23:05:49 - "Test Assertion 'tn-a-as.a.8: PointRoleValue attributes': PASSED - 4 ms"
06.02.2018 23:05:49 - "Test Assertion 'tn-a-as.a.9: RunwayTypeValue attributes': PASSED - 4 ms"
06.02.2018 23:05:49 - "Test Assertion 'tn-a-as.a.10: SurfaceCompositionValue attributes': PASSED - 4 ms"
06.02.2018 23:05:49 - "Test Case 'Code list values' finished: PASSED"
06.02.2018 23:05:49 - "Test Case 'Constraints' started"
06.02.2018 23:05:49 - "Test Assertion 'tn-a-as.b.1: AerodromeCategory can only be associated with a spatial object that is an Aerodrome Node or an Aerodrome Area.': PASSED - 0 ms"
06.02.2018 23:05:49 - "Test Assertion 'tn-a-as.b.2: AerodromeType can only be associated with a spatial object that is an Aerodrome Node or an Aerodrome Area.': PASSED - 0 ms"
06.02.2018 23:05:49 - "Test Assertion 'tn-a-as.b.3: ConditionOfAirFacility can only be associated with a spatial object that is an Aerodrome Node, an Aerodrome Area or a Runway Area.': PASSED - 0 ms"
06.02.2018 23:05:49 - "Test Assertion 'tn-a-as.b.4: ElementLength can only be associated with a spatial object that is an a Runway Area, Taxiway Area or Touch Down Lift Off.': PASSED - 0 ms"
06.02.2018 23:05:49 - "Test Assertion 'tn-a-as.b.5: ElementWidth can only be associated with a spatial object that is a Runway Area, Taxiway Area or Touch Down Lift Off.': PASSED - 0 ms"
06.02.2018 23:05:49 - "Test Assertion 'tn-a-as.b.6: FieldElevation can only be associated with a spatial object that is an Aerodrome Node or an Aerodrome Area.': PASSED - 0 ms"
06.02.2018 23:05:49 - "Test Assertion 'tn-a-as.b.7: LowerAltitudeLimit can only be associated with a spatial object that is an Air Route Link or Airspace Area.': PASSED - 0 ms"
06.02.2018 23:05:49 - "Checking URL: 'https://zbgisws.skgeodesy.sk/inspire_transport_networks_wfs/service.svc/get?SERVICE=WFS&amp;VERSION=2.0.0&amp;REQUEST=GetFeature&amp;STOREDQUERY_ID=urn:ogc:def:query:OGC-WFS::GetFeatureById&amp;id=netElementS.500000'"
06.02.2018 23:06:19 - "Exception: Timeout exceeded. URL: https://zbgisws.skgeodesy.sk/inspire_transport_networks_wfs/service.svc/get?SERVICE=WFS&amp;VERSION=2.0.0&amp;REQUEST=GetFeature&amp;STOREDQUERY_ID=urn:ogc:def:query:OGC-WFS::GetFeatureById&amp;id=netElementS.500000"
06.02.2018 23:06:19 - "Test Assertion 'tn-a-as.b.8: SurfaceComposition can only be associated with a spatial object that is a Runway Area, Taxiway Area, Apron Area or Touch Down Lift Off.': FAILED - 30114 ms"
06.02.2018 23:06:19 - "Test Assertion 'tn-a-as.b.9: UpperAltitudeLimit can only be associated with a spatial object that is an Air Route Link or Airspace Area.': PASSED - 0 ms"
06.02.2018 23:06:19 - "Test Assertion 'tn-a-as.b.10: UseRestriction can only be associated with a spatial object that is an Air Route, Air Link (or specialized Air Link), Air Node (or specialized Air Node) or Aerodrome Area.': PASSED - 0 ms"
06.02.2018 23:06:19 - "Test Case 'Constraints' finished: FAILED"
06.02.2018 23:06:19 - "Test Suite 'Conformance class: Application schema, Air Transport Networks' finished: FAILED"
06.02.2018 23:06:19 - Releasing resources
06.02.2018 23:06:19 - TestRunTask initialized
06.02.2018 23:06:19 - Skipping schema validation because no schema file has been set in the test suite. Data are only checked for well-formedness.
06.02.2018 23:06:19 - Validation ended with 0 error(s)
06.02.2018 23:06:19 - Compiling test script
06.02.2018 23:06:19 - Starting XQuery tests
06.02.2018 23:06:19 - "Testing 1 features"
06.02.2018 23:06:19 - "Executing Test Suite: /home/tomcat/.etf/projects/ets-repository/data-encoding/inspire-gml/ets-inspire-gml-bsxets.xml"
06.02.2018 23:06:19 - "Statistics table: 0 ms"
06.02.2018 23:06:19 - "Test Suite 'Conformance class: INSPIRE GML encoding' started"
06.02.2018 23:06:19 - "Test Case 'Basic tests' started"
06.02.2018 23:06:19 - "Test Assertion 'gml.a.1: Errors loading the XML documents': PASSED - 0 ms"
06.02.2018 23:06:19 - "Test Assertion 'gml.a.2: Document root element': PASSED - 0 ms"
06.02.2018 23:06:19 - "Test Assertion 'gml.a.3: Character encoding': NOT_APPLICABLE"
06.02.2018 23:06:19 - "Test Case 'Basic tests' finished: PASSED"
06.02.2018 23:06:19 - "Test Suite 'Conformance class: INSPIRE GML encoding' finished: PASSED"
06.02.2018 23:06:19 - Releasing resources
06.02.2018 23:06:19 - TestRunTask initialized
06.02.2018 23:06:19 - Skipping schema validation because no schema file has been set in the test suite. Data are only checked for well-formedness.
06.02.2018 23:06:19 - Validation ended with 0 error(s)
06.02.2018 23:06:19 - Compiling test script
06.02.2018 23:06:19 - Starting XQuery tests
06.02.2018 23:06:20 - "Testing 1 features"
06.02.2018 23:06:20 - "Indexing features (parsing errors: 0): 0 ms"
06.02.2018 23:06:20 - "Executing Test Suite: /home/tomcat/.etf/projects/ets-repository/data/data-consistency/ets-data-consistency-bsxets.xml"
06.02.2018 23:06:20 - "Statistics table: 1 ms"
06.02.2018 23:06:20 - "Test Suite 'Conformance class: Data consistency, General requirements' started"
06.02.2018 23:06:20 - "Test Case 'Version consistency' started"
06.02.2018 23:06:20 - "Test Assertion 'dc.a.1: Version lifespan plausible': PASSED - 0 ms"
06.02.2018 23:06:20 - "Test Assertion 'dc.a.2: Unique identifier persistency': PASSED_MANUAL"
06.02.2018 23:06:20 - "Test Assertion 'dc.a.3: Spatial object type stable': PASSED_MANUAL"
06.02.2018 23:06:20 - "Test Case 'Version consistency' finished: PASSED_MANUAL"
06.02.2018 23:06:20 - "Test Case 'Temporal consistency' started"
06.02.2018 23:06:20 - "Test Assertion 'dc.b.1: Valid time plausible': PASSED - 0 ms"
06.02.2018 23:06:20 - "Test Case 'Temporal consistency' finished: PASSED"
06.02.2018 23:06:20 - "Test Suite 'Conformance class: Data consistency, General requirements' finished: PASSED_MANUAL"
06.02.2018 23:06:20 - Releasing resources
06.02.2018 23:06:20 - TestRunTask initialized
06.02.2018 23:06:20 - Skipping schema validation because no schema file has been set in the test suite. Data are only checked for well-formedness.
06.02.2018 23:06:20 - Validation ended with 0 error(s)
06.02.2018 23:06:20 - Compiling test script
06.02.2018 23:06:20 - Starting XQuery tests
06.02.2018 23:06:20 - "Testing 1 features"
06.02.2018 23:06:20 - "Indexing features (parsing errors: 0): 0 ms"
06.02.2018 23:06:20 - "Executing Test Suite: /home/tomcat/.etf/projects/ets-repository/data-tn/tn-dc/ets-tn-dc-bsxets.xml"
06.02.2018 23:06:20 - "Statistics table: 0 ms"
06.02.2018 23:06:20 - "Test Suite 'Conformance class: Data consistency, Transport Networks' started"
06.02.2018 23:06:20 - "Test Case 'Spatial consistency' started"
06.02.2018 23:06:20 - "Test Assertion 'tn-dc.a.1: Each Transport Network Link or Node geometry is within a Network Area geometry (Road Transport Networks)': PASSED - 0 ms"
06.02.2018 23:06:20 - "Test Assertion 'tn-dc.a.2: Each Transport Network Link or Node geometry is within a Network Area geometry (Railway Transport Networks)': PASSED - 0 ms"
06.02.2018 23:06:20 - "Test Assertion 'tn-dc.a.3: Each Transport Network Link or Node geometry is within a Network Area geometry (Waterway Transport Networks)': PASSED - 0 ms"
06.02.2018 23:06:20 - "Test Assertion 'tn-dc.a.4: Each Transport Network Link or Node geometry is within a Network Area geometry (Air Transport Networks)': PASSED - 0 ms"
06.02.2018 23:06:20 - "Test Assertion 'tn-dc.a.5: Manual review': PASSED_MANUAL"
06.02.2018 23:06:20 - "Test Case 'Spatial consistency' finished: PASSED_MANUAL"
06.02.2018 23:06:20 - "Test Suite 'Conformance class: Data consistency, Transport Networks' finished: PASSED_MANUAL"
06.02.2018 23:06:20 - Releasing resources
06.02.2018 23:06:20 - TestRunTask initialized
06.02.2018 23:06:20 - Skipping schema validation because no schema file has been set in the test suite. Data are only checked for well-formedness.
06.02.2018 23:06:20 - Validation ended with 0 error(s)
06.02.2018 23:06:20 - Compiling test script
06.02.2018 23:06:20 - Starting XQuery tests
06.02.2018 23:06:20 - "Testing 1 features"
06.02.2018 23:06:20 - "Indexing features (parsing errors: 0): 0 ms"
06.02.2018 23:06:20 - "Executing Test Suite: /home/tomcat/.etf/projects/ets-repository/data/information-accessibility/ets-information-accessibility-bsxets.xml"
06.02.2018 23:06:20 - "Statistics table: 0 ms"
06.02.2018 23:06:20 - "Test Suite 'Conformance class: Information accessibility, General requirements' started"
06.02.2018 23:06:20 - "Test Case 'Coordinate reference systems (CRS)' started"
06.02.2018 23:06:20 - "Test Assertion 'ia.a.1: CRS publicly accessible via HTTP': PASSED - 0 ms"
06.02.2018 23:06:20 - "Test Case 'Coordinate reference systems (CRS)' finished: PASSED"
06.02.2018 23:06:20 - "Test Suite 'Conformance class: Information accessibility, General requirements' finished: PASSED"
06.02.2018 23:06:20 - Releasing resources
06.02.2018 23:06:20 - TestRunTask initialized
06.02.2018 23:06:20 - Skipping schema validation because no schema file has been set in the test suite. Data are only checked for well-formedness.
06.02.2018 23:06:20 - Validation ended with 0 error(s)
06.02.2018 23:06:20 - Compiling test script
06.02.2018 23:06:20 - Starting XQuery tests
06.02.2018 23:06:20 - "Testing 1 features"
06.02.2018 23:06:20 - "Executing Test Suite: /home/tomcat/.etf/projects/ets-repository/data-tn/tn-ia/ets-tn-ia-bsxets.xml"
06.02.2018 23:06:20 - "Statistics table: 0 ms"
06.02.2018 23:06:20 - "Test Suite 'Conformance class: Information accessibility, Transport Networks' started"
06.02.2018 23:06:20 - "Test Case 'Code lists' started"
06.02.2018 23:06:20 - "Test Assertion 'tn-ia.a.1: Code list extensions accessible': PASSED - 0 ms"
06.02.2018 23:06:20 - "Test Case 'Code lists' finished: PASSED"
06.02.2018 23:06:20 - "Test Case 'Feature references' started"
06.02.2018 23:06:20 - "Test Assertion 'tn-ia.b.1: MarkerPost.route': PASSED - 0 ms"
06.02.2018 23:06:20 - "Test Assertion 'tn-ia.b.2: TransportLinkSet.post': PASSED - 0 ms"
06.02.2018 23:06:20 - "Test Case 'Feature references' finished: PASSED"
06.02.2018 23:06:20 - "Test Suite 'Conformance class: Information accessibility, Transport Networks' finished: PASSED"
06.02.2018 23:06:20 - Releasing resources
06.02.2018 23:06:20 - TestRunTask initialized
06.02.2018 23:06:20 - Skipping schema validation because no schema file has been set in the test suite. Data are only checked for well-formedness.
06.02.2018 23:06:20 - Validation ended with 0 error(s)
06.02.2018 23:06:20 - Compiling test script
06.02.2018 23:06:20 - Starting XQuery tests
06.02.2018 23:06:20 - "Testing 1 features"
06.02.2018 23:06:20 - "Indexing features (parsing errors: 0): 0 ms"
06.02.2018 23:06:20 - "Executing Test Suite: /home/tomcat/.etf/projects/ets-repository/data/reference-systems/ets-reference-systems-bsxets.xml"
06.02.2018 23:06:20 - "Statistics table: 0 ms"
06.02.2018 23:06:20 - "Test Suite 'Conformance class: Reference systems, General requirements' started"
06.02.2018 23:06:20 - "Test Case 'Spatial reference systems' started"
06.02.2018 23:06:20 - "Test Assertion 'rs.a.1: Spatial reference systems in feature geometries': PASSED - 0 ms"
06.02.2018 23:06:20 - "Test Assertion 'rs.a.2: Default spatial reference systems in feature collections': PASSED - 0 ms"
06.02.2018 23:06:20 - "Test Case 'Spatial reference systems' finished: PASSED"
06.02.2018 23:06:20 - "Test Case 'Temporal reference systems' started"
06.02.2018 23:06:20 - "Test Assertion 'rs.a.3: Temporal reference systems in features': PASSED - 0 ms"
06.02.2018 23:06:20 - "Test Case 'Temporal reference systems' finished: PASSED"
06.02.2018 23:06:20 - "Test Suite 'Conformance class: Reference systems, General requirements' finished: PASSED"
06.02.2018 23:06:21 - Releasing resources
06.02.2018 23:06:21 - TestRunTask initialized
06.02.2018 23:06:21 - Skipping schema validation because no schema file has been set in the test suite. Data are only checked for well-formedness.
06.02.2018 23:06:21 - Validation ended with 0 error(s)
06.02.2018 23:06:21 - Compiling test script
06.02.2018 23:06:21 - Starting XQuery tests
06.02.2018 23:06:21 - "Testing 1 features"
06.02.2018 23:06:21 - "Executing Test Suite: /home/tomcat/.etf/projects/ets-repository/data-tn/tn-rs/ets-tn-rs-bsxets.xml"
06.02.2018 23:06:21 - "Statistics table: 1 ms"
06.02.2018 23:06:21 - "Test Suite 'Conformance class: Reference systems, Transport Networks' started"
06.02.2018 23:06:21 - "Test Case 'Additional theme-specific rules for reference systems' started"
06.02.2018 23:06:21 - "Test Assertion 'tn-rs.a.1: Test always passes': PASSED - 0 ms"
06.02.2018 23:06:21 - "Test Case 'Additional theme-specific rules for reference systems' finished: PASSED"
06.02.2018 23:06:21 - "Test Suite 'Conformance class: Reference systems, Transport Networks' finished: PASSED"
06.02.2018 23:06:21 - Releasing resources
06.02.2018 23:06:21 - Changed state from INITIALIZED to RUNNING
06.02.2018 23:06:21 - Duration: 48sec
06.02.2018 23:06:21 - TestRun finished
06.02.2018 23:06:21 - Changed state from RUNNING to COMPLETED
