15.11.2017 23:14:44 - Preparing Test Run tn-ra:RailwayStationArea (initiated Wed Nov 15 23:14:44 CET 2017)
15.11.2017 23:14:44 - Resolving Executable Test Suite dependencies
15.11.2017 23:14:44 - Preparing 11 Test Task:
15.11.2017 23:14:44 -  TestTask 1 (1fe95890-3dd9-4aba-8136-2203580a5398)
15.11.2017 23:14:44 -  will perform tests on Test Object 'get.xml' by using Executable Test Suite 'LAZY.545f9e49-009b-4114-9333-7ca26413b5d4'
15.11.2017 23:14:44 -  with parameters: 
15.11.2017 23:14:44 - etf.testcases = *
15.11.2017 23:14:44 -  TestTask 2 (58b0d2e0-0e4a-4e62-938a-3a9c3890d870)
15.11.2017 23:14:44 -  will perform tests on Test Object 'get.xml' by using Executable Test Suite 'LAZY.09820daf-62b2-4fa3-a95f-56a0d2b7c4d8'
15.11.2017 23:14:44 -  with parameters: 
15.11.2017 23:14:44 - etf.testcases = *
15.11.2017 23:14:44 -  TestTask 3 (f8728a99-5a61-478c-a49d-4a235af2d10b)
15.11.2017 23:14:44 -  will perform tests on Test Object 'get.xml' by using Executable Test Suite 'LAZY.9af1c865-1cf0-43ff-9250-069df01b0948'
15.11.2017 23:14:44 -  with parameters: 
15.11.2017 23:14:44 - etf.testcases = *
15.11.2017 23:14:44 -  TestTask 4 (a1bd9304-013f-42fd-a128-0c0cccea0792)
15.11.2017 23:14:44 -  will perform tests on Test Object 'get.xml' by using Executable Test Suite 'LAZY.4441cbde-371f-4899-90b3-145f4fd08ebc'
15.11.2017 23:14:44 -  with parameters: 
15.11.2017 23:14:44 - etf.testcases = *
15.11.2017 23:14:44 -  TestTask 5 (2797f171-918e-40d1-9973-395bc3aef6a9)
15.11.2017 23:14:44 -  will perform tests on Test Object 'get.xml' by using Executable Test Suite 'Conformance class: Application schema, Rail Transport Networks (EID: e2610a9f-6432-489d-8238-92b1193e7a3d, V: 0.2.1 )'
15.11.2017 23:14:44 -  with parameters: 
15.11.2017 23:14:44 - etf.testcases = *
15.11.2017 23:14:44 -  TestTask 6 (4463d67c-172c-4fd0-bafe-7dd747bfddd4)
15.11.2017 23:14:44 -  will perform tests on Test Object 'get.xml' by using Executable Test Suite 'LAZY.61070ae8-13cb-4303-a340-72c8b877b00a'
15.11.2017 23:14:44 -  with parameters: 
15.11.2017 23:14:44 - etf.testcases = *
15.11.2017 23:14:44 -  TestTask 7 (1fa2a9df-b4d5-4fd2-a105-ac81a0d9f000)
15.11.2017 23:14:44 -  will perform tests on Test Object 'get.xml' by using Executable Test Suite 'Conformance class: Data consistency, Transport Networks (EID: 733af9a0-312b-4f71-9aa2-977cd2134d23, V: 0.2.2 )'
15.11.2017 23:14:44 -  with parameters: 
15.11.2017 23:14:44 - etf.testcases = *
15.11.2017 23:14:44 -  TestTask 8 (a517a4aa-37a1-45e1-8fa8-55c59dd89e4a)
15.11.2017 23:14:44 -  will perform tests on Test Object 'get.xml' by using Executable Test Suite 'LAZY.499937ea-0590-42d2-bd7a-1cafff35ecdb'
15.11.2017 23:14:44 -  with parameters: 
15.11.2017 23:14:44 - etf.testcases = *
15.11.2017 23:14:44 -  TestTask 9 (1973080b-087f-46f3-85b4-ccc384e24839)
15.11.2017 23:14:44 -  will perform tests on Test Object 'get.xml' by using Executable Test Suite 'Conformance class: Information accessibility, Transport Networks (EID: df5db9a4-b15f-4193-a6ff-6e9951af46f5, V: 0.2.1 )'
15.11.2017 23:14:44 -  with parameters: 
15.11.2017 23:14:44 - etf.testcases = *
15.11.2017 23:14:44 -  TestTask 10 (d9072046-a87b-487d-9cc9-79e2ad97c021)
15.11.2017 23:14:44 -  will perform tests on Test Object 'get.xml' by using Executable Test Suite 'LAZY.63f586f0-080c-493b-8ca2-9919427440cc'
15.11.2017 23:14:44 -  with parameters: 
15.11.2017 23:14:44 - etf.testcases = *
15.11.2017 23:14:44 -  TestTask 11 (70c93f63-745e-4a09-9838-d82e5105481a)
15.11.2017 23:14:44 -  will perform tests on Test Object 'get.xml' by using Executable Test Suite 'Conformance class: Reference systems, Transport Networks (EID: 9d35024d-9dd7-43a9-afff-d5aea5f51595, V: 0.2.0 )'
15.11.2017 23:14:44 -  with parameters: 
15.11.2017 23:14:44 - etf.testcases = *
15.11.2017 23:14:44 - Test Tasks prepared and ready to be executed. Waiting for the scheduler to start.
15.11.2017 23:14:44 - Setting state to CREATED
15.11.2017 23:14:44 - Changed state from CREATED to INITIALIZING
15.11.2017 23:14:45 - Starting TestRun.59de0c22-3f50-48b4-96b6-bc6dd0b3271c at 2017-11-15T23:14:46+01:00
15.11.2017 23:14:46 - Changed state from INITIALIZING to INITIALIZED
15.11.2017 23:14:46 - TestRunTask initialized
15.11.2017 23:14:46 - Creating new tests databases to speed up tests.
15.11.2017 23:14:46 - Skipping schema validation because no schema file has been set in the test suite. Data are only checked for well-formedness.
15.11.2017 23:14:46 - Optimizing last database etf-tdb-27a562f5-973f-41fd-b77b-cfef34643fe4-0 
15.11.2017 23:14:46 - Import completed
15.11.2017 23:14:47 - Validation ended with 0 error(s)
15.11.2017 23:14:47 - Compiling test script
15.11.2017 23:14:47 - Starting XQuery tests
15.11.2017 23:14:47 - "Testing 1 features"
15.11.2017 23:14:47 - "Executing Test Suite: /home/tomcat/.etf/projects/ets-repository/data-encoding/inspire-gml/ets-inspire-gml-bsxets.xml"
15.11.2017 23:14:47 - "Statistics table: 0 ms"
15.11.2017 23:14:47 - "Test Suite 'Conformance class: INSPIRE GML encoding' started"
15.11.2017 23:14:47 - "Test Case 'Basic tests' started"
15.11.2017 23:14:47 - "Test Assertion 'gml.a.1: Errors loading the XML documents': PASSED - 0 ms"
15.11.2017 23:14:47 - "Test Assertion 'gml.a.2: Document root element': PASSED - 0 ms"
15.11.2017 23:14:47 - "Test Assertion 'gml.a.3: Character encoding': NOT_APPLICABLE"
15.11.2017 23:14:47 - "Test Case 'Basic tests' finished: PASSED"
15.11.2017 23:14:47 - "Test Suite 'Conformance class: INSPIRE GML encoding' finished: PASSED"
15.11.2017 23:14:48 - Releasing resources
15.11.2017 23:14:48 - TestRunTask initialized
15.11.2017 23:14:48 - Recreating new tests databases as the Test Object has changed!
15.11.2017 23:14:48 - Skipping schema validation because no schema file has been set in the test suite. Data are only checked for well-formedness.
15.11.2017 23:14:48 - Optimizing last database etf-tdb-27a562f5-973f-41fd-b77b-cfef34643fe4-0 
15.11.2017 23:14:48 - Import completed
15.11.2017 23:14:48 - Validation ended with 0 error(s)
15.11.2017 23:14:48 - Compiling test script
15.11.2017 23:14:48 - Starting XQuery tests
15.11.2017 23:14:48 - "Testing 1 features"
15.11.2017 23:14:48 - "Indexing features (parsing errors: 0): 185 ms"
15.11.2017 23:14:48 - "Executing Test Suite: /home/tomcat/.etf/projects/ets-repository/data/schemas/ets-schemas-bsxets.xml"
15.11.2017 23:14:48 - "Statistics table: 0 ms"
15.11.2017 23:14:48 - "Test Suite 'Conformance class: INSPIRE GML application schemas, General requirements' started"
15.11.2017 23:14:48 - "Test Case 'Schema' started"
15.11.2017 23:14:48 - "Test Assertion 'gmlas.a.1: Mapping of source data to INSPIRE': PASSED_MANUAL"
15.11.2017 23:14:48 - "Test Assertion 'gmlas.a.2: Modelling of additional spatial object types': PASSED_MANUAL"
15.11.2017 23:14:48 - "Test Case 'Schema' finished: PASSED_MANUAL"
15.11.2017 23:14:48 - "Test Case 'Schema validation' started"
15.11.2017 23:14:48 - "Test Assertion 'gmlas.b.1: xsi:schemaLocation attribute': PASSED - 0 ms"
15.11.2017 23:14:48 - "Validating get.xml"
15.11.2017 23:15:49 - "Duration: 60557 ms. Errors: 0."
15.11.2017 23:15:49 - "Test Assertion 'gmlas.b.2: validate XML documents': PASSED - 60558 ms"
15.11.2017 23:15:49 - "Test Case 'Schema validation' finished: PASSED"
15.11.2017 23:15:49 - "Test Case 'GML model' started"
15.11.2017 23:15:49 - "Test Assertion 'gmlas.c.1: Consistency with the GML model': PASSED - 0 ms"
15.11.2017 23:15:49 - "Test Assertion 'gmlas.c.2: nilReason attributes require xsi:nil=true': PASSED - 0 ms"
15.11.2017 23:15:49 - "Test Assertion 'gmlas.c.3: nilReason values': PASSED - 0 ms"
15.11.2017 23:15:49 - "Test Case 'GML model' finished: PASSED"
15.11.2017 23:15:49 - "Test Case 'Simple features' started"
15.11.2017 23:15:49 - "Test Assertion 'gmlas.d.1: No spatial topology objects': PASSED - 0 ms"
15.11.2017 23:15:49 - "Test Assertion 'gmlas.d.2: No non-linear interpolation': PASSED - 1 ms"
15.11.2017 23:15:49 - "Test Assertion 'gmlas.d.3: Surface geometry elements': PASSED - 0 ms"
15.11.2017 23:15:49 - "Test Assertion 'gmlas.d.4: No non-planar interpolation': PASSED - 0 ms"
15.11.2017 23:15:49 - "Test Assertion 'gmlas.d.5: Geometry elements': PASSED - 1 ms"
15.11.2017 23:15:49 - "Test Assertion 'gmlas.d.6: Point coordinates in gml:pos': PASSED - 0 ms"
15.11.2017 23:15:49 - "Test Assertion 'gmlas.d.7: Curve/Surface coordinates in gml:posList': PASSED - 0 ms"
15.11.2017 23:15:49 - "Test Assertion 'gmlas.d.8: No array property elements': PASSED - 1 ms"
15.11.2017 23:15:49 - "Test Assertion 'gmlas.d.9: 1, 2 or 3 coordinate dimensions': PASSED - 0 ms"
15.11.2017 23:15:49 - "Test Assertion 'gmlas.d.10: Validate geometries (1)': PASSED - 196 ms"
15.11.2017 23:15:49 - "Test Assertion 'gmlas.d.11: Validate geometries (2)': PASSED - 0 ms"
15.11.2017 23:15:49 - "Test Case 'Simple features' finished: PASSED"
15.11.2017 23:15:49 - "Test Case 'Code list values in basic data types' started"
15.11.2017 23:15:49 - "Test Assertion 'gmlas.e.1: GrammaticalNumber attributes': PASSED - 9 ms"
15.11.2017 23:15:49 - "Test Assertion 'gmlas.e.2: GrammaticalGender attributes': PASSED - 4 ms"
15.11.2017 23:15:49 - "Test Assertion 'gmlas.e.3: NameStatus attributes': PASSED - 4 ms"
15.11.2017 23:15:49 - "Test Assertion 'gmlas.e.4: Nativeness attributes': PASSED - 4 ms"
15.11.2017 23:15:49 - "Test Case 'Code list values in basic data types' finished: PASSED"
15.11.2017 23:15:49 - "Test Case 'Constraints' started"
15.11.2017 23:15:49 - "Test Assertion 'gmlas.f.1: At least one of the two attributes pronunciationSoundLink and pronunciationIPA shall not be void': PASSED - 0 ms"
15.11.2017 23:15:49 - "Test Case 'Constraints' finished: PASSED"
15.11.2017 23:15:49 - "Test Suite 'Conformance class: INSPIRE GML application schemas, General requirements' finished: PASSED_MANUAL"
15.11.2017 23:15:49 - Releasing resources
15.11.2017 23:15:49 - TestRunTask initialized
15.11.2017 23:15:49 - Skipping schema validation because no schema file has been set in the test suite. Data are only checked for well-formedness.
15.11.2017 23:15:49 - Validation ended with 0 error(s)
15.11.2017 23:15:49 - Compiling test script
15.11.2017 23:15:49 - Starting XQuery tests
15.11.2017 23:15:49 - "Testing 1 features"
15.11.2017 23:15:50 - "Indexing features (parsing errors: 0): 136 ms"
15.11.2017 23:15:50 - "Executing Test Suite: /home/tomcat/.etf/projects/ets-repository/data-tn/tn-gml/ets-tn-gml-bsxets.xml"
15.11.2017 23:15:50 - "Statistics table: 0 ms"
15.11.2017 23:15:50 - "Test Suite 'Conformance class: GML application schemas, Transport Networks' started"
15.11.2017 23:15:50 - "Test Case 'Basic test' started"
15.11.2017 23:15:50 - "Test Assertion 'tn-gml.a.1: Transport Network feature in dataset': PASSED - 0 ms"
15.11.2017 23:15:50 - "Test Case 'Basic test' finished: PASSED"
15.11.2017 23:15:50 - "Test Suite 'Conformance class: GML application schemas, Transport Networks' finished: PASSED"
15.11.2017 23:15:50 - Releasing resources
15.11.2017 23:15:50 - TestRunTask initialized
15.11.2017 23:15:50 - Skipping schema validation because no schema file has been set in the test suite. Data are only checked for well-formedness.
15.11.2017 23:15:50 - Validation ended with 0 error(s)
15.11.2017 23:15:50 - Compiling test script
15.11.2017 23:15:50 - Starting XQuery tests
15.11.2017 23:15:50 - "Testing 1 features"
15.11.2017 23:15:50 - "Indexing features (parsing errors: 0): 135 ms"
15.11.2017 23:15:50 - "Executing Test Suite: /home/tomcat/.etf/projects/ets-repository/data-tn/tn-as/ets-tn-as-bsxets.xml"
15.11.2017 23:15:50 - "Statistics table: 1 ms"
15.11.2017 23:15:50 - "Test Suite 'Conformance class: Application schema, Transport Networks Common' started"
15.11.2017 23:15:50 - "Test Case 'Code list values' started"
15.11.2017 23:15:50 - "Test Assertion 'tn-as.a.1: AccessRestrictionValue attributes': PASSED - 6 ms"
15.11.2017 23:15:50 - "Test Assertion 'tn-as.a.2: RestrictionTypeValue attributes': PASSED - 5 ms"
15.11.2017 23:15:50 - "Test Case 'Code list values' finished: PASSED"
15.11.2017 23:15:50 - "Test Case 'Constraints' started"
15.11.2017 23:15:50 - "Test Assertion 'tn-as.b.1: TrafficFlowDirection can only be associated with a spatial object of the type Link or LinkSequence.': PASSED - 0 ms"
15.11.2017 23:15:50 - "Test Assertion 'tn-as.b.2: All transport areas have an external object identifier.': PASSED - 0 ms"
15.11.2017 23:15:50 - "Test Assertion 'tn-as.b.3: All transport links have an external object identifier.': PASSED - 0 ms"
15.11.2017 23:15:50 - "Test Assertion 'tn-as.b.4: All transport link sequences have an external object identifier.': PASSED - 0 ms"
15.11.2017 23:15:50 - "Test Assertion 'tn-as.b.5: All transport link sets have an external object identifier.': PASSED - 0 ms"
15.11.2017 23:15:50 - "Test Assertion 'tn-as.b.6: All transport nodes have an external object identifier.': PASSED - 1 ms"
15.11.2017 23:15:50 - "Test Assertion 'tn-as.b.7: All transport points have an external object identifier.': PASSED - 0 ms"
15.11.2017 23:15:50 - "Test Assertion 'tn-as.b.8: All transport properties have an external object identifier.': PASSED - 0 ms"
15.11.2017 23:15:50 - "Test Assertion 'tn-as.b.9: A transport link sequence must be composed of transport links that all belong to the same transport network.': PASSED - 1 ms"
15.11.2017 23:15:50 - "Test Assertion 'tn-as.b.10: A transport link set must be composed of transport links and or transport link sequences that all belong to the same transport network.': PASSED - 0 ms"
15.11.2017 23:15:50 - "Test Case 'Constraints' finished: PASSED"
15.11.2017 23:15:50 - "Test Case 'Geometry' started"
15.11.2017 23:15:50 - "Test Assertion 'tn-as.c.1: No free transport nodes': PASSED - 0 ms"
15.11.2017 23:15:50 - "Test Assertion 'tn-as.c.2: Intersections only at crossings': PASSED_MANUAL"
15.11.2017 23:15:50 - "Test Case 'Geometry' finished: PASSED_MANUAL"
15.11.2017 23:15:50 - "Test Case 'Network connectivity' started"
15.11.2017 23:15:50 - "Test Assertion 'tn-as.d.1: Connectivity at crossings': PASSED_MANUAL"
15.11.2017 23:15:50 - "Test Assertion 'tn-as.d.2: Unconnected nodes': PASSED_MANUAL"
15.11.2017 23:15:50 - "Test Assertion 'tn-as.d.3: Connectivity tolerance': PASSED_MANUAL"
15.11.2017 23:15:50 - "Test Case 'Network connectivity' finished: PASSED_MANUAL"
15.11.2017 23:15:50 - "Test Case 'Object References' started"
15.11.2017 23:15:50 - "Test Assertion 'tn-as.e.1: Linear references': PASSED_MANUAL"
15.11.2017 23:15:50 - "Test Assertion 'tn-as.e.2: Inter-modal connections': PASSED - 0 ms"
15.11.2017 23:15:50 - "Test Case 'Object References' finished: PASSED_MANUAL"
15.11.2017 23:15:50 - "Test Suite 'Conformance class: Application schema, Transport Networks Common' finished: PASSED_MANUAL"
15.11.2017 23:15:50 - Releasing resources
15.11.2017 23:15:50 - TestRunTask initialized
15.11.2017 23:15:50 - Skipping schema validation because no schema file has been set in the test suite. Data are only checked for well-formedness.
15.11.2017 23:15:50 - Validation ended with 0 error(s)
15.11.2017 23:15:50 - Compiling test script
15.11.2017 23:15:50 - Starting XQuery tests
15.11.2017 23:15:50 - "Testing 1 features"
15.11.2017 23:15:50 - "Executing Test Suite: /home/tomcat/.etf/projects/ets-repository/data-tn/tn-ra-as/ets-tn-ra-as-bsxets.xml"
15.11.2017 23:15:50 - "Statistics table: 0 ms"
15.11.2017 23:15:50 - "Test Suite 'Conformance class: Application schema, Rail Transport Networks' started"
15.11.2017 23:15:50 - "Test Case 'Code list values' started"
15.11.2017 23:15:50 - "Test Assertion 'tn-ra-as.a.1: FormOfRailwayNodeValue attributes': PASSED - 14 ms"
15.11.2017 23:15:50 - "Test Assertion 'tn-ra-as.a.2: RailwayTypeValue attributes': PASSED - 13 ms"
15.11.2017 23:15:50 - "Test Assertion 'tn-ra-as.a.3: RailwayUseValue attributes': PASSED - 9 ms"
15.11.2017 23:15:50 - "Test Case 'Code list values' finished: PASSED"
15.11.2017 23:15:50 - "Test Case 'Constraints' started"
15.11.2017 23:15:50 - "Test Assertion 'tn-ra-as.b.1: DesignSpeed can only be associated with a spatial object that is part of a railway transport network.': PASSED - 1 ms"
15.11.2017 23:15:50 - "Test Assertion 'tn-ra-as.b.2: NominalTrackGauge can only be associated with a spatial object that is part of a railway transport network.': PASSED - 0 ms"
15.11.2017 23:15:50 - "Test Assertion 'tn-ra-as.b.3: NumberOfTracks can only be associated with a spatial object that is part of a railway transport network.': PASSED - 1 ms"
15.11.2017 23:15:50 - "Test Assertion 'tn-ra-as.b.4: RailwayElectrification can only be associated with a spatial object that is part of a railway transport network.': PASSED - 0 ms"
15.11.2017 23:15:50 - "Test Assertion 'tn-ra-as.b.5: RailwayStationCode can only be associated with a spatial object that is part of a railway transport network.': PASSED - 0 ms"
15.11.2017 23:15:50 - "Test Assertion 'tn-ra-as.b.6: RailwayType can only be associated with a spatial object that is part of a railway transport network.': PASSED - 0 ms"
15.11.2017 23:15:50 - "Test Assertion 'tn-ra-as.b.7: RailwayUse can only be associated with a spatial object that is part of a railway transport network.': PASSED - 0 ms"
15.11.2017 23:15:50 - "Test Assertion 'tn-ra-as.b.8: For a railway station node, the value for the ""formOfNode"" attribute shall always be ""RailwayStop"".': PASSED - 0 ms"
15.11.2017 23:15:50 - "Test Assertion 'tn-ra-as.b.9: For a railway yard node, the value for the ""formOfNode"" attribute shall always be ""RailwayStop"".': PASSED - 0 ms"
15.11.2017 23:15:50 - "Test Case 'Constraints' finished: PASSED"
15.11.2017 23:15:50 - "Test Case 'Link centrelines' started"
15.11.2017 23:15:50 - "Test Assertion 'tn-ro-as.a.1: Link centrelines test': PASSED_MANUAL"
15.11.2017 23:15:50 - "Test Case 'Link centrelines' finished: PASSED_MANUAL"
15.11.2017 23:15:50 - "Test Suite 'Conformance class: Application schema, Rail Transport Networks' finished: PASSED_MANUAL"
15.11.2017 23:15:51 - Releasing resources
15.11.2017 23:15:51 - TestRunTask initialized
15.11.2017 23:15:51 - Skipping schema validation because no schema file has been set in the test suite. Data are only checked for well-formedness.
15.11.2017 23:15:51 - Validation ended with 0 error(s)
15.11.2017 23:15:51 - Compiling test script
15.11.2017 23:15:51 - Starting XQuery tests
15.11.2017 23:15:51 - "Testing 1 features"
15.11.2017 23:15:51 - "Indexing features (parsing errors: 0): 132 ms"
15.11.2017 23:15:51 - "Executing Test Suite: /home/tomcat/.etf/projects/ets-repository/data/data-consistency/ets-data-consistency-bsxets.xml"
15.11.2017 23:15:51 - "Statistics table: 0 ms"
15.11.2017 23:15:51 - "Test Suite 'Conformance class: Data consistency, General requirements' started"
15.11.2017 23:15:51 - "Test Case 'Version consistency' started"
15.11.2017 23:15:51 - "Test Assertion 'dc.a.1: Version lifespan plausible': PASSED - 1 ms"
15.11.2017 23:15:51 - "Test Assertion 'dc.a.2: Unique identifier persistency': PASSED_MANUAL"
15.11.2017 23:15:51 - "Test Assertion 'dc.a.3: Spatial object type stable': PASSED_MANUAL"
15.11.2017 23:15:51 - "Test Case 'Version consistency' finished: PASSED_MANUAL"
15.11.2017 23:15:51 - "Test Case 'Temporal consistency' started"
15.11.2017 23:15:51 - "Test Assertion 'dc.b.1: Valid time plausible': PASSED - 0 ms"
15.11.2017 23:15:51 - "Test Case 'Temporal consistency' finished: PASSED"
15.11.2017 23:15:51 - "Test Suite 'Conformance class: Data consistency, General requirements' finished: PASSED_MANUAL"
15.11.2017 23:15:51 - Releasing resources
15.11.2017 23:15:51 - TestRunTask initialized
15.11.2017 23:15:51 - Skipping schema validation because no schema file has been set in the test suite. Data are only checked for well-formedness.
15.11.2017 23:15:51 - Validation ended with 0 error(s)
15.11.2017 23:15:51 - Compiling test script
15.11.2017 23:15:51 - Starting XQuery tests
15.11.2017 23:15:51 - "Testing 1 features"
15.11.2017 23:15:51 - "Indexing features (parsing errors: 0): 128 ms"
15.11.2017 23:15:51 - "Executing Test Suite: /home/tomcat/.etf/projects/ets-repository/data-tn/tn-dc/ets-tn-dc-bsxets.xml"
15.11.2017 23:15:51 - "Statistics table: 0 ms"
15.11.2017 23:15:51 - "Test Suite 'Conformance class: Data consistency, Transport Networks' started"
15.11.2017 23:15:51 - "Test Case 'Spatial consistency' started"
15.11.2017 23:15:51 - "Test Assertion 'tn-dc.a.1: Each Transport Network Link or Node geometry is within a Network Area geometry (Road Transport Networks)': PASSED - 0 ms"
15.11.2017 23:15:51 - "Test Assertion 'tn-dc.a.2: Each Transport Network Link or Node geometry is within a Network Area geometry (Railway Transport Networks)': PASSED - 0 ms"
15.11.2017 23:15:51 - "Test Assertion 'tn-dc.a.3: Each Transport Network Link or Node geometry is within a Network Area geometry (Waterway Transport Networks)': PASSED - 0 ms"
15.11.2017 23:15:52 - "Test Assertion 'tn-dc.a.4: Each Transport Network Link or Node geometry is within a Network Area geometry (Air Transport Networks)': PASSED - 0 ms"
15.11.2017 23:15:52 - "Test Assertion 'tn-dc.a.5: Manual review': PASSED_MANUAL"
15.11.2017 23:15:52 - "Test Case 'Spatial consistency' finished: PASSED_MANUAL"
15.11.2017 23:15:52 - "Test Suite 'Conformance class: Data consistency, Transport Networks' finished: PASSED_MANUAL"
15.11.2017 23:15:52 - Releasing resources
15.11.2017 23:15:52 - TestRunTask initialized
15.11.2017 23:15:52 - Skipping schema validation because no schema file has been set in the test suite. Data are only checked for well-formedness.
15.11.2017 23:15:52 - Validation ended with 0 error(s)
15.11.2017 23:15:52 - Compiling test script
15.11.2017 23:15:52 - Starting XQuery tests
15.11.2017 23:15:52 - "Testing 1 features"
15.11.2017 23:15:52 - "Indexing features (parsing errors: 0): 130 ms"
15.11.2017 23:15:52 - "Executing Test Suite: /home/tomcat/.etf/projects/ets-repository/data/information-accessibility/ets-information-accessibility-bsxets.xml"
15.11.2017 23:15:52 - "Statistics table: 1 ms"
15.11.2017 23:15:52 - "Test Suite 'Conformance class: Information accessibility, General requirements' started"
15.11.2017 23:15:52 - "Test Case 'Coordinate reference systems (CRS)' started"
15.11.2017 23:15:52 - "Test Assertion 'ia.a.1: CRS publicly accessible via HTTP': FAILED - 1 ms"
15.11.2017 23:15:52 - "Test Case 'Coordinate reference systems (CRS)' finished: FAILED"
15.11.2017 23:15:52 - "Test Suite 'Conformance class: Information accessibility, General requirements' finished: FAILED"
15.11.2017 23:15:52 - Releasing resources
15.11.2017 23:15:52 - TestRunTask initialized
15.11.2017 23:15:52 - Skipping schema validation because no schema file has been set in the test suite. Data are only checked for well-formedness.
15.11.2017 23:15:52 - Validation ended with 0 error(s)
15.11.2017 23:15:52 - Compiling test script
15.11.2017 23:15:52 - Starting XQuery tests
15.11.2017 23:15:52 - "Testing 1 features"
15.11.2017 23:15:52 - "Executing Test Suite: /home/tomcat/.etf/projects/ets-repository/data-tn/tn-ia/ets-tn-ia-bsxets.xml"
15.11.2017 23:15:52 - "Statistics table: 0 ms"
15.11.2017 23:15:52 - "Test Suite 'Conformance class: Information accessibility, Transport Networks' started"
15.11.2017 23:15:52 - "Test Case 'Code lists' started"
15.11.2017 23:15:52 - "Test Assertion 'tn-ia.a.1: Code list extensions accessible': PASSED - 0 ms"
15.11.2017 23:15:52 - "Test Case 'Code lists' finished: PASSED"
15.11.2017 23:15:52 - "Test Case 'Feature references' started"
15.11.2017 23:15:52 - "Test Assertion 'tn-ia.b.1: MarkerPost.route': PASSED - 0 ms"
15.11.2017 23:15:52 - "Test Assertion 'tn-ia.b.2: TransportLinkSet.post': PASSED - 0 ms"
15.11.2017 23:15:52 - "Test Case 'Feature references' finished: PASSED"
15.11.2017 23:15:52 - "Test Suite 'Conformance class: Information accessibility, Transport Networks' finished: PASSED"
15.11.2017 23:15:53 - Releasing resources
15.11.2017 23:15:53 - TestRunTask initialized
15.11.2017 23:15:53 - Skipping schema validation because no schema file has been set in the test suite. Data are only checked for well-formedness.
15.11.2017 23:15:53 - Validation ended with 0 error(s)
15.11.2017 23:15:53 - Compiling test script
15.11.2017 23:15:53 - Starting XQuery tests
15.11.2017 23:15:53 - "Testing 1 features"
15.11.2017 23:15:53 - "Indexing features (parsing errors: 0): 147 ms"
15.11.2017 23:15:53 - "Executing Test Suite: /home/tomcat/.etf/projects/ets-repository/data/reference-systems/ets-reference-systems-bsxets.xml"
15.11.2017 23:15:53 - "Statistics table: 0 ms"
15.11.2017 23:15:53 - "Test Suite 'Conformance class: Reference systems, General requirements' started"
15.11.2017 23:15:53 - "Test Case 'Spatial reference systems' started"
15.11.2017 23:15:53 - "Test Assertion 'rs.a.1: Spatial reference systems in feature geometries': FAILED - 0 ms"
15.11.2017 23:15:53 - "Test Assertion 'rs.a.2: Default spatial reference systems in feature collections': PASSED - 0 ms"
15.11.2017 23:15:53 - "Test Case 'Spatial reference systems' finished: FAILED"
15.11.2017 23:15:53 - "Test Case 'Temporal reference systems' started"
15.11.2017 23:15:53 - "Test Assertion 'rs.a.3: Temporal reference systems in features': PASSED - 0 ms"
15.11.2017 23:15:53 - "Test Case 'Temporal reference systems' finished: PASSED"
15.11.2017 23:15:53 - "Test Suite 'Conformance class: Reference systems, General requirements' finished: FAILED"
15.11.2017 23:15:53 - Releasing resources
15.11.2017 23:15:53 - TestRunTask initialized
15.11.2017 23:15:53 - Skipping schema validation because no schema file has been set in the test suite. Data are only checked for well-formedness.
15.11.2017 23:15:53 - Validation ended with 0 error(s)
15.11.2017 23:15:53 - Compiling test script
15.11.2017 23:15:53 - Starting XQuery tests
15.11.2017 23:15:53 - "Testing 1 features"
15.11.2017 23:15:53 - "Executing Test Suite: /home/tomcat/.etf/projects/ets-repository/data-tn/tn-rs/ets-tn-rs-bsxets.xml"
15.11.2017 23:15:53 - "Statistics table: 0 ms"
15.11.2017 23:15:53 - "Test Suite 'Conformance class: Reference systems, Transport Networks' started"
15.11.2017 23:15:53 - "Test Case 'Additional theme-specific rules for reference systems' started"
15.11.2017 23:15:53 - "Test Assertion 'tn-rs.a.1: Test always passes': PASSED - 0 ms"
15.11.2017 23:15:53 - "Test Case 'Additional theme-specific rules for reference systems' finished: PASSED"
15.11.2017 23:15:53 - "Test Suite 'Conformance class: Reference systems, Transport Networks' finished: PASSED"
15.11.2017 23:15:54 - Releasing resources
15.11.2017 23:15:54 - Changed state from INITIALIZED to RUNNING
15.11.2017 23:15:54 - Duration: 1min
15.11.2017 23:15:54 - TestRun finished
15.11.2017 23:15:54 - Changed state from RUNNING to COMPLETED
