06.02.2018 13:10:57 - Preparing Test Run downloadService_17316219_Geodetick&yacute;akartografick&yacute;&uacute;stavBratislava_INSPIRE Download Service - Hydrography (initiated Tue Feb 06 13:10:57 CET 2018)
06.02.2018 13:10:57 - Resolving Executable Test Suite dependencies
06.02.2018 13:10:57 - Preparing 2 Test Task:
06.02.2018 13:10:57 -  TestTask 1 (066e1013-7ca6-41c4-8492-090fe57c8671)
06.02.2018 13:10:57 -  will perform tests on Test Object 'INSPIRE Download Service - Hydrography' by using Executable Test Suite 'WFS 2.0 (OGC 09-025r2/ISO 19142) Conformance Test Suite (EID: 95a1b6fc-2b55-3d43-9502-3b8b605bda10, V: 1.26.0 )'
06.02.2018 13:10:57 -  with parameters: 
06.02.2018 13:10:57 - etf.testcases = *
06.02.2018 13:10:57 -  TestTask 2 (cee0924a-3ed9-4f06-ae08-d093a8b41b83)
06.02.2018 13:10:57 -  will perform tests on Test Object 'INSPIRE Download Service - Hydrography' by using Executable Test Suite 'Conformance Class: Download Service - Direct WFS (EID: ed2d3501-d700-4ff9-b9bf-070dece8ddbd, V: 1.0.2 )'
06.02.2018 13:10:57 -  with parameters: 
06.02.2018 13:10:57 - etf.testcases = *
06.02.2018 13:10:57 - Test Tasks prepared and ready to be executed. Waiting for the scheduler to start.
06.02.2018 13:10:57 - Setting state to CREATED
06.02.2018 13:10:57 - Changed state from CREATED to INITIALIZING
06.02.2018 13:10:57 - Starting TestRun.a58f9b8f-1d13-4051-a4af-08b1fa7f6721 at 2018-02-06T13:10:59+01:00
06.02.2018 13:10:59 - Changed state from INITIALIZING to INITIALIZED
06.02.2018 13:10:59 - TestRunTask initialized
06.02.2018 13:10:59 - Invoking TEAM Engine remotely. This may take a while. Progress messages are not supported.
06.02.2018 13:10:59 - Timeout is set to: 20min
06.02.2018 13:30:59 - The OGC TEAM Engine is taking too long to respond.
06.02.2018 13:30:59 - Checking availability...
06.02.2018 13:30:59 - ...[OK]. The OGC TEAM Engine is available. You may need to ask the system administrator to increase the OGC TEAM Engine test driver timeout.
06.02.2018 13:31:00 - Releasing resources
06.02.2018 13:31:00 - Project Properties: 
06.02.2018 13:31:00 - etf.testcases - * 
06.02.2018 13:31:00 - serviceEndpoint - https://zbgisws.skgeodesy.sk/inspire_hydrography_wfs/service.svc/get?ACCEPTVERSIONS=2.0.0&request=GetCapabilities&service=WFS&VERSION=2.0.0 
06.02.2018 13:31:00 - username -  
06.02.2018 13:31:00 - authUser -  
06.02.2018 13:31:00 - authMethod - basic 
06.02.2018 13:31:00 - TestRunTask initialized
06.02.2018 13:31:09 ERROR Service returned an exception: Operation request contains an invalid parameter value.
06.02.2018 13:31:09 ERROR Assertion failed with error 'TR.unexpectedException'
06.02.2018 13:31:09 ERROR Assertion failed with error 'TR.initializationAndBasicChecksFailed'
06.02.2018 13:31:09 ERROR Assertion failed with error 'TR.initializationAndBasicChecksFailed'
06.02.2018 13:31:09 ERROR Assertion failed with error 'TR.initializationAndBasicChecksFailed'
06.02.2018 13:31:10 - Releasing resources
06.02.2018 13:31:10 - Changed state from INITIALIZED to RUNNING
06.02.2018 13:31:10 - Duration: 20min
06.02.2018 13:31:10 - TestRun finished
06.02.2018 13:31:10 - Changed state from RUNNING to COMPLETED
