16.11.2017 01:00:49 - Preparing Test Run downloadService (initiated Thu Nov 16 01:00:49 CET 2017)
16.11.2017 01:00:49 - Resolving Executable Test Suite dependencies
16.11.2017 01:00:49 - Preparing 2 Test Task:
16.11.2017 01:00:49 -  TestTask 1 (30e4e28b-4d7c-4f87-b135-b8bb204d530b)
16.11.2017 01:00:49 -  will perform tests on Test Object 'INSPIRE Download Service - Hydrography' by using Executable Test Suite 'WFS 2.0 (OGC 09-025r2/ISO 19142) Conformance Test Suite (EID: 95a1b6fc-2b55-3d43-9502-3b8b605bda10, V: 1.26.0 )'
16.11.2017 01:00:49 -  with parameters: 
16.11.2017 01:00:49 - etf.testcases = *
16.11.2017 01:00:49 -  TestTask 2 (f997b93b-1cf4-4fb7-ac87-8ef8621442e8)
16.11.2017 01:00:49 -  will perform tests on Test Object 'INSPIRE Download Service - Hydrography' by using Executable Test Suite 'Conformance Class: Download Service - Direct WFS (EID: ed2d3501-d700-4ff9-b9bf-070dece8ddbd, V: 1.0.0 )'
16.11.2017 01:00:49 -  with parameters: 
16.11.2017 01:00:49 - etf.testcases = *
16.11.2017 01:00:49 - Test Tasks prepared and ready to be executed. Waiting for the scheduler to start.
16.11.2017 01:00:49 - Setting state to CREATED
16.11.2017 01:00:49 - Changed state from CREATED to INITIALIZING
16.11.2017 01:00:49 - Starting TestRun.8741c782-c7ef-4ddf-b4ac-696a63f0e5c6 at 2017-11-16T01:00:50+01:00
16.11.2017 01:00:50 - Changed state from INITIALIZING to INITIALIZED
16.11.2017 01:00:50 - TestRunTask initialized
16.11.2017 01:00:53 - Releasing resources
16.11.2017 01:00:53 - Project Properties: 
16.11.2017 01:00:53 - etf.testcases - * 
16.11.2017 01:00:53 - download.1 - file:/home/tomcat/.etf/testdata/get.xml-0865af2f-c1a5-487e-9d18-bc1b0174c1d9/ 
16.11.2017 01:00:53 - data - https://test-zbgisws.skgeodesy.sk/inspire_hydrography_wfs/service.svc/get?service=WFS&request=GetCapabilities 
16.11.2017 01:00:53 - username -  
16.11.2017 01:00:53 - authUser -  
16.11.2017 01:00:53 - authMethod - basic 
16.11.2017 01:00:53 - TestRunTask initialized
16.11.2017 01:00:54 ERROR Exception occurred in Test Step: java.lang.NullPointerException
16.11.2017 01:00:54 ERROR Exception occurred in Test Step: java.lang.NullPointerException
16.11.2017 01:00:54 ERROR Exception occurred in Test Step: java.lang.NullPointerException
16.11.2017 01:00:54 ERROR Exception occurred in Test Step: java.lang.NullPointerException
16.11.2017 01:00:54 ERROR Exception occurred in Test Step: java.lang.NullPointerException
16.11.2017 01:00:54 - Releasing resources
16.11.2017 01:00:54 - Changed state from INITIALIZED to RUNNING
16.11.2017 01:00:54 - Duration: 5sec
16.11.2017 01:00:54 - TestRun finished
16.11.2017 01:00:54 - Changed state from RUNNING to COMPLETED
