05.12.2017 12:29:00 - Preparing Test Run metadata_17316219_Geodetick&yacute; a kartografick&yacute; &uacute;stav Bratislava(GK&Uacute;)_INSPIRE ZBGIS (initiated Tue Dec 05 12:29:00 CET 2017)
05.12.2017 12:29:00 - Resolving Executable Test Suite dependencies
05.12.2017 12:29:00 - Preparing 2 Test Task:
05.12.2017 12:29:00 -  TestTask 1 (0443eebd-f236-4211-9a93-40b31ad7e748)
05.12.2017 12:29:00 -  will perform tests on Test Object 'GetRecordByIdResponse.xml' by using Executable Test Suite 'LAZY.e3500038-e37c-4dcf-806c-6bc82d585b3b'
05.12.2017 12:29:00 -  with parameters: 
05.12.2017 12:29:00 - etf.testcases = *
05.12.2017 12:29:00 -  TestTask 2 (45e95a46-9cf5-4701-bb64-72d00ff9087f)
05.12.2017 12:29:00 -  will perform tests on Test Object 'GetRecordByIdResponse.xml' by using Executable Test Suite 'Conformance class: INSPIRE Profile based on EN ISO 19115 and EN ISO 19119 (EID: ec7323d5-d8f0-4cfe-b23a-b826df86d58c, V: 0.2.4 )'
05.12.2017 12:29:00 -  with parameters: 
05.12.2017 12:29:00 - etf.testcases = *
05.12.2017 12:29:00 - Test Tasks prepared and ready to be executed. Waiting for the scheduler to start.
05.12.2017 12:29:00 - Setting state to CREATED
05.12.2017 12:29:00 - Changed state from CREATED to INITIALIZING
05.12.2017 12:29:00 - Starting TestRun.68987536-ea7c-4676-b815-4254e7ca3a43 at 2017-12-05T12:29:01+01:00
05.12.2017 12:29:01 - Changed state from INITIALIZING to INITIALIZED
05.12.2017 12:29:01 - TestRunTask initialized
05.12.2017 12:29:01 - Creating new tests databases to speed up tests.
05.12.2017 12:29:01 - Skipping schema validation because no schema file has been set in the test suite. Data are only checked for well-formedness.
05.12.2017 12:29:01 - Optimizing last database etf-tdb-18940668-30fe-47b0-bcc9-bb6ec976f8c4-0 
05.12.2017 12:29:01 - Import completed
05.12.2017 12:29:02 - Validation ended with 0 error(s)
05.12.2017 12:29:02 - Compiling test script
05.12.2017 12:29:02 - Starting XQuery tests
05.12.2017 12:29:02 - "Testing 1 records"
05.12.2017 12:29:02 - "Executing Test Suite: /home/tomcat/.etf/projects/ets-repository/metadata/xml/ets-md-xml-bsxets.xml"
05.12.2017 12:29:02 - "Statistics table: 1 ms"
05.12.2017 12:29:02 - "Test Suite 'Conformance class: XML encoding of ISO 19115/19119 metadata' started"
05.12.2017 12:29:02 - "Test Case 'Schema validation' started"
05.12.2017 12:29:05 - "Validating file GetRecordByIdResponse.xml: 3157 ms"
05.12.2017 12:29:05 - "Test Assertion 'md-xml.a.1: Validate XML documents': PASSED - 3157 ms"
05.12.2017 12:29:05 - "Test Case 'Schema validation' finished: PASSED"
05.12.2017 12:29:05 - "Test Suite 'Conformance class: XML encoding of ISO 19115/19119 metadata' finished: PASSED"
05.12.2017 12:29:17 - Releasing resources
05.12.2017 12:29:17 - TestRunTask initialized
05.12.2017 12:29:17 - Recreating new tests databases as the Test Object has changed!
05.12.2017 12:29:17 - Skipping schema validation because no schema file has been set in the test suite. Data are only checked for well-formedness.
05.12.2017 12:29:17 - Optimizing last database etf-tdb-18940668-30fe-47b0-bcc9-bb6ec976f8c4-0 
05.12.2017 12:29:17 - Import completed
05.12.2017 12:29:19 - Validation ended with 0 error(s)
05.12.2017 12:29:19 - Compiling test script
05.12.2017 12:29:19 - Starting XQuery tests
05.12.2017 12:29:19 - "Testing 1 records"
05.12.2017 12:29:19 - "Executing Test Suite: /home/tomcat/.etf/projects/ets-repository/metadata/iso/ets-md-iso-bsxets.xml"
05.12.2017 12:29:19 - "Statistics table: 1 ms"
05.12.2017 12:29:19 - "Test Suite 'Conformance class: INSPIRE Profile based on EN ISO 19115 and EN ISO 19119' started"
05.12.2017 12:29:19 - "Test Case 'Common tests' started"
05.12.2017 12:29:19 - "Test Assertion 'md-iso.a.1: Title': PASSED - 0 ms"
05.12.2017 12:29:19 - "Test Assertion 'md-iso.a.2: Abstract': PASSED - 0 ms"
05.12.2017 12:29:19 - "Test Assertion 'md-iso.a.3: Access and use conditions': PASSED_MANUAL - 0 ms"
05.12.2017 12:29:19 - "Test Assertion 'md-iso.a.4: Public access': PASSED - 0 ms"
05.12.2017 12:29:19 - "Test Assertion 'md-iso.a.5: Specification': PASSED - 0 ms"
05.12.2017 12:29:19 - "Test Assertion 'md-iso.a.6: Language': PASSED - 0 ms"
05.12.2017 12:29:19 - "Test Assertion 'md-iso.a.7: Metadata contact': PASSED - 0 ms"
05.12.2017 12:29:19 - "Test Assertion 'md-iso.a.8: Metadata contact role': PASSED - 0 ms"
05.12.2017 12:29:19 - "Test Assertion 'md-iso.a.9: Resource creation date': PASSED - 1 ms"
05.12.2017 12:29:19 - "Test Assertion 'md-iso.a.10: Responsible party contact info': PASSED - 0 ms"
05.12.2017 12:29:19 - "Test Assertion 'md-iso.a.11: Responsible party role': PASSED - 0 ms"
05.12.2017 12:29:19 - "Test Case 'Common tests' finished: PASSED_MANUAL"
05.12.2017 12:29:19 - "Test Case 'Hierarchy level' started"
05.12.2017 12:29:19 - "Test Assertion 'md-iso.b.1: Hierarchy': PASSED - 0 ms"
05.12.2017 12:29:19 - "Test Case 'Hierarchy level' finished: PASSED"
05.12.2017 12:29:19 - "Test Case 'Dataset (series) tests' started"
05.12.2017 12:29:19 - "Test Assertion 'md-iso.c.1: Dataset identification': PASSED - 0 ms"
05.12.2017 12:29:19 - "Test Assertion 'md-iso.c.2: Dataset language': PASSED - 0 ms"
05.12.2017 12:29:19 - "Test Assertion 'md-iso.c.3: Dataset linkage': PASSED - 0 ms"
05.12.2017 12:29:19 - "Test Assertion 'md-iso.c.4: Dataset conformity': PASSED - 0 ms"
05.12.2017 12:29:19 - "Test Assertion 'md-iso.c.5: Dataset topic': PASSED - 0 ms"
05.12.2017 12:29:19 - "Test Assertion 'md-iso.c.6: Dataset geographic Bounding box': PASSED - 0 ms"
05.12.2017 12:29:19 - "Test Assertion 'md-iso.c.7: Dataset lineage': PASSED - 0 ms"
05.12.2017 12:29:19 - "Test Case 'Dataset (series) tests' finished: PASSED"
05.12.2017 12:29:19 - "Test Case 'Service tests' started"
05.12.2017 12:29:19 - "Test Assertion 'md-iso.d.1: Service type': PASSED - 0 ms"
05.12.2017 12:29:19 - "Checking URL: 'https://zbgisws.skgeodesy.sk/inspire_administrative_units_wfs/service.svc/get'"
05.12.2017 12:29:19 - "Test Assertion 'md-iso.d.2: Service linkage': PASSED_MANUAL - 145 ms"
05.12.2017 12:29:19 - "Checking URL: 'https://zbgisws.skgeodesy.sk/zbgiscsw/service.svc/get?REQUEST=GetRecordById&amp;SERVICE=CSW&amp;VERSION=2.0.2&amp;OUTPUTSCHEMA=http://www.isotc211.org/2005/gmd&amp;ELEMENTSETNAME=full&amp;Id=https://data.gov.sk/set/rpi/gmd/17316219/SK_UGKK_INSPIRE_WFS_AU'"
05.12.2017 12:29:20 - "Test Assertion 'md-iso.d.3: Coupled resource': FAILED - 391 ms"
05.12.2017 12:29:20 - "Test Case 'Service tests' finished: FAILED"
05.12.2017 12:29:20 - "Test Case 'Keywords' started"
05.12.2017 12:29:20 - "Test Assertion 'md-iso.e.1: Keywords': PASSED - 0 ms"
05.12.2017 12:29:20 - "Test Case 'Keywords' finished: PASSED"
05.12.2017 12:29:20 - "Test Case 'Keywords - details' started"
05.12.2017 12:29:20 - "Test Assertion 'md-iso.f.1: Dataset keyword': PASSED - 0 ms"
05.12.2017 12:29:20 - "Checking URL: 'http://inspire.ec.europa.eu/metadata-codelist/SpatialDataServiceCategory/SpatialDataServiceCategory.en.atom'"
05.12.2017 12:29:20 - "Test Assertion 'md-iso.f.2: Service keyword': PASSED - 6 ms"
05.12.2017 12:29:20 - "Test Assertion 'md-iso.f.3: Keywords in vocabulary grouped': PASSED - 0 ms"
05.12.2017 12:29:20 - "Test Assertion 'md-iso.f.4: Vocabulary information': PASSED - 1 ms"
05.12.2017 12:29:20 - "Test Case 'Keywords - details' finished: PASSED"
05.12.2017 12:29:20 - "Test Case 'Temporal extent' started"
05.12.2017 12:29:20 - "Test Assertion 'md-iso.g.1: Temporal extent': PASSED - 0 ms"
05.12.2017 12:29:20 - "Test Case 'Temporal extent' finished: PASSED"
05.12.2017 12:29:20 - "Test Case 'Temporal extent - details' started"
05.12.2017 12:29:20 - "Test Assertion 'md-iso.h.1: Temporal date': PASSED - 0 ms"
05.12.2017 12:29:20 - "Test Case 'Temporal extent - details' finished: PASSED"
05.12.2017 12:29:20 - "Test Suite 'Conformance class: INSPIRE Profile based on EN ISO 19115 and EN ISO 19119' finished: FAILED"
05.12.2017 12:29:20 - Releasing resources
05.12.2017 12:29:20 - Changed state from INITIALIZED to RUNNING
05.12.2017 12:29:20 - Duration: 20sec
05.12.2017 12:29:20 - TestRun finished
05.12.2017 12:29:20 - Changed state from RUNNING to COMPLETED
