22.01.2018 23:10:55 - Preparing Test Run interoperability_17316219_Geodetick&yacute; a kartografick&yacute; &uacute;stav Bratislava_tn-ro:FunctionalRoadClass (initiated Mon Jan 22 23:10:55 CET 2018)
22.01.2018 23:10:55 - Resolving Executable Test Suite dependencies
22.01.2018 23:10:55 - Preparing 11 Test Task:
22.01.2018 23:10:55 -  TestTask 1 (f70c619c-76a9-4af8-ae46-1528ac279d93)
22.01.2018 23:10:55 -  will perform tests on Test Object 'get.xml' by using Executable Test Suite 'LAZY.545f9e49-009b-4114-9333-7ca26413b5d4'
22.01.2018 23:10:55 -  with parameters: 
22.01.2018 23:10:55 - etf.testcases = *
22.01.2018 23:10:55 -  TestTask 2 (c4cbc85f-338e-4829-9811-e0c0184410d0)
22.01.2018 23:10:55 -  will perform tests on Test Object 'get.xml' by using Executable Test Suite 'LAZY.09820daf-62b2-4fa3-a95f-56a0d2b7c4d8'
22.01.2018 23:10:55 -  with parameters: 
22.01.2018 23:10:55 - etf.testcases = *
22.01.2018 23:10:55 -  TestTask 3 (7812f817-9fad-4931-b731-0db7c3cb2535)
22.01.2018 23:10:55 -  will perform tests on Test Object 'get.xml' by using Executable Test Suite 'LAZY.9af1c865-1cf0-43ff-9250-069df01b0948'
22.01.2018 23:10:55 -  with parameters: 
22.01.2018 23:10:55 - etf.testcases = *
22.01.2018 23:10:55 -  TestTask 4 (1c2d7f0e-f576-4509-a24d-bb290d5b166d)
22.01.2018 23:10:55 -  will perform tests on Test Object 'get.xml' by using Executable Test Suite 'LAZY.4441cbde-371f-4899-90b3-145f4fd08ebc'
22.01.2018 23:10:55 -  with parameters: 
22.01.2018 23:10:55 - etf.testcases = *
22.01.2018 23:10:55 -  TestTask 5 (6ccd1784-f63d-4903-827e-006d089adce9)
22.01.2018 23:10:55 -  will perform tests on Test Object 'get.xml' by using Executable Test Suite 'Conformance class: Application schema, Road Transport Networks (EID: 14986e54-74c4-43b0-979b-d0d3e5cd0e8c, V: 0.2.1 )'
22.01.2018 23:10:55 -  with parameters: 
22.01.2018 23:10:55 - etf.testcases = *
22.01.2018 23:10:55 -  TestTask 6 (9c7c163b-c396-4651-b5a5-3667e05fe043)
22.01.2018 23:10:55 -  will perform tests on Test Object 'get.xml' by using Executable Test Suite 'LAZY.61070ae8-13cb-4303-a340-72c8b877b00a'
22.01.2018 23:10:55 -  with parameters: 
22.01.2018 23:10:55 - etf.testcases = *
22.01.2018 23:10:55 -  TestTask 7 (f2d4668d-c25c-4f8a-8a17-b7e0c7466a2c)
22.01.2018 23:10:55 -  will perform tests on Test Object 'get.xml' by using Executable Test Suite 'Conformance class: Data consistency, Transport Networks (EID: 733af9a0-312b-4f71-9aa2-977cd2134d23, V: 0.2.2 )'
22.01.2018 23:10:55 -  with parameters: 
22.01.2018 23:10:55 - etf.testcases = *
22.01.2018 23:10:55 -  TestTask 8 (514edced-d8b1-4b27-a0be-fecdab9fff1c)
22.01.2018 23:10:55 -  will perform tests on Test Object 'get.xml' by using Executable Test Suite 'LAZY.499937ea-0590-42d2-bd7a-1cafff35ecdb'
22.01.2018 23:10:55 -  with parameters: 
22.01.2018 23:10:55 - etf.testcases = *
22.01.2018 23:10:55 -  TestTask 9 (3e9bef7d-79b2-4a23-8bee-16c5f945ca7f)
22.01.2018 23:10:55 -  will perform tests on Test Object 'get.xml' by using Executable Test Suite 'Conformance class: Information accessibility, Transport Networks (EID: df5db9a4-b15f-4193-a6ff-6e9951af46f5, V: 0.2.2 )'
22.01.2018 23:10:55 -  with parameters: 
22.01.2018 23:10:55 - etf.testcases = *
22.01.2018 23:10:55 -  TestTask 10 (cb3290b3-da5e-4ad0-9dab-9a676f975d69)
22.01.2018 23:10:55 -  will perform tests on Test Object 'get.xml' by using Executable Test Suite 'LAZY.63f586f0-080c-493b-8ca2-9919427440cc'
22.01.2018 23:10:55 -  with parameters: 
22.01.2018 23:10:55 - etf.testcases = *
22.01.2018 23:10:55 -  TestTask 11 (a22c82cd-2b29-4012-85fc-b862946b575e)
22.01.2018 23:10:55 -  will perform tests on Test Object 'get.xml' by using Executable Test Suite 'Conformance class: Reference systems, Transport Networks (EID: 9d35024d-9dd7-43a9-afff-d5aea5f51595, V: 0.2.0 )'
22.01.2018 23:10:55 -  with parameters: 
22.01.2018 23:10:55 - etf.testcases = *
22.01.2018 23:10:55 - Test Tasks prepared and ready to be executed. Waiting for the scheduler to start.
22.01.2018 23:10:55 - Setting state to CREATED
22.01.2018 23:10:55 - Changed state from CREATED to INITIALIZING
22.01.2018 23:10:55 - Starting TestRun.5bc836c5-6359-4766-9357-f4bb58ca13a9 at 2018-01-22T23:10:56+01:00
22.01.2018 23:10:56 - Changed state from INITIALIZING to INITIALIZED
22.01.2018 23:10:56 - TestRunTask initialized
22.01.2018 23:10:56 - Creating new tests databases to speed up tests.
22.01.2018 23:10:56 - Skipping schema validation because no schema file has been set in the test suite. Data are only checked for well-formedness.
22.01.2018 23:10:56 - Optimizing last database etf-tdb-cda4e20e-69e3-4a49-ac97-ca4c7581f2a4-0 
22.01.2018 23:10:56 - Import completed
22.01.2018 23:10:59 - Validation ended with 0 error(s)
22.01.2018 23:10:59 - Compiling test script
22.01.2018 23:10:59 - Starting XQuery tests
22.01.2018 23:10:59 - "Testing 1 features"
22.01.2018 23:10:59 - "Executing Test Suite: /home/tomcat/.etf/projects/ets-repository/data-encoding/inspire-gml/ets-inspire-gml-bsxets.xml"
22.01.2018 23:10:59 - "Statistics table: 2 ms"
22.01.2018 23:10:59 - "Test Suite 'Conformance class: INSPIRE GML encoding' started"
22.01.2018 23:10:59 - "Test Case 'Basic tests' started"
22.01.2018 23:10:59 - "Test Assertion 'gml.a.1: Errors loading the XML documents': PASSED - 0 ms"
22.01.2018 23:10:59 - "Test Assertion 'gml.a.2: Document root element': PASSED - 0 ms"
22.01.2018 23:10:59 - "Test Assertion 'gml.a.3: Character encoding': NOT_APPLICABLE"
22.01.2018 23:10:59 - "Test Case 'Basic tests' finished: PASSED"
22.01.2018 23:10:59 - "Test Suite 'Conformance class: INSPIRE GML encoding' finished: PASSED"
22.01.2018 23:10:59 - Releasing resources
22.01.2018 23:10:59 - TestRunTask initialized
22.01.2018 23:10:59 - Recreating new tests databases as the Test Object has changed!
22.01.2018 23:10:59 - Skipping schema validation because no schema file has been set in the test suite. Data are only checked for well-formedness.
22.01.2018 23:10:59 - Optimizing last database etf-tdb-cda4e20e-69e3-4a49-ac97-ca4c7581f2a4-0 
22.01.2018 23:10:59 - Import completed
22.01.2018 23:10:59 - Validation ended with 0 error(s)
22.01.2018 23:10:59 - Compiling test script
22.01.2018 23:10:59 - Starting XQuery tests
22.01.2018 23:10:59 - "Testing 1 features"
22.01.2018 23:10:59 - "Indexing features (parsing errors: 0): 1 ms"
22.01.2018 23:10:59 - "Executing Test Suite: /home/tomcat/.etf/projects/ets-repository/data/schemas/ets-schemas-bsxets.xml"
22.01.2018 23:10:59 - "Statistics table: 1 ms"
22.01.2018 23:10:59 - "Test Suite 'Conformance class: INSPIRE GML application schemas, General requirements' started"
22.01.2018 23:10:59 - "Test Case 'Schema' started"
22.01.2018 23:10:59 - "Test Assertion 'gmlas.a.1: Mapping of source data to INSPIRE': PASSED_MANUAL"
22.01.2018 23:10:59 - "Test Assertion 'gmlas.a.2: Modelling of additional spatial object types': PASSED_MANUAL"
22.01.2018 23:10:59 - "Test Case 'Schema' finished: PASSED_MANUAL"
22.01.2018 23:10:59 - "Test Case 'Schema validation' started"
22.01.2018 23:10:59 - "Test Assertion 'gmlas.b.1: xsi:schemaLocation attribute': PASSED - 0 ms"
22.01.2018 23:10:59 - "Validating get.xml"
22.01.2018 23:11:07 - "Duration: 7670 ms. Errors: 0."
22.01.2018 23:11:07 - "Test Assertion 'gmlas.b.2: validate XML documents': PASSED - 7670 ms"
22.01.2018 23:11:07 - "Test Case 'Schema validation' finished: PASSED"
22.01.2018 23:11:07 - "Test Case 'GML model' started"
22.01.2018 23:11:07 - "Test Assertion 'gmlas.c.1: Consistency with the GML model': PASSED - 0 ms"
22.01.2018 23:11:07 - "Test Assertion 'gmlas.c.2: nilReason attributes require xsi:nil=true': PASSED - 0 ms"
22.01.2018 23:11:07 - "Test Assertion 'gmlas.c.3: nilReason values': PASSED - 0 ms"
22.01.2018 23:11:07 - "Test Case 'GML model' finished: PASSED"
22.01.2018 23:11:07 - "Test Case 'Simple features' started"
22.01.2018 23:11:07 - "Test Assertion 'gmlas.d.1: No spatial topology objects': PASSED - 0 ms"
22.01.2018 23:11:07 - "Test Assertion 'gmlas.d.2: No non-linear interpolation': PASSED - 0 ms"
22.01.2018 23:11:07 - "Test Assertion 'gmlas.d.3: Surface geometry elements': PASSED - 0 ms"
22.01.2018 23:11:07 - "Test Assertion 'gmlas.d.4: No non-planar interpolation': PASSED - 0 ms"
22.01.2018 23:11:07 - "Test Assertion 'gmlas.d.5: Geometry elements': PASSED - 0 ms"
22.01.2018 23:11:07 - "Test Assertion 'gmlas.d.6: Point coordinates in gml:pos': PASSED - 0 ms"
22.01.2018 23:11:07 - "Test Assertion 'gmlas.d.7: Curve/Surface coordinates in gml:posList': PASSED - 0 ms"
22.01.2018 23:11:07 - "Test Assertion 'gmlas.d.8: No array property elements': PASSED - 0 ms"
22.01.2018 23:11:07 - "Test Assertion 'gmlas.d.9: 1, 2 or 3 coordinate dimensions': PASSED - 0 ms"
22.01.2018 23:11:07 - "Test Assertion 'gmlas.d.10: Validate geometries (1)': PASSED - 43 ms"
22.01.2018 23:11:07 - "Test Assertion 'gmlas.d.11: Validate geometries (2)': PASSED - 0 ms"
22.01.2018 23:11:07 - "Test Case 'Simple features' finished: PASSED"
22.01.2018 23:11:07 - "Test Case 'Code list values in basic data types' started"
22.01.2018 23:11:07 - "Test Assertion 'gmlas.e.1: GrammaticalNumber attributes': PASSED - 9 ms"
22.01.2018 23:11:07 - "Test Assertion 'gmlas.e.2: GrammaticalGender attributes': PASSED - 6 ms"
22.01.2018 23:11:07 - "Test Assertion 'gmlas.e.3: NameStatus attributes': PASSED - 6 ms"
22.01.2018 23:11:07 - "Test Assertion 'gmlas.e.4: Nativeness attributes': PASSED - 5 ms"
22.01.2018 23:11:07 - "Test Case 'Code list values in basic data types' finished: PASSED"
22.01.2018 23:11:07 - "Test Case 'Constraints' started"
22.01.2018 23:11:07 - "Test Assertion 'gmlas.f.1: At least one of the two attributes pronunciationSoundLink and pronunciationIPA shall not be void': PASSED - 0 ms"
22.01.2018 23:11:07 - "Test Case 'Constraints' finished: PASSED"
22.01.2018 23:11:07 - "Test Suite 'Conformance class: INSPIRE GML application schemas, General requirements' finished: PASSED_MANUAL"
22.01.2018 23:11:08 - Releasing resources
22.01.2018 23:11:08 - TestRunTask initialized
22.01.2018 23:11:08 - Skipping schema validation because no schema file has been set in the test suite. Data are only checked for well-formedness.
22.01.2018 23:11:08 - Validation ended with 0 error(s)
22.01.2018 23:11:08 - Compiling test script
22.01.2018 23:11:08 - Starting XQuery tests
22.01.2018 23:11:08 - "Testing 1 features"
22.01.2018 23:11:08 - "Indexing features (parsing errors: 0): 1 ms"
22.01.2018 23:11:08 - "Executing Test Suite: /home/tomcat/.etf/projects/ets-repository/data-tn/tn-gml/ets-tn-gml-bsxets.xml"
22.01.2018 23:11:08 - "Statistics table: 1 ms"
22.01.2018 23:11:08 - "Test Suite 'Conformance class: GML application schemas, Transport Networks' started"
22.01.2018 23:11:08 - "Test Case 'Basic test' started"
22.01.2018 23:11:08 - "Test Assertion 'tn-gml.a.1: Transport Network feature in dataset': PASSED - 0 ms"
22.01.2018 23:11:08 - "Test Case 'Basic test' finished: PASSED"
22.01.2018 23:11:08 - "Test Suite 'Conformance class: GML application schemas, Transport Networks' finished: PASSED"
22.01.2018 23:11:08 - Releasing resources
22.01.2018 23:11:08 - TestRunTask initialized
22.01.2018 23:11:08 - Skipping schema validation because no schema file has been set in the test suite. Data are only checked for well-formedness.
22.01.2018 23:11:08 - Validation ended with 0 error(s)
22.01.2018 23:11:08 - Compiling test script
22.01.2018 23:11:08 - Starting XQuery tests
22.01.2018 23:11:08 - "Testing 1 features"
22.01.2018 23:11:08 - "Indexing features (parsing errors: 0): 1 ms"
22.01.2018 23:11:08 - "Executing Test Suite: /home/tomcat/.etf/projects/ets-repository/data-tn/tn-as/ets-tn-as-bsxets.xml"
22.01.2018 23:11:08 - "Statistics table: 1 ms"
22.01.2018 23:11:08 - "Test Suite 'Conformance class: Application schema, Transport Networks Common' started"
22.01.2018 23:11:08 - "Test Case 'Code list values' started"
22.01.2018 23:11:08 - "Test Assertion 'tn-as.a.1: AccessRestrictionValue attributes': PASSED - 7 ms"
22.01.2018 23:11:08 - "Test Assertion 'tn-as.a.2: RestrictionTypeValue attributes': PASSED - 7 ms"
22.01.2018 23:11:08 - "Test Case 'Code list values' finished: PASSED"
22.01.2018 23:11:08 - "Test Case 'Constraints' started"
22.01.2018 23:11:08 - "Test Assertion 'tn-as.b.1: TrafficFlowDirection can only be associated with a spatial object of the type Link or LinkSequence.': PASSED - 0 ms"
22.01.2018 23:11:08 - "Test Assertion 'tn-as.b.2: All transport areas have an external object identifier.': PASSED - 0 ms"
22.01.2018 23:11:08 - "Test Assertion 'tn-as.b.3: All transport links have an external object identifier.': PASSED - 0 ms"
22.01.2018 23:11:08 - "Test Assertion 'tn-as.b.4: All transport link sequences have an external object identifier.': PASSED - 0 ms"
22.01.2018 23:11:08 - "Test Assertion 'tn-as.b.5: All transport link sets have an external object identifier.': PASSED - 0 ms"
22.01.2018 23:11:08 - "Test Assertion 'tn-as.b.6: All transport nodes have an external object identifier.': PASSED - 1 ms"
22.01.2018 23:11:08 - "Test Assertion 'tn-as.b.7: All transport points have an external object identifier.': PASSED - 0 ms"
22.01.2018 23:11:08 - "Test Assertion 'tn-as.b.8: All transport properties have an external object identifier.': PASSED - 0 ms"
22.01.2018 23:11:08 - "Test Assertion 'tn-as.b.9: A transport link sequence must be composed of transport links that all belong to the same transport network.': PASSED - 0 ms"
22.01.2018 23:11:08 - "Test Assertion 'tn-as.b.10: A transport link set must be composed of transport links and or transport link sequences that all belong to the same transport network.': PASSED - 0 ms"
22.01.2018 23:11:08 - "Test Case 'Constraints' finished: PASSED"
22.01.2018 23:11:08 - "Test Case 'Geometry' started"
22.01.2018 23:11:08 - "Test Assertion 'tn-as.c.1: No free transport nodes': PASSED - 0 ms"
22.01.2018 23:11:08 - "Test Assertion 'tn-as.c.2: Intersections only at crossings': PASSED_MANUAL"
22.01.2018 23:11:08 - "Test Case 'Geometry' finished: PASSED_MANUAL"
22.01.2018 23:11:08 - "Test Case 'Network connectivity' started"
22.01.2018 23:11:08 - "Test Assertion 'tn-as.d.1: Connectivity at crossings': PASSED_MANUAL"
22.01.2018 23:11:08 - "Test Assertion 'tn-as.d.2: Unconnected nodes': PASSED_MANUAL"
22.01.2018 23:11:08 - "Test Assertion 'tn-as.d.3: Connectivity tolerance': PASSED_MANUAL"
22.01.2018 23:11:08 - "Test Case 'Network connectivity' finished: PASSED_MANUAL"
22.01.2018 23:11:08 - "Test Case 'Object References' started"
22.01.2018 23:11:08 - "Test Assertion 'tn-as.e.1: Linear references': PASSED_MANUAL"
22.01.2018 23:11:08 - "Test Assertion 'tn-as.e.2: Inter-modal connections': PASSED - 0 ms"
22.01.2018 23:11:08 - "Test Case 'Object References' finished: PASSED_MANUAL"
22.01.2018 23:11:08 - "Test Suite 'Conformance class: Application schema, Transport Networks Common' finished: PASSED_MANUAL"
22.01.2018 23:11:08 - Releasing resources
22.01.2018 23:11:08 - TestRunTask initialized
22.01.2018 23:11:08 - Skipping schema validation because no schema file has been set in the test suite. Data are only checked for well-formedness.
22.01.2018 23:11:08 - Validation ended with 0 error(s)
22.01.2018 23:11:08 - Compiling test script
22.01.2018 23:11:08 - Starting XQuery tests
22.01.2018 23:11:08 - "Testing 1 features"
22.01.2018 23:11:08 - "Executing Test Suite: /home/tomcat/.etf/projects/ets-repository/data-tn/tn-ro-as/ets-tn-ro-as-bsxets.xml"
22.01.2018 23:11:08 - "Statistics table: 1 ms"
22.01.2018 23:11:08 - "Test Suite 'Conformance class: Application schema, Road Transport Networks' started"
22.01.2018 23:11:08 - "Test Case 'Code list values' started"
22.01.2018 23:11:08 - "Test Assertion 'tn-ro-as.a.1: AreaConditionValue attributes': PASSED - 7 ms"
22.01.2018 23:11:08 - "Test Assertion 'tn-ro-as.a.2: FormOfRoadNodeValue attributes': PASSED - 6 ms"
22.01.2018 23:11:09 - "Test Assertion 'tn-ro-as.a.3: FormOfWayValue attributes': PASSED - 7 ms"
22.01.2018 23:11:09 - "Test Assertion 'tn-ro-as.a.4: RoadPartValue attributes': PASSED - 5 ms"
22.01.2018 23:11:09 - "Test Assertion 'tn-ro-as.a.5: RoadServiceTypeValue attributes': PASSED - 5 ms"
22.01.2018 23:11:09 - "Test Assertion 'tn-ro-as.a.6: RoadSurfaceCategoryValue attributes': PASSED - 5 ms"
22.01.2018 23:11:09 - "Test Assertion 'tn-ro-as.a.7: ServiceFacilityValue attributes': PASSED - 7 ms"
22.01.2018 23:11:09 - "Test Assertion 'tn-ro-as.a.8: SpeedLimitSourceValue attributes': PASSED - 19 ms"
22.01.2018 23:11:09 - "Test Assertion 'tn-ro-as.a.9: VehicleTypeValue attributes': PASSED - 9 ms"
22.01.2018 23:11:09 - "Test Assertion 'tn-ro-as.a.10: WeatherConditionValue attributes': PASSED - 5 ms"
22.01.2018 23:11:09 - "Test Case 'Code list values' finished: PASSED"
22.01.2018 23:11:09 - "Test Case 'Constraints' started"
22.01.2018 23:11:09 - "Test Assertion 'tn-ro-as.b.1: FormOfWay can only be associated with a spatial object that is part of a road transport network.': PASSED - 0 ms"
22.01.2018 23:11:09 - "Checking URL: 'https://zbgisws.skgeodesy.sk/inspire_transport_networks_wfs/service.svc/get?SERVICE=WFS&amp;VERSION=2.0.0&amp;REQUEST=GetFeature&amp;STOREDQUERY_ID=urn:ogc:def:query:OGC-WFS::GetFeatureById&amp;id=netElementL.1400000'"
22.01.2018 23:11:39 - "Exception: Timeout exceeded. URL: https://zbgisws.skgeodesy.sk/inspire_transport_networks_wfs/service.svc/get?SERVICE=WFS&amp;VERSION=2.0.0&amp;REQUEST=GetFeature&amp;STOREDQUERY_ID=urn:ogc:def:query:OGC-WFS::GetFeatureById&amp;id=netElementL.1400000"
22.01.2018 23:11:39 - "Test Assertion 'tn-ro-as.b.2: FunctionalRoadClass can only be associated with a spatial object that is part of a road transport network.': FAILED - 30008 ms"
22.01.2018 23:11:39 - "Test Assertion 'tn-ro-as.b.3: NumberOfLanes can only be associated with a spatial object that is part of a road transport network.': PASSED - 0 ms"
22.01.2018 23:11:39 - "Test Assertion 'tn-ro-as.b.4: RoadName can only be associated with a spatial object that is part of a road transport network.': PASSED - 0 ms"
22.01.2018 23:11:39 - "Test Assertion 'tn-ro-as.b.5: RoadSurfaceCategory can only be associated with a spatial object that is part of a road transport network.': PASSED - 0 ms"
22.01.2018 23:11:39 - "Test Assertion 'tn-ro-as.b.6: RoadWidth can only be associated with a spatial object that is part of a road transport network.': PASSED - 1 ms"
22.01.2018 23:11:39 - "Test Assertion 'tn-ro-as.b.7: SpeedLimit can only be associated with a spatial object that is part of a road transport network.': PASSED - 0 ms"
22.01.2018 23:11:39 - "Test Assertion 'tn-ro-as.b.8: RoadServiceType can only be associated with a spatial object of the type RoadServiceArea or RoadNode (when formOfRoadNode=roadServiceArea)': PASSED - 0 ms"
22.01.2018 23:11:39 - "Test Case 'Constraints' finished: FAILED"
22.01.2018 23:11:39 - "Test Case 'Link centrelines' started"
22.01.2018 23:11:39 - "Test Assertion 'tn-ro-as.c.1: Link centrelines test': PASSED_MANUAL"
22.01.2018 23:11:39 - "Test Case 'Link centrelines' finished: PASSED_MANUAL"
22.01.2018 23:11:39 - "Test Suite 'Conformance class: Application schema, Road Transport Networks' finished: FAILED"
22.01.2018 23:11:39 - Releasing resources
22.01.2018 23:11:39 - TestRunTask initialized
22.01.2018 23:11:39 - Skipping schema validation because no schema file has been set in the test suite. Data are only checked for well-formedness.
22.01.2018 23:11:39 - Validation ended with 0 error(s)
22.01.2018 23:11:39 - Compiling test script
22.01.2018 23:11:39 - Starting XQuery tests
22.01.2018 23:11:39 - "Testing 1 features"
22.01.2018 23:11:39 - "Indexing features (parsing errors: 0): 1 ms"
22.01.2018 23:11:39 - "Executing Test Suite: /home/tomcat/.etf/projects/ets-repository/data/data-consistency/ets-data-consistency-bsxets.xml"
22.01.2018 23:11:39 - "Statistics table: 1 ms"
22.01.2018 23:11:39 - "Test Suite 'Conformance class: Data consistency, General requirements' started"
22.01.2018 23:11:39 - "Test Case 'Version consistency' started"
22.01.2018 23:11:39 - "Test Assertion 'dc.a.1: Version lifespan plausible': PASSED - 0 ms"
22.01.2018 23:11:39 - "Test Assertion 'dc.a.2: Unique identifier persistency': PASSED_MANUAL"
22.01.2018 23:11:39 - "Test Assertion 'dc.a.3: Spatial object type stable': PASSED_MANUAL"
22.01.2018 23:11:39 - "Test Case 'Version consistency' finished: PASSED_MANUAL"
22.01.2018 23:11:39 - "Test Case 'Temporal consistency' started"
22.01.2018 23:11:39 - "Test Assertion 'dc.b.1: Valid time plausible': PASSED - 0 ms"
22.01.2018 23:11:39 - "Test Case 'Temporal consistency' finished: PASSED"
22.01.2018 23:11:39 - "Test Suite 'Conformance class: Data consistency, General requirements' finished: PASSED_MANUAL"
22.01.2018 23:11:40 - Releasing resources
22.01.2018 23:11:40 - TestRunTask initialized
22.01.2018 23:11:40 - Skipping schema validation because no schema file has been set in the test suite. Data are only checked for well-formedness.
22.01.2018 23:11:40 - Validation ended with 0 error(s)
22.01.2018 23:11:40 - Compiling test script
22.01.2018 23:11:40 - Starting XQuery tests
22.01.2018 23:11:40 - "Testing 1 features"
22.01.2018 23:11:40 - "Indexing features (parsing errors: 0): 1 ms"
22.01.2018 23:11:40 - "Executing Test Suite: /home/tomcat/.etf/projects/ets-repository/data-tn/tn-dc/ets-tn-dc-bsxets.xml"
22.01.2018 23:11:40 - "Statistics table: 0 ms"
22.01.2018 23:11:40 - "Test Suite 'Conformance class: Data consistency, Transport Networks' started"
22.01.2018 23:11:40 - "Test Case 'Spatial consistency' started"
22.01.2018 23:11:40 - "Test Assertion 'tn-dc.a.1: Each Transport Network Link or Node geometry is within a Network Area geometry (Road Transport Networks)': PASSED - 0 ms"
22.01.2018 23:11:40 - "Test Assertion 'tn-dc.a.2: Each Transport Network Link or Node geometry is within a Network Area geometry (Railway Transport Networks)': PASSED - 0 ms"
22.01.2018 23:11:40 - "Test Assertion 'tn-dc.a.3: Each Transport Network Link or Node geometry is within a Network Area geometry (Waterway Transport Networks)': PASSED - 0 ms"
22.01.2018 23:11:40 - "Test Assertion 'tn-dc.a.4: Each Transport Network Link or Node geometry is within a Network Area geometry (Air Transport Networks)': PASSED - 1 ms"
22.01.2018 23:11:40 - "Test Assertion 'tn-dc.a.5: Manual review': PASSED_MANUAL"
22.01.2018 23:11:40 - "Test Case 'Spatial consistency' finished: PASSED_MANUAL"
22.01.2018 23:11:40 - "Test Suite 'Conformance class: Data consistency, Transport Networks' finished: PASSED_MANUAL"
22.01.2018 23:11:40 - Releasing resources
22.01.2018 23:11:40 - TestRunTask initialized
22.01.2018 23:11:40 - Skipping schema validation because no schema file has been set in the test suite. Data are only checked for well-formedness.
22.01.2018 23:11:40 - Validation ended with 0 error(s)
22.01.2018 23:11:40 - Compiling test script
22.01.2018 23:11:40 - Starting XQuery tests
22.01.2018 23:11:40 - "Testing 1 features"
22.01.2018 23:11:40 - "Indexing features (parsing errors: 0): 0 ms"
22.01.2018 23:11:40 - "Executing Test Suite: /home/tomcat/.etf/projects/ets-repository/data/information-accessibility/ets-information-accessibility-bsxets.xml"
22.01.2018 23:11:40 - "Statistics table: 1 ms"
22.01.2018 23:11:40 - "Test Suite 'Conformance class: Information accessibility, General requirements' started"
22.01.2018 23:11:40 - "Test Case 'Coordinate reference systems (CRS)' started"
22.01.2018 23:11:40 - "Test Assertion 'ia.a.1: CRS publicly accessible via HTTP': PASSED - 0 ms"
22.01.2018 23:11:40 - "Test Case 'Coordinate reference systems (CRS)' finished: PASSED"
22.01.2018 23:11:40 - "Test Suite 'Conformance class: Information accessibility, General requirements' finished: PASSED"
22.01.2018 23:11:40 - Releasing resources
22.01.2018 23:11:40 - TestRunTask initialized
22.01.2018 23:11:40 - Skipping schema validation because no schema file has been set in the test suite. Data are only checked for well-formedness.
22.01.2018 23:11:40 - Validation ended with 0 error(s)
22.01.2018 23:11:40 - Compiling test script
22.01.2018 23:11:40 - Starting XQuery tests
22.01.2018 23:11:40 - "Testing 1 features"
22.01.2018 23:11:40 - "Executing Test Suite: /home/tomcat/.etf/projects/ets-repository/data-tn/tn-ia/ets-tn-ia-bsxets.xml"
22.01.2018 23:11:40 - "Statistics table: 1 ms"
22.01.2018 23:11:40 - "Test Suite 'Conformance class: Information accessibility, Transport Networks' started"
22.01.2018 23:11:40 - "Test Case 'Code lists' started"
22.01.2018 23:11:40 - "Test Assertion 'tn-ia.a.1: Code list extensions accessible': PASSED - 0 ms"
22.01.2018 23:11:40 - "Test Case 'Code lists' finished: PASSED"
22.01.2018 23:11:40 - "Test Case 'Feature references' started"
22.01.2018 23:11:40 - "Test Assertion 'tn-ia.b.1: MarkerPost.route': PASSED - 0 ms"
22.01.2018 23:11:40 - "Test Assertion 'tn-ia.b.2: TransportLinkSet.post': PASSED - 0 ms"
22.01.2018 23:11:40 - "Test Case 'Feature references' finished: PASSED"
22.01.2018 23:11:40 - "Test Suite 'Conformance class: Information accessibility, Transport Networks' finished: PASSED"
22.01.2018 23:11:41 - Releasing resources
22.01.2018 23:11:41 - TestRunTask initialized
22.01.2018 23:11:41 - Skipping schema validation because no schema file has been set in the test suite. Data are only checked for well-formedness.
22.01.2018 23:11:41 - Validation ended with 0 error(s)
22.01.2018 23:11:41 - Compiling test script
22.01.2018 23:11:41 - Starting XQuery tests
22.01.2018 23:11:41 - "Testing 1 features"
22.01.2018 23:11:41 - "Indexing features (parsing errors: 0): 0 ms"
22.01.2018 23:11:41 - "Executing Test Suite: /home/tomcat/.etf/projects/ets-repository/data/reference-systems/ets-reference-systems-bsxets.xml"
22.01.2018 23:11:41 - "Statistics table: 0 ms"
22.01.2018 23:11:41 - "Test Suite 'Conformance class: Reference systems, General requirements' started"
22.01.2018 23:11:41 - "Test Case 'Spatial reference systems' started"
22.01.2018 23:11:41 - "Test Assertion 'rs.a.1: Spatial reference systems in feature geometries': PASSED - 0 ms"
22.01.2018 23:11:41 - "Test Assertion 'rs.a.2: Default spatial reference systems in feature collections': PASSED - 0 ms"
22.01.2018 23:11:41 - "Test Case 'Spatial reference systems' finished: PASSED"
22.01.2018 23:11:41 - "Test Case 'Temporal reference systems' started"
22.01.2018 23:11:41 - "Test Assertion 'rs.a.3: Temporal reference systems in features': PASSED - 0 ms"
22.01.2018 23:11:41 - "Test Case 'Temporal reference systems' finished: PASSED"
22.01.2018 23:11:41 - "Test Suite 'Conformance class: Reference systems, General requirements' finished: PASSED"
22.01.2018 23:11:41 - Releasing resources
22.01.2018 23:11:41 - TestRunTask initialized
22.01.2018 23:11:41 - Skipping schema validation because no schema file has been set in the test suite. Data are only checked for well-formedness.
22.01.2018 23:11:41 - Validation ended with 0 error(s)
22.01.2018 23:11:41 - Compiling test script
22.01.2018 23:11:41 - Starting XQuery tests
22.01.2018 23:11:41 - "Testing 1 features"
22.01.2018 23:11:41 - "Executing Test Suite: /home/tomcat/.etf/projects/ets-repository/data-tn/tn-rs/ets-tn-rs-bsxets.xml"
22.01.2018 23:11:41 - "Statistics table: 0 ms"
22.01.2018 23:11:41 - "Test Suite 'Conformance class: Reference systems, Transport Networks' started"
22.01.2018 23:11:41 - "Test Case 'Additional theme-specific rules for reference systems' started"
22.01.2018 23:11:41 - "Test Assertion 'tn-rs.a.1: Test always passes': PASSED - 0 ms"
22.01.2018 23:11:41 - "Test Case 'Additional theme-specific rules for reference systems' finished: PASSED"
22.01.2018 23:11:41 - "Test Suite 'Conformance class: Reference systems, Transport Networks' finished: PASSED"
22.01.2018 23:11:42 - Releasing resources
22.01.2018 23:11:42 - Changed state from INITIALIZED to RUNNING
22.01.2018 23:11:42 - Duration: 47sec
22.01.2018 23:11:42 - TestRun finished
22.01.2018 23:11:42 - Changed state from RUNNING to COMPLETED
