06.02.2018 23:02:45 - Preparing Test Run interoperability_17316219_Geodetick&yacute;akartografick&yacute;&uacute;stavBratislava_tn-a:AerodromeArea (initiated Tue Feb 06 23:02:45 CET 2018)
06.02.2018 23:02:45 - Resolving Executable Test Suite dependencies
06.02.2018 23:02:45 - Preparing 11 Test Task:
06.02.2018 23:02:45 -  TestTask 1 (6442cf7e-bb15-4045-9695-1b3a501bdf48)
06.02.2018 23:02:45 -  will perform tests on Test Object 'get.xml' by using Executable Test Suite 'Conformance class: INSPIRE GML application schemas, General requirements (EID: 09820daf-62b2-4fa3-a95f-56a0d2b7c4d8, V: 0.2.4 )'
06.02.2018 23:02:45 -  with parameters: 
06.02.2018 23:02:45 - etf.testcases = *
06.02.2018 23:02:45 -  TestTask 2 (e3ba7054-98a8-4391-b61b-09ebe603bc1d)
06.02.2018 23:02:45 -  will perform tests on Test Object 'get.xml' by using Executable Test Suite 'LAZY.9af1c865-1cf0-43ff-9250-069df01b0948'
06.02.2018 23:02:45 -  with parameters: 
06.02.2018 23:02:45 - etf.testcases = *
06.02.2018 23:02:45 -  TestTask 3 (b7ecd21f-96c9-4eb1-8b21-ed41ce8d434d)
06.02.2018 23:02:45 -  will perform tests on Test Object 'get.xml' by using Executable Test Suite 'LAZY.4441cbde-371f-4899-90b3-145f4fd08ebc'
06.02.2018 23:02:45 -  with parameters: 
06.02.2018 23:02:45 - etf.testcases = *
06.02.2018 23:02:45 -  TestTask 4 (2763fc21-c2f2-4229-ba83-2f68fe4ef013)
06.02.2018 23:02:45 -  will perform tests on Test Object 'get.xml' by using Executable Test Suite 'Conformance class: Application schema, Air Transport Networks (EID: 6800c834-b4e0-4631-9209-73530fb9ccee, V: 0.2.1 )'
06.02.2018 23:02:45 -  with parameters: 
06.02.2018 23:02:45 - etf.testcases = *
06.02.2018 23:02:45 -  TestTask 5 (671baefc-79fb-4ea0-a39c-80f3558f460c)
06.02.2018 23:02:45 -  will perform tests on Test Object 'get.xml' by using Executable Test Suite 'LAZY.545f9e49-009b-4114-9333-7ca26413b5d4'
06.02.2018 23:02:45 -  with parameters: 
06.02.2018 23:02:45 - etf.testcases = *
06.02.2018 23:02:45 -  TestTask 6 (4f272407-8ad7-4224-9fc7-d6517136c06f)
06.02.2018 23:02:45 -  will perform tests on Test Object 'get.xml' by using Executable Test Suite 'LAZY.61070ae8-13cb-4303-a340-72c8b877b00a'
06.02.2018 23:02:45 -  with parameters: 
06.02.2018 23:02:45 - etf.testcases = *
06.02.2018 23:02:45 -  TestTask 7 (5172417c-c09b-47ca-8826-ba603b3187f4)
06.02.2018 23:02:45 -  will perform tests on Test Object 'get.xml' by using Executable Test Suite 'Conformance class: Data consistency, Transport Networks (EID: 733af9a0-312b-4f71-9aa2-977cd2134d23, V: 0.2.2 )'
06.02.2018 23:02:45 -  with parameters: 
06.02.2018 23:02:45 - etf.testcases = *
06.02.2018 23:02:45 -  TestTask 8 (9584a16d-db2c-4eaf-a296-3def9bd37438)
06.02.2018 23:02:45 -  will perform tests on Test Object 'get.xml' by using Executable Test Suite 'LAZY.499937ea-0590-42d2-bd7a-1cafff35ecdb'
06.02.2018 23:02:45 -  with parameters: 
06.02.2018 23:02:45 - etf.testcases = *
06.02.2018 23:02:45 -  TestTask 9 (929eeca2-301f-4fbe-9613-ace8baf55857)
06.02.2018 23:02:45 -  will perform tests on Test Object 'get.xml' by using Executable Test Suite 'Conformance class: Information accessibility, Transport Networks (EID: df5db9a4-b15f-4193-a6ff-6e9951af46f5, V: 0.2.2 )'
06.02.2018 23:02:45 -  with parameters: 
06.02.2018 23:02:45 - etf.testcases = *
06.02.2018 23:02:45 -  TestTask 10 (de2da9cf-b9a5-42a6-ba2a-3605fe8fedac)
06.02.2018 23:02:45 -  will perform tests on Test Object 'get.xml' by using Executable Test Suite 'LAZY.63f586f0-080c-493b-8ca2-9919427440cc'
06.02.2018 23:02:45 -  with parameters: 
06.02.2018 23:02:45 - etf.testcases = *
06.02.2018 23:02:45 -  TestTask 11 (74dd5d3b-bb07-4548-9a16-e8de7d07bbba)
06.02.2018 23:02:45 -  will perform tests on Test Object 'get.xml' by using Executable Test Suite 'Conformance class: Reference systems, Transport Networks (EID: 9d35024d-9dd7-43a9-afff-d5aea5f51595, V: 0.2.0 )'
06.02.2018 23:02:45 -  with parameters: 
06.02.2018 23:02:45 - etf.testcases = *
06.02.2018 23:02:45 - Test Tasks prepared and ready to be executed. Waiting for the scheduler to start.
06.02.2018 23:02:45 - Setting state to CREATED
06.02.2018 23:02:45 - Changed state from CREATED to INITIALIZING
06.02.2018 23:02:46 - Starting TestRun.11bbea75-d782-45a0-bf81-6a98feb36109 at 2018-02-06T23:02:47+01:00
06.02.2018 23:02:47 - Changed state from INITIALIZING to INITIALIZED
06.02.2018 23:02:47 - TestRunTask initialized
06.02.2018 23:02:47 - Creating new tests databases to speed up tests.
06.02.2018 23:02:47 - Skipping schema validation because no schema file has been set in the test suite. Data are only checked for well-formedness.
06.02.2018 23:02:47 - Optimizing last database etf-tdb-3a6d92a0-0cd0-4cb9-9b7d-12bf1a474f7d-0 
06.02.2018 23:02:47 - Import completed
06.02.2018 23:02:49 - Validation ended with 0 error(s)
06.02.2018 23:02:49 - Compiling test script
06.02.2018 23:02:49 - Starting XQuery tests
06.02.2018 23:02:50 - "Testing 1 features"
06.02.2018 23:02:51 - "Indexing features (parsing errors: 0): 117 ms"
06.02.2018 23:02:51 - "Executing Test Suite: /home/tomcat/.etf/projects/ets-repository/data/schemas/ets-schemas-bsxets.xml"
06.02.2018 23:02:51 - "Statistics table: 1 ms"
06.02.2018 23:02:51 - "Test Suite 'Conformance class: INSPIRE GML application schemas, General requirements' started"
06.02.2018 23:02:51 - "Test Case 'Schema' started"
06.02.2018 23:02:51 - "Test Assertion 'gmlas.a.1: Mapping of source data to INSPIRE': PASSED_MANUAL"
06.02.2018 23:02:51 - "Test Assertion 'gmlas.a.2: Modelling of additional spatial object types': PASSED_MANUAL"
06.02.2018 23:02:51 - "Test Case 'Schema' finished: PASSED_MANUAL"
06.02.2018 23:02:51 - "Test Case 'Schema validation' started"
06.02.2018 23:02:51 - "Test Assertion 'gmlas.b.1: xsi:schemaLocation attribute': PASSED - 0 ms"
06.02.2018 23:02:51 - "Validating get.xml"
06.02.2018 23:02:58 - "Duration: 7081 ms. Errors: 0."
06.02.2018 23:02:58 - "Test Assertion 'gmlas.b.2: validate XML documents': PASSED - 7081 ms"
06.02.2018 23:02:58 - "Test Case 'Schema validation' finished: PASSED"
06.02.2018 23:02:58 - "Test Case 'GML model' started"
06.02.2018 23:02:58 - "Test Assertion 'gmlas.c.1: Consistency with the GML model': PASSED - 0 ms"
06.02.2018 23:02:58 - "Test Assertion 'gmlas.c.2: nilReason attributes require xsi:nil=true': PASSED - 0 ms"
06.02.2018 23:02:58 - "Test Assertion 'gmlas.c.3: nilReason values': PASSED - 0 ms"
06.02.2018 23:02:58 - "Test Case 'GML model' finished: PASSED"
06.02.2018 23:02:58 - "Test Case 'Simple features' started"
06.02.2018 23:02:58 - "Test Assertion 'gmlas.d.1: No spatial topology objects': PASSED - 1 ms"
06.02.2018 23:02:58 - "Test Assertion 'gmlas.d.2: No non-linear interpolation': PASSED - 0 ms"
06.02.2018 23:02:58 - "Test Assertion 'gmlas.d.3: Surface geometry elements': PASSED - 1 ms"
06.02.2018 23:02:58 - "Test Assertion 'gmlas.d.4: No non-planar interpolation': PASSED - 0 ms"
06.02.2018 23:02:58 - "Test Assertion 'gmlas.d.5: Geometry elements': PASSED - 0 ms"
06.02.2018 23:02:58 - "Test Assertion 'gmlas.d.6: Point coordinates in gml:pos': PASSED - 0 ms"
06.02.2018 23:02:58 - "Test Assertion 'gmlas.d.7: Curve/Surface coordinates in gml:posList': PASSED - 0 ms"
06.02.2018 23:02:58 - "Test Assertion 'gmlas.d.8: No array property elements': PASSED - 1 ms"
06.02.2018 23:02:58 - "Test Assertion 'gmlas.d.9: 1, 2 or 3 coordinate dimensions': PASSED - 0 ms"
06.02.2018 23:02:58 - "Test Assertion 'gmlas.d.10: Validate geometries (1)': PASSED - 136 ms"
06.02.2018 23:02:58 - "Test Assertion 'gmlas.d.11: Validate geometries (2)': PASSED - 0 ms"
06.02.2018 23:02:58 - "Test Case 'Simple features' finished: PASSED"
06.02.2018 23:02:58 - "Test Case 'Code list values in basic data types' started"
06.02.2018 23:02:58 - "Test Assertion 'gmlas.e.1: GrammaticalNumber attributes': PASSED - 26 ms"
06.02.2018 23:02:58 - "Test Assertion 'gmlas.e.2: GrammaticalGender attributes': PASSED - 19 ms"
06.02.2018 23:02:58 - "Test Assertion 'gmlas.e.3: NameStatus attributes': PASSED - 12 ms"
06.02.2018 23:02:58 - "Test Assertion 'gmlas.e.4: Nativeness attributes': PASSED - 12 ms"
06.02.2018 23:02:58 - "Test Case 'Code list values in basic data types' finished: PASSED"
06.02.2018 23:02:58 - "Test Case 'Constraints' started"
06.02.2018 23:02:58 - "Test Assertion 'gmlas.f.1: At least one of the two attributes pronunciationSoundLink and pronunciationIPA shall not be void': PASSED - 0 ms"
06.02.2018 23:02:58 - "Test Case 'Constraints' finished: PASSED"
06.02.2018 23:02:58 - "Test Suite 'Conformance class: INSPIRE GML application schemas, General requirements' finished: PASSED_MANUAL"
06.02.2018 23:02:58 - Releasing resources
06.02.2018 23:02:58 - TestRunTask initialized
06.02.2018 23:02:58 - Recreating new tests databases as the Test Object has changed!
06.02.2018 23:02:58 - Skipping schema validation because no schema file has been set in the test suite. Data are only checked for well-formedness.
06.02.2018 23:02:58 - Optimizing last database etf-tdb-3a6d92a0-0cd0-4cb9-9b7d-12bf1a474f7d-0 
06.02.2018 23:02:58 - Import completed
06.02.2018 23:02:58 - Validation ended with 0 error(s)
06.02.2018 23:02:58 - Compiling test script
06.02.2018 23:02:58 - Starting XQuery tests
06.02.2018 23:02:58 - "Testing 1 features"
06.02.2018 23:02:58 - "Indexing features (parsing errors: 0): 42 ms"
06.02.2018 23:02:58 - "Executing Test Suite: /home/tomcat/.etf/projects/ets-repository/data-tn/tn-gml/ets-tn-gml-bsxets.xml"
06.02.2018 23:02:58 - "Statistics table: 0 ms"
06.02.2018 23:02:58 - "Test Suite 'Conformance class: GML application schemas, Transport Networks' started"
06.02.2018 23:02:58 - "Test Case 'Basic test' started"
06.02.2018 23:02:58 - "Test Assertion 'tn-gml.a.1: Transport Network feature in dataset': PASSED - 0 ms"
06.02.2018 23:02:58 - "Test Case 'Basic test' finished: PASSED"
06.02.2018 23:02:58 - "Test Suite 'Conformance class: GML application schemas, Transport Networks' finished: PASSED"
06.02.2018 23:02:59 - Releasing resources
06.02.2018 23:02:59 - TestRunTask initialized
06.02.2018 23:02:59 - Skipping schema validation because no schema file has been set in the test suite. Data are only checked for well-formedness.
06.02.2018 23:02:59 - Validation ended with 0 error(s)
06.02.2018 23:02:59 - Compiling test script
06.02.2018 23:02:59 - Starting XQuery tests
06.02.2018 23:02:59 - "Testing 1 features"
06.02.2018 23:02:59 - "Indexing features (parsing errors: 0): 45 ms"
06.02.2018 23:02:59 - "Executing Test Suite: /home/tomcat/.etf/projects/ets-repository/data-tn/tn-as/ets-tn-as-bsxets.xml"
06.02.2018 23:02:59 - "Statistics table: 0 ms"
06.02.2018 23:02:59 - "Test Suite 'Conformance class: Application schema, Transport Networks Common' started"
06.02.2018 23:02:59 - "Test Case 'Code list values' started"
06.02.2018 23:02:59 - "Test Assertion 'tn-as.a.1: AccessRestrictionValue attributes': PASSED - 25 ms"
06.02.2018 23:02:59 - "Test Assertion 'tn-as.a.2: RestrictionTypeValue attributes': PASSED - 24 ms"
06.02.2018 23:02:59 - "Test Case 'Code list values' finished: PASSED"
06.02.2018 23:02:59 - "Test Case 'Constraints' started"
06.02.2018 23:02:59 - "Test Assertion 'tn-as.b.1: TrafficFlowDirection can only be associated with a spatial object of the type Link or LinkSequence.': PASSED - 0 ms"
06.02.2018 23:02:59 - "Test Assertion 'tn-as.b.2: All transport areas have an external object identifier.': PASSED - 0 ms"
06.02.2018 23:02:59 - "Test Assertion 'tn-as.b.3: All transport links have an external object identifier.': PASSED - 0 ms"
06.02.2018 23:02:59 - "Test Assertion 'tn-as.b.4: All transport link sequences have an external object identifier.': PASSED - 0 ms"
06.02.2018 23:02:59 - "Test Assertion 'tn-as.b.5: All transport link sets have an external object identifier.': PASSED - 0 ms"
06.02.2018 23:02:59 - "Test Assertion 'tn-as.b.6: All transport nodes have an external object identifier.': PASSED - 0 ms"
06.02.2018 23:02:59 - "Test Assertion 'tn-as.b.7: All transport points have an external object identifier.': PASSED - 0 ms"
06.02.2018 23:02:59 - "Test Assertion 'tn-as.b.8: All transport properties have an external object identifier.': PASSED - 0 ms"
06.02.2018 23:02:59 - "Test Assertion 'tn-as.b.9: A transport link sequence must be composed of transport links that all belong to the same transport network.': PASSED - 0 ms"
06.02.2018 23:02:59 - "Test Assertion 'tn-as.b.10: A transport link set must be composed of transport links and or transport link sequences that all belong to the same transport network.': PASSED - 0 ms"
06.02.2018 23:02:59 - "Test Case 'Constraints' finished: PASSED"
06.02.2018 23:02:59 - "Test Case 'Geometry' started"
06.02.2018 23:02:59 - "Test Assertion 'tn-as.c.1: No free transport nodes': PASSED - 0 ms"
06.02.2018 23:02:59 - "Test Assertion 'tn-as.c.2: Intersections only at crossings': PASSED_MANUAL"
06.02.2018 23:02:59 - "Test Case 'Geometry' finished: PASSED_MANUAL"
06.02.2018 23:02:59 - "Test Case 'Network connectivity' started"
06.02.2018 23:02:59 - "Test Assertion 'tn-as.d.1: Connectivity at crossings': PASSED_MANUAL"
06.02.2018 23:02:59 - "Test Assertion 'tn-as.d.2: Unconnected nodes': PASSED_MANUAL"
06.02.2018 23:02:59 - "Test Assertion 'tn-as.d.3: Connectivity tolerance': PASSED_MANUAL"
06.02.2018 23:02:59 - "Test Case 'Network connectivity' finished: PASSED_MANUAL"
06.02.2018 23:02:59 - "Test Case 'Object References' started"
06.02.2018 23:02:59 - "Test Assertion 'tn-as.e.1: Linear references': PASSED_MANUAL"
06.02.2018 23:02:59 - "Test Assertion 'tn-as.e.2: Inter-modal connections': PASSED - 0 ms"
06.02.2018 23:02:59 - "Test Case 'Object References' finished: PASSED_MANUAL"
06.02.2018 23:02:59 - "Test Suite 'Conformance class: Application schema, Transport Networks Common' finished: PASSED_MANUAL"
06.02.2018 23:02:59 - Releasing resources
06.02.2018 23:02:59 - TestRunTask initialized
06.02.2018 23:02:59 - Skipping schema validation because no schema file has been set in the test suite. Data are only checked for well-formedness.
06.02.2018 23:02:59 - Validation ended with 0 error(s)
06.02.2018 23:02:59 - Compiling test script
06.02.2018 23:02:59 - Starting XQuery tests
06.02.2018 23:02:59 - "Testing 1 features"
06.02.2018 23:02:59 - "Executing Test Suite: /home/tomcat/.etf/projects/ets-repository/data-tn/tn-a-as/ets-tn-a-as-bsxets.xml"
06.02.2018 23:02:59 - "Statistics table: 1 ms"
06.02.2018 23:02:59 - "Test Suite 'Conformance class: Application schema, Air Transport Networks' started"
06.02.2018 23:02:59 - "Test Case 'Code list values' started"
06.02.2018 23:02:59 - "Test Assertion 'tn-a-as.a.1: AerodromeCategoryValue attributes': PASSED - 19 ms"
06.02.2018 23:02:59 - "Test Assertion 'tn-a-as.a.2: AerodromeTypeValue attributes': PASSED - 18 ms"
06.02.2018 23:02:59 - "Test Assertion 'tn-a-as.a.3: AirRouteLinkClassValue attributes': PASSED - 11 ms"
06.02.2018 23:02:59 - "Test Assertion 'tn-a-as.a.4: AirRouteTypeValue attributes': PASSED - 17 ms"
06.02.2018 23:02:59 - "Test Assertion 'tn-a-as.a.5: AirUseRestrictionValue attributes': PASSED - 13 ms"
06.02.2018 23:02:59 - "Test Assertion 'tn-a-as.a.6: AirspaceAreaTypeValue attributes': PASSED - 23 ms"
06.02.2018 23:02:59 - "Test Assertion 'tn-a-as.a.7: NavaidTypeValue attributes': PASSED - 20 ms"
06.02.2018 23:02:59 - "Test Assertion 'tn-a-as.a.8: PointRoleValue attributes': PASSED - 9 ms"
06.02.2018 23:02:59 - "Test Assertion 'tn-a-as.a.9: RunwayTypeValue attributes': PASSED - 12 ms"
06.02.2018 23:02:59 - "Test Assertion 'tn-a-as.a.10: SurfaceCompositionValue attributes': PASSED - 13 ms"
06.02.2018 23:02:59 - "Test Case 'Code list values' finished: PASSED"
06.02.2018 23:02:59 - "Test Case 'Constraints' started"
06.02.2018 23:02:59 - "Test Assertion 'tn-a-as.b.1: AerodromeCategory can only be associated with a spatial object that is an Aerodrome Node or an Aerodrome Area.': PASSED - 1 ms"
06.02.2018 23:02:59 - "Test Assertion 'tn-a-as.b.2: AerodromeType can only be associated with a spatial object that is an Aerodrome Node or an Aerodrome Area.': PASSED - 0 ms"
06.02.2018 23:02:59 - "Test Assertion 'tn-a-as.b.3: ConditionOfAirFacility can only be associated with a spatial object that is an Aerodrome Node, an Aerodrome Area or a Runway Area.': PASSED - 0 ms"
06.02.2018 23:02:59 - "Test Assertion 'tn-a-as.b.4: ElementLength can only be associated with a spatial object that is an a Runway Area, Taxiway Area or Touch Down Lift Off.': PASSED - 0 ms"
06.02.2018 23:02:59 - "Test Assertion 'tn-a-as.b.5: ElementWidth can only be associated with a spatial object that is a Runway Area, Taxiway Area or Touch Down Lift Off.': PASSED - 0 ms"
06.02.2018 23:02:59 - "Test Assertion 'tn-a-as.b.6: FieldElevation can only be associated with a spatial object that is an Aerodrome Node or an Aerodrome Area.': PASSED - 0 ms"
06.02.2018 23:02:59 - "Test Assertion 'tn-a-as.b.7: LowerAltitudeLimit can only be associated with a spatial object that is an Air Route Link or Airspace Area.': PASSED - 0 ms"
06.02.2018 23:02:59 - "Test Assertion 'tn-a-as.b.8: SurfaceComposition can only be associated with a spatial object that is a Runway Area, Taxiway Area, Apron Area or Touch Down Lift Off.': PASSED - 0 ms"
06.02.2018 23:02:59 - "Test Assertion 'tn-a-as.b.9: UpperAltitudeLimit can only be associated with a spatial object that is an Air Route Link or Airspace Area.': PASSED - 0 ms"
06.02.2018 23:02:59 - "Test Assertion 'tn-a-as.b.10: UseRestriction can only be associated with a spatial object that is an Air Route, Air Link (or specialized Air Link), Air Node (or specialized Air Node) or Aerodrome Area.': PASSED - 0 ms"
06.02.2018 23:02:59 - "Test Case 'Constraints' finished: PASSED"
06.02.2018 23:02:59 - "Test Suite 'Conformance class: Application schema, Air Transport Networks' finished: PASSED"
06.02.2018 23:03:00 - Releasing resources
06.02.2018 23:03:00 - TestRunTask initialized
06.02.2018 23:03:00 - Skipping schema validation because no schema file has been set in the test suite. Data are only checked for well-formedness.
06.02.2018 23:03:00 - Validation ended with 0 error(s)
06.02.2018 23:03:00 - Compiling test script
06.02.2018 23:03:00 - Starting XQuery tests
06.02.2018 23:03:00 - "Testing 1 features"
06.02.2018 23:03:00 - "Executing Test Suite: /home/tomcat/.etf/projects/ets-repository/data-encoding/inspire-gml/ets-inspire-gml-bsxets.xml"
06.02.2018 23:03:00 - "Statistics table: 1 ms"
06.02.2018 23:03:00 - "Test Suite 'Conformance class: INSPIRE GML encoding' started"
06.02.2018 23:03:00 - "Test Case 'Basic tests' started"
06.02.2018 23:03:00 - "Test Assertion 'gml.a.1: Errors loading the XML documents': PASSED - 0 ms"
06.02.2018 23:03:00 - "Test Assertion 'gml.a.2: Document root element': PASSED - 0 ms"
06.02.2018 23:03:00 - "Test Assertion 'gml.a.3: Character encoding': NOT_APPLICABLE"
06.02.2018 23:03:00 - "Test Case 'Basic tests' finished: PASSED"
06.02.2018 23:03:00 - "Test Suite 'Conformance class: INSPIRE GML encoding' finished: PASSED"
06.02.2018 23:03:00 - Releasing resources
06.02.2018 23:03:00 - TestRunTask initialized
06.02.2018 23:03:00 - Skipping schema validation because no schema file has been set in the test suite. Data are only checked for well-formedness.
06.02.2018 23:03:00 - Validation ended with 0 error(s)
06.02.2018 23:03:00 - Compiling test script
06.02.2018 23:03:00 - Starting XQuery tests
06.02.2018 23:03:00 - "Testing 1 features"
06.02.2018 23:03:00 - "Indexing features (parsing errors: 0): 42 ms"
06.02.2018 23:03:00 - "Executing Test Suite: /home/tomcat/.etf/projects/ets-repository/data/data-consistency/ets-data-consistency-bsxets.xml"
06.02.2018 23:03:00 - "Statistics table: 1 ms"
06.02.2018 23:03:00 - "Test Suite 'Conformance class: Data consistency, General requirements' started"
06.02.2018 23:03:00 - "Test Case 'Version consistency' started"
06.02.2018 23:03:00 - "Test Assertion 'dc.a.1: Version lifespan plausible': PASSED - 0 ms"
06.02.2018 23:03:00 - "Test Assertion 'dc.a.2: Unique identifier persistency': PASSED_MANUAL"
06.02.2018 23:03:00 - "Test Assertion 'dc.a.3: Spatial object type stable': PASSED_MANUAL"
06.02.2018 23:03:00 - "Test Case 'Version consistency' finished: PASSED_MANUAL"
06.02.2018 23:03:00 - "Test Case 'Temporal consistency' started"
06.02.2018 23:03:00 - "Test Assertion 'dc.b.1: Valid time plausible': PASSED - 0 ms"
06.02.2018 23:03:00 - "Test Case 'Temporal consistency' finished: PASSED"
06.02.2018 23:03:00 - "Test Suite 'Conformance class: Data consistency, General requirements' finished: PASSED_MANUAL"
06.02.2018 23:03:00 - Releasing resources
06.02.2018 23:03:00 - TestRunTask initialized
06.02.2018 23:03:00 - Skipping schema validation because no schema file has been set in the test suite. Data are only checked for well-formedness.
06.02.2018 23:03:00 - Validation ended with 0 error(s)
06.02.2018 23:03:00 - Compiling test script
06.02.2018 23:03:00 - Starting XQuery tests
06.02.2018 23:03:00 - "Testing 1 features"
06.02.2018 23:03:00 - "Indexing features (parsing errors: 0): 46 ms"
06.02.2018 23:03:00 - "Executing Test Suite: /home/tomcat/.etf/projects/ets-repository/data-tn/tn-dc/ets-tn-dc-bsxets.xml"
06.02.2018 23:03:00 - "Statistics table: 1 ms"
06.02.2018 23:03:00 - "Test Suite 'Conformance class: Data consistency, Transport Networks' started"
06.02.2018 23:03:00 - "Test Case 'Spatial consistency' started"
06.02.2018 23:03:00 - "Test Assertion 'tn-dc.a.1: Each Transport Network Link or Node geometry is within a Network Area geometry (Road Transport Networks)': PASSED - 0 ms"
06.02.2018 23:03:00 - "Test Assertion 'tn-dc.a.2: Each Transport Network Link or Node geometry is within a Network Area geometry (Railway Transport Networks)': PASSED - 0 ms"
06.02.2018 23:03:00 - "Test Assertion 'tn-dc.a.3: Each Transport Network Link or Node geometry is within a Network Area geometry (Waterway Transport Networks)': PASSED - 0 ms"
06.02.2018 23:03:00 - "Test Assertion 'tn-dc.a.4: Each Transport Network Link or Node geometry is within a Network Area geometry (Air Transport Networks)': PASSED - 0 ms"
06.02.2018 23:03:00 - "Test Assertion 'tn-dc.a.5: Manual review': PASSED_MANUAL"
06.02.2018 23:03:00 - "Test Case 'Spatial consistency' finished: PASSED_MANUAL"
06.02.2018 23:03:00 - "Test Suite 'Conformance class: Data consistency, Transport Networks' finished: PASSED_MANUAL"
06.02.2018 23:03:01 - Releasing resources
06.02.2018 23:03:01 - TestRunTask initialized
06.02.2018 23:03:01 - Skipping schema validation because no schema file has been set in the test suite. Data are only checked for well-formedness.
06.02.2018 23:03:01 - Validation ended with 0 error(s)
06.02.2018 23:03:01 - Compiling test script
06.02.2018 23:03:01 - Starting XQuery tests
06.02.2018 23:03:01 - "Testing 1 features"
06.02.2018 23:03:01 - "Indexing features (parsing errors: 0): 44 ms"
06.02.2018 23:03:01 - "Executing Test Suite: /home/tomcat/.etf/projects/ets-repository/data/information-accessibility/ets-information-accessibility-bsxets.xml"
06.02.2018 23:03:01 - "Statistics table: 0 ms"
06.02.2018 23:03:01 - "Test Suite 'Conformance class: Information accessibility, General requirements' started"
06.02.2018 23:03:01 - "Test Case 'Coordinate reference systems (CRS)' started"
06.02.2018 23:03:01 - "Test Assertion 'ia.a.1: CRS publicly accessible via HTTP': FAILED - 1 ms"
06.02.2018 23:03:01 - "Test Case 'Coordinate reference systems (CRS)' finished: FAILED"
06.02.2018 23:03:01 - "Test Suite 'Conformance class: Information accessibility, General requirements' finished: FAILED"
06.02.2018 23:03:01 - Releasing resources
06.02.2018 23:03:01 - TestRunTask initialized
06.02.2018 23:03:01 - Skipping schema validation because no schema file has been set in the test suite. Data are only checked for well-formedness.
06.02.2018 23:03:01 - Validation ended with 0 error(s)
06.02.2018 23:03:01 - Compiling test script
06.02.2018 23:03:01 - Starting XQuery tests
06.02.2018 23:03:01 - "Testing 1 features"
06.02.2018 23:03:01 - "Executing Test Suite: /home/tomcat/.etf/projects/ets-repository/data-tn/tn-ia/ets-tn-ia-bsxets.xml"
06.02.2018 23:03:01 - "Statistics table: 1 ms"
06.02.2018 23:03:01 - "Test Suite 'Conformance class: Information accessibility, Transport Networks' started"
06.02.2018 23:03:01 - "Test Case 'Code lists' started"
06.02.2018 23:03:01 - "Test Assertion 'tn-ia.a.1: Code list extensions accessible': PASSED - 0 ms"
06.02.2018 23:03:01 - "Test Case 'Code lists' finished: PASSED"
06.02.2018 23:03:01 - "Test Case 'Feature references' started"
06.02.2018 23:03:01 - "Test Assertion 'tn-ia.b.1: MarkerPost.route': PASSED - 0 ms"
06.02.2018 23:03:01 - "Test Assertion 'tn-ia.b.2: TransportLinkSet.post': PASSED - 0 ms"
06.02.2018 23:03:01 - "Test Case 'Feature references' finished: PASSED"
06.02.2018 23:03:01 - "Test Suite 'Conformance class: Information accessibility, Transport Networks' finished: PASSED"
06.02.2018 23:03:01 - Releasing resources
06.02.2018 23:03:01 - TestRunTask initialized
06.02.2018 23:03:01 - Skipping schema validation because no schema file has been set in the test suite. Data are only checked for well-formedness.
06.02.2018 23:03:01 - Validation ended with 0 error(s)
06.02.2018 23:03:01 - Compiling test script
06.02.2018 23:03:01 - Starting XQuery tests
06.02.2018 23:03:01 - "Testing 1 features"
06.02.2018 23:03:01 - "Indexing features (parsing errors: 0): 41 ms"
06.02.2018 23:03:01 - "Executing Test Suite: /home/tomcat/.etf/projects/ets-repository/data/reference-systems/ets-reference-systems-bsxets.xml"
06.02.2018 23:03:01 - "Statistics table: 0 ms"
06.02.2018 23:03:01 - "Test Suite 'Conformance class: Reference systems, General requirements' started"
06.02.2018 23:03:01 - "Test Case 'Spatial reference systems' started"
06.02.2018 23:03:01 - "Test Assertion 'rs.a.1: Spatial reference systems in feature geometries': FAILED - 0 ms"
06.02.2018 23:03:01 - "Test Assertion 'rs.a.2: Default spatial reference systems in feature collections': PASSED - 1 ms"
06.02.2018 23:03:01 - "Test Case 'Spatial reference systems' finished: FAILED"
06.02.2018 23:03:01 - "Test Case 'Temporal reference systems' started"
06.02.2018 23:03:01 - "Test Assertion 'rs.a.3: Temporal reference systems in features': PASSED - 0 ms"
06.02.2018 23:03:01 - "Test Case 'Temporal reference systems' finished: PASSED"
06.02.2018 23:03:01 - "Test Suite 'Conformance class: Reference systems, General requirements' finished: FAILED"
06.02.2018 23:03:02 - Releasing resources
06.02.2018 23:03:02 - TestRunTask initialized
06.02.2018 23:03:02 - Skipping schema validation because no schema file has been set in the test suite. Data are only checked for well-formedness.
06.02.2018 23:03:02 - Validation ended with 0 error(s)
06.02.2018 23:03:02 - Compiling test script
06.02.2018 23:03:02 - Starting XQuery tests
06.02.2018 23:03:02 - "Testing 1 features"
06.02.2018 23:03:02 - "Executing Test Suite: /home/tomcat/.etf/projects/ets-repository/data-tn/tn-rs/ets-tn-rs-bsxets.xml"
06.02.2018 23:03:02 - "Statistics table: 1 ms"
06.02.2018 23:03:02 - "Test Suite 'Conformance class: Reference systems, Transport Networks' started"
06.02.2018 23:03:02 - "Test Case 'Additional theme-specific rules for reference systems' started"
06.02.2018 23:03:02 - "Test Assertion 'tn-rs.a.1: Test always passes': PASSED - 0 ms"
06.02.2018 23:03:02 - "Test Case 'Additional theme-specific rules for reference systems' finished: PASSED"
06.02.2018 23:03:02 - "Test Suite 'Conformance class: Reference systems, Transport Networks' finished: PASSED"
06.02.2018 23:03:02 - Releasing resources
06.02.2018 23:03:02 - Changed state from INITIALIZED to RUNNING
06.02.2018 23:03:02 - Duration: 16sec
06.02.2018 23:03:02 - TestRun finished
06.02.2018 23:03:02 - Changed state from RUNNING to COMPLETED
