16.11.2017 01:05:20 - Preparing Test Run downloadService (initiated Thu Nov 16 01:05:20 CET 2017)
16.11.2017 01:05:20 - Resolving Executable Test Suite dependencies
16.11.2017 01:05:20 - Preparing 2 Test Task:
16.11.2017 01:05:20 -  TestTask 1 (e4725e4c-f0d4-450f-8276-904c0310812c)
16.11.2017 01:05:20 -  will perform tests on Test Object 'INSPIRE Download Service - Transport Networks' by using Executable Test Suite 'WFS 2.0 (OGC 09-025r2/ISO 19142) Conformance Test Suite (EID: 95a1b6fc-2b55-3d43-9502-3b8b605bda10, V: 1.26.0 )'
16.11.2017 01:05:20 -  with parameters: 
16.11.2017 01:05:20 - etf.testcases = *
16.11.2017 01:05:20 -  TestTask 2 (decbd3a5-c689-4cda-a9c8-9088ca31a52a)
16.11.2017 01:05:20 -  will perform tests on Test Object 'INSPIRE Download Service - Transport Networks' by using Executable Test Suite 'Conformance Class: Download Service - Direct WFS (EID: ed2d3501-d700-4ff9-b9bf-070dece8ddbd, V: 1.0.0 )'
16.11.2017 01:05:20 -  with parameters: 
16.11.2017 01:05:20 - etf.testcases = *
16.11.2017 01:05:20 - Test Tasks prepared and ready to be executed. Waiting for the scheduler to start.
16.11.2017 01:05:20 - Setting state to CREATED
16.11.2017 01:05:20 - Changed state from CREATED to INITIALIZING
16.11.2017 01:05:21 - Starting TestRun.7c6f1343-9211-430c-a742-a09bdd9194e8 at 2017-11-16T01:05:22+01:00
16.11.2017 01:05:22 - Changed state from INITIALIZING to INITIALIZED
16.11.2017 01:05:22 - TestRunTask initialized
16.11.2017 01:05:25 - Releasing resources
16.11.2017 01:05:25 - Project Properties: 
16.11.2017 01:05:25 - etf.testcases - * 
16.11.2017 01:05:25 - download.1 - file:/home/tomcat/.etf/testdata/get.xml-eb934676-4d88-46f3-abe0-97123ac4424e/ 
16.11.2017 01:05:25 - data - https://test-zbgisws.skgeodesy.sk/inspire_transport_networks_wfs/service.svc/get?service=WFS&request=GetCapabilities 
16.11.2017 01:05:25 - username -  
16.11.2017 01:05:25 - authUser -  
16.11.2017 01:05:25 - authMethod - basic 
16.11.2017 01:05:25 - TestRunTask initialized
16.11.2017 01:05:25 ERROR Exception occurred in Test Step: java.lang.NullPointerException
16.11.2017 01:05:25 ERROR Exception occurred in Test Step: java.lang.NullPointerException
16.11.2017 01:05:25 ERROR Exception occurred in Test Step: java.lang.NullPointerException
16.11.2017 01:05:25 ERROR Exception occurred in Test Step: java.lang.NullPointerException
16.11.2017 01:05:25 ERROR Exception occurred in Test Step: java.lang.NullPointerException
16.11.2017 01:05:25 - Releasing resources
16.11.2017 01:05:25 - Changed state from INITIALIZED to RUNNING
16.11.2017 01:05:25 - Duration: 4sec
16.11.2017 01:05:25 - TestRun finished
16.11.2017 01:05:25 - Changed state from RUNNING to COMPLETED
