06.12.2017 19:15:49 - Preparing Test Run metadata_17316219_Geodetick&yacute; a kartografick&yacute; &uacute;stav Bratislava(GK&Uacute;)_INSPIRE Ukladacia služba &ndash; Spr&aacute;vne jednotky (initiated Wed Dec 06 19:15:49 CET 2017)
06.12.2017 19:15:49 - Resolving Executable Test Suite dependencies
06.12.2017 19:15:49 - Preparing 2 Test Task:
06.12.2017 19:15:49 -  TestTask 1 (23062eaa-a1b7-476d-ad23-9a88a1973089)
06.12.2017 19:15:49 -  will perform tests on Test Object 'get.xml' by using Executable Test Suite 'LAZY.e3500038-e37c-4dcf-806c-6bc82d585b3b'
06.12.2017 19:15:49 -  with parameters: 
06.12.2017 19:15:49 - etf.testcases = *
06.12.2017 19:15:49 -  TestTask 2 (a8153f75-2a0d-4356-bbf0-fa69ff7c14ae)
06.12.2017 19:15:49 -  will perform tests on Test Object 'get.xml' by using Executable Test Suite 'Conformance class: INSPIRE Profile based on EN ISO 19115 and EN ISO 19119 (EID: ec7323d5-d8f0-4cfe-b23a-b826df86d58c, V: 0.2.4 )'
06.12.2017 19:15:49 -  with parameters: 
06.12.2017 19:15:49 - etf.testcases = *
06.12.2017 19:15:49 - Test Tasks prepared and ready to be executed. Waiting for the scheduler to start.
06.12.2017 19:15:49 - Setting state to CREATED
06.12.2017 19:15:49 - Changed state from CREATED to INITIALIZING
06.12.2017 19:15:49 - Starting TestRun.b4c38b5e-9848-4e19-b9fd-59e67a79f93f at 2017-12-06T19:15:51+01:00
06.12.2017 19:15:51 - Changed state from INITIALIZING to INITIALIZED
06.12.2017 19:15:51 - TestRunTask initialized
06.12.2017 19:15:51 - Creating new tests databases to speed up tests.
06.12.2017 19:15:51 - Skipping schema validation because no schema file has been set in the test suite. Data are only checked for well-formedness.
06.12.2017 19:15:51 - Optimizing last database etf-tdb-8fffdb6a-6dde-4461-8e0f-1f1548c62bc7-0 
06.12.2017 19:15:51 - Import completed
06.12.2017 19:15:51 - Validation ended with 0 error(s)
06.12.2017 19:15:51 - Duration: 1sec
06.12.2017 19:15:51 - TestRun finished
