31.01.2018 00:26:12 - Preparing Test Run sk_testing_inspire_resources_app__undefined__RUN__cp__CadastralZoning__E (initiated Wed Jan 31 00:26:12 CET 2018)
31.01.2018 00:26:12 - Resolving Executable Test Suite dependencies
31.01.2018 00:26:12 - Preparing 10 Test Task:
31.01.2018 00:26:12 -  TestTask 1 (28330642-e363-4936-a261-ef5af4238143)
31.01.2018 00:26:12 -  will perform tests on Test Object 'service.xml' by using Executable Test Suite 'LAZY.545f9e49-009b-4114-9333-7ca26413b5d4'
31.01.2018 00:26:12 -  with parameters: 
31.01.2018 00:26:12 - etf.testcases = *
31.01.2018 00:26:12 -  TestTask 2 (5694b256-a734-486c-a275-7bcf4d956edd)
31.01.2018 00:26:12 -  will perform tests on Test Object 'service.xml' by using Executable Test Suite 'LAZY.09820daf-62b2-4fa3-a95f-56a0d2b7c4d8'
31.01.2018 00:26:12 -  with parameters: 
31.01.2018 00:26:12 - etf.testcases = *
31.01.2018 00:26:12 -  TestTask 3 (2b9b2187-db6c-46ba-a059-0399a4fdf15b)
31.01.2018 00:26:12 -  will perform tests on Test Object 'service.xml' by using Executable Test Suite 'LAZY.18b742d0-15eb-421f-bbec-7c8c5cf7ee1a'
31.01.2018 00:26:12 -  with parameters: 
31.01.2018 00:26:12 - etf.testcases = *
31.01.2018 00:26:12 -  TestTask 4 (d39fba5b-80cf-42a8-be1f-64ff192290a9)
31.01.2018 00:26:12 -  will perform tests on Test Object 'service.xml' by using Executable Test Suite 'Conformance class: Application Schema, Cadastral parcel (EID: 1f9bc92a-5879-4e9b-bcbe-1d2d0cab0aab, V: 0.2.2 )'
31.01.2018 00:26:12 -  with parameters: 
31.01.2018 00:26:12 - etf.testcases = *
31.01.2018 00:26:12 -  TestTask 5 (f6b0c512-b773-4e4b-8bcd-13f32bceacfa)
31.01.2018 00:26:12 -  will perform tests on Test Object 'service.xml' by using Executable Test Suite 'LAZY.61070ae8-13cb-4303-a340-72c8b877b00a'
31.01.2018 00:26:12 -  with parameters: 
31.01.2018 00:26:12 - etf.testcases = *
31.01.2018 00:26:12 -  TestTask 6 (50c28d5c-6c6d-4f5a-8f1d-062a821b8105)
31.01.2018 00:26:12 -  will perform tests on Test Object 'service.xml' by using Executable Test Suite 'Conformance class: Data consistency, Cadastral Parcels (EID: 92032cdb-db88-42aa-96c0-70a1af9e68b1, V: 0.2.0 )'
31.01.2018 00:26:12 -  with parameters: 
31.01.2018 00:26:12 - etf.testcases = *
31.01.2018 00:26:12 -  TestTask 7 (6ec68970-f618-4ae9-82e8-6cf590882720)
31.01.2018 00:26:12 -  will perform tests on Test Object 'service.xml' by using Executable Test Suite 'LAZY.499937ea-0590-42d2-bd7a-1cafff35ecdb'
31.01.2018 00:26:12 -  with parameters: 
31.01.2018 00:26:12 - etf.testcases = *
31.01.2018 00:26:12 -  TestTask 8 (720bfd4c-7ab3-4ea2-8ed2-157ea71e020b)
31.01.2018 00:26:12 -  will perform tests on Test Object 'service.xml' by using Executable Test Suite 'Conformance class: Information accessibility, Cadastral Parcels (EID: c4fbae00-3070-49fa-b803-24c66c31ac70, V: 0.2.1 )'
31.01.2018 00:26:12 -  with parameters: 
31.01.2018 00:26:12 - etf.testcases = *
31.01.2018 00:26:12 -  TestTask 9 (ea90d920-e572-4122-83cc-8adefa6e67d1)
31.01.2018 00:26:12 -  will perform tests on Test Object 'service.xml' by using Executable Test Suite 'LAZY.63f586f0-080c-493b-8ca2-9919427440cc'
31.01.2018 00:26:12 -  with parameters: 
31.01.2018 00:26:12 - etf.testcases = *
31.01.2018 00:26:12 -  TestTask 10 (27cdfe96-ccd5-4e96-895b-b8c0da9ea6f3)
31.01.2018 00:26:12 -  will perform tests on Test Object 'service.xml' by using Executable Test Suite 'Conformance class: Reference Systems, Cadastral Parcels (EID: dbcc48ae-6871-4444-8e95-547bc22aacb2, V: 0.2.1 )'
31.01.2018 00:26:12 -  with parameters: 
31.01.2018 00:26:12 - etf.testcases = *
31.01.2018 00:26:12 - Test Tasks prepared and ready to be executed. Waiting for the scheduler to start.
31.01.2018 00:26:12 - Setting state to CREATED
31.01.2018 00:26:12 - Changed state from CREATED to INITIALIZING
31.01.2018 00:26:12 - Starting TestRun.67b0f9ad-fadd-4ca1-8844-7b154272d940 at 2018-01-31T00:26:14+01:00
31.01.2018 00:26:14 - Changed state from INITIALIZING to INITIALIZED
31.01.2018 00:26:14 - TestRunTask initialized
31.01.2018 00:26:14 - Creating new tests databases to speed up tests.
31.01.2018 00:26:14 - Skipping schema validation because no schema file has been set in the test suite. Data are only checked for well-formedness.
31.01.2018 00:26:14 - Optimizing last database etf-tdb-f6a1ed40-27c1-478b-811c-168bfe0db864-0 
31.01.2018 00:26:14 - Import completed
31.01.2018 00:26:15 - Validation ended with 0 error(s)
31.01.2018 00:26:15 - Compiling test script
31.01.2018 00:26:15 - Starting XQuery tests
31.01.2018 00:26:15 - "Testing 1 features"
31.01.2018 00:26:15 - "Executing Test Suite: /home/tomcat/.etf/projects/ets-repository/data-encoding/inspire-gml/ets-inspire-gml-bsxets.xml"
31.01.2018 00:26:15 - "Statistics table: 0 ms"
31.01.2018 00:26:15 - "Test Suite 'Conformance class: INSPIRE GML encoding' started"
31.01.2018 00:26:15 - "Test Case 'Basic tests' started"
31.01.2018 00:26:15 - "Test Assertion 'gml.a.1: Errors loading the XML documents': PASSED - 0 ms"
31.01.2018 00:26:15 - "Test Assertion 'gml.a.2: Document root element': PASSED - 0 ms"
31.01.2018 00:26:15 - "Test Assertion 'gml.a.3: Character encoding': NOT_APPLICABLE"
31.01.2018 00:26:15 - "Test Case 'Basic tests' finished: PASSED"
31.01.2018 00:26:15 - "Test Suite 'Conformance class: INSPIRE GML encoding' finished: PASSED"
31.01.2018 00:26:16 - Releasing resources
31.01.2018 00:26:16 - TestRunTask initialized
31.01.2018 00:26:16 - Recreating new tests databases as the Test Object has changed!
31.01.2018 00:26:16 - Skipping schema validation because no schema file has been set in the test suite. Data are only checked for well-formedness.
31.01.2018 00:26:16 - Optimizing last database etf-tdb-f6a1ed40-27c1-478b-811c-168bfe0db864-0 
31.01.2018 00:26:16 - Import completed
31.01.2018 00:26:16 - Validation ended with 0 error(s)
31.01.2018 00:26:16 - Compiling test script
31.01.2018 00:26:16 - Starting XQuery tests
31.01.2018 00:26:16 - "Testing 1 features"
31.01.2018 00:26:16 - "Indexing features (parsing errors: 0): 36 ms"
31.01.2018 00:26:16 - "Executing Test Suite: /home/tomcat/.etf/projects/ets-repository/data/schemas/ets-schemas-bsxets.xml"
31.01.2018 00:26:16 - "Statistics table: 0 ms"
31.01.2018 00:26:16 - "Test Suite 'Conformance class: INSPIRE GML application schemas, General requirements' started"
31.01.2018 00:26:16 - "Test Case 'Schema' started"
31.01.2018 00:26:16 - "Test Assertion 'gmlas.a.1: Mapping of source data to INSPIRE': PASSED_MANUAL"
31.01.2018 00:26:16 - "Test Assertion 'gmlas.a.2: Modelling of additional spatial object types': PASSED_MANUAL"
31.01.2018 00:26:16 - "Test Case 'Schema' finished: PASSED_MANUAL"
31.01.2018 00:26:16 - "Test Case 'Schema validation' started"
31.01.2018 00:26:16 - "Test Assertion 'gmlas.b.1: xsi:schemaLocation attribute': PASSED - 0 ms"
31.01.2018 00:26:16 - "Validating service.xml"
31.01.2018 00:26:22 - "Duration: 5696 ms. Errors: 0."
31.01.2018 00:26:22 - "Test Assertion 'gmlas.b.2: validate XML documents': PASSED - 5697 ms"
31.01.2018 00:26:22 - "Test Case 'Schema validation' finished: PASSED"
31.01.2018 00:26:22 - "Test Case 'GML model' started"
31.01.2018 00:26:22 - "Test Assertion 'gmlas.c.1: Consistency with the GML model': PASSED - 0 ms"
31.01.2018 00:26:22 - "Test Assertion 'gmlas.c.2: nilReason attributes require xsi:nil=true': PASSED - 0 ms"
31.01.2018 00:26:22 - "Test Assertion 'gmlas.c.3: nilReason values': PASSED - 0 ms"
31.01.2018 00:26:22 - "Test Case 'GML model' finished: PASSED"
31.01.2018 00:26:22 - "Test Case 'Simple features' started"
31.01.2018 00:26:22 - "Test Assertion 'gmlas.d.1: No spatial topology objects': PASSED - 0 ms"
31.01.2018 00:26:22 - "Test Assertion 'gmlas.d.2: No non-linear interpolation': PASSED - 0 ms"
31.01.2018 00:26:22 - "Test Assertion 'gmlas.d.3: Surface geometry elements': PASSED - 0 ms"
31.01.2018 00:26:22 - "Test Assertion 'gmlas.d.4: No non-planar interpolation': PASSED - 0 ms"
31.01.2018 00:26:22 - "Test Assertion 'gmlas.d.5: Geometry elements': PASSED - 0 ms"
31.01.2018 00:26:22 - "Test Assertion 'gmlas.d.6: Point coordinates in gml:pos': PASSED - 0 ms"
31.01.2018 00:26:22 - "Test Assertion 'gmlas.d.7: Curve/Surface coordinates in gml:posList': PASSED - 0 ms"
31.01.2018 00:26:22 - "Test Assertion 'gmlas.d.8: No array property elements': PASSED - 0 ms"
31.01.2018 00:26:22 - "Test Assertion 'gmlas.d.9: 1, 2 or 3 coordinate dimensions': PASSED - 0 ms"
31.01.2018 00:26:22 - "Test Assertion 'gmlas.d.10: Validate geometries (1)': PASSED - 0 ms"
31.01.2018 00:26:22 - "Test Assertion 'gmlas.d.11: Validate geometries (2)': PASSED - 0 ms"
31.01.2018 00:26:22 - "Test Case 'Simple features' finished: PASSED"
31.01.2018 00:26:22 - "Test Case 'Code list values in basic data types' started"
31.01.2018 00:26:22 - "Test Assertion 'gmlas.e.1: GrammaticalNumber attributes': PASSED - 8 ms"
31.01.2018 00:26:22 - "Test Assertion 'gmlas.e.2: GrammaticalGender attributes': PASSED - 4 ms"
31.01.2018 00:26:22 - "Test Assertion 'gmlas.e.3: NameStatus attributes': PASSED - 4 ms"
31.01.2018 00:26:22 - "Test Assertion 'gmlas.e.4: Nativeness attributes': PASSED - 4 ms"
31.01.2018 00:26:22 - "Test Case 'Code list values in basic data types' finished: PASSED"
31.01.2018 00:26:22 - "Test Case 'Constraints' started"
31.01.2018 00:26:22 - "Test Assertion 'gmlas.f.1: At least one of the two attributes pronunciationSoundLink and pronunciationIPA shall not be void': PASSED - 0 ms"
31.01.2018 00:26:22 - "Test Case 'Constraints' finished: PASSED"
31.01.2018 00:26:22 - "Test Suite 'Conformance class: INSPIRE GML application schemas, General requirements' finished: PASSED_MANUAL"
31.01.2018 00:26:22 - Releasing resources
31.01.2018 00:26:22 - TestRunTask initialized
31.01.2018 00:26:22 - Skipping schema validation because no schema file has been set in the test suite. Data are only checked for well-formedness.
31.01.2018 00:26:22 - Validation ended with 0 error(s)
31.01.2018 00:26:22 - Compiling test script
31.01.2018 00:26:22 - Starting XQuery tests
31.01.2018 00:26:22 - "Testing 1 features"
31.01.2018 00:26:22 - "Executing Test Suite: /home/tomcat/.etf/projects/ets-repository/data-cp/cp-gml/ets-cp-gml-bsxets.xml"
31.01.2018 00:26:22 - "Statistics table: 1 ms"
31.01.2018 00:26:22 - "Test Suite 'Conformance class: GML application schemas, Cadastral Parcels' started"
31.01.2018 00:26:22 - "Test Case 'Basic test' started"
31.01.2018 00:26:22 - "Test Assertion 'cp-gml.a.1: CadastralParcel feature in dataset': FAILED - 0 ms"
31.01.2018 00:26:22 - "Test Case 'Basic test' finished: FAILED"
31.01.2018 00:26:22 - "Test Suite 'Conformance class: GML application schemas, Cadastral Parcels' finished: FAILED"
31.01.2018 00:26:22 - Releasing resources
31.01.2018 00:26:22 - TestRunTask initialized
31.01.2018 00:26:22 - Skipping schema validation because no schema file has been set in the test suite. Data are only checked for well-formedness.
31.01.2018 00:26:22 - Validation ended with 0 error(s)
31.01.2018 00:26:22 - Compiling test script
31.01.2018 00:26:22 - Starting XQuery tests
31.01.2018 00:26:23 - "Testing 1 features"
31.01.2018 00:26:23 - "Indexing features (parsing errors: 0): 43 ms"
31.01.2018 00:26:23 - "Executing Test Suite: /home/tomcat/.etf/projects/ets-repository/data-cp/cp-as/ets-cp-as-bsxets.xml"
31.01.2018 00:26:23 - "Statistics table: 0 ms"
31.01.2018 00:26:23 - "Test Suite 'Conformance class: Application Schema, Cadastral parcel' started"
31.01.2018 00:26:23 - "Test Case 'Modelling of object references' started"
31.01.2018 00:26:23 - "Test Assertion 'cp-as.a.1: Verify whether all instances of the spatial object type CadastralParcel carry as a thematic identifier the attribute nationalCadastralReference.': PASSED - 0 ms"
31.01.2018 00:26:23 - "Test Assertion 'cp-as.a.2: Manual review - Verify that the value of the attribute nationalCadastralReference enables the users to make the link with rights, owners and other cadastral information in national cadastral registers or equivalent.': PASSED_MAN..."
31.01.2018 00:26:23 - "Test Case 'Modelling of object references' finished: PASSED_MANUAL"
31.01.2018 00:26:23 - "Test Case 'Cadastral Boundaries' started"
31.01.2018 00:26:23 - "Test Assertion 'cp-as.b.1: Cadastral boundaries corresponding to the outline of a cadastral parcel form closed ring(s).': NOT_APPLICABLE"
31.01.2018 00:26:23 - "Test Case 'Cadastral Boundaries' finished: NOT_APPLICABLE"
31.01.2018 00:26:23 - "Test Case 'Code list values' started"
31.01.2018 00:26:23 - "Test Assertion 'cp-as.c.1: CadastralZoningLevel attributes': PASSED - 5 ms"
31.01.2018 00:26:23 - "Test Case 'Code list values' finished: PASSED"
31.01.2018 00:26:23 - "Test Case 'Constraints' started"
31.01.2018 00:26:23 - "Test Assertion 'cp-as.d.1: Value of areaValue shall be given in square meters': PASSED - 0 ms"
31.01.2018 00:26:23 - "Test Assertion 'cp-as.d.2: Value of estimatedAccuracy shall be given in meters': FAILED - 0 ms"
31.01.2018 00:26:23 - "Test Assertion 'cp-as.d.3: Type of geometry shall be GM_Surface or GM_MultiSurface': PASSED - 0 ms"
31.01.2018 00:26:23 - "Test Assertion 'cp-as.d.4: A lower level cadastral zoning shall be part of an upper level zoning.': PASSED - 0 ms"
31.01.2018 00:26:23 - "Test Case 'Constraints' finished: FAILED"
31.01.2018 00:26:23 - "Test Suite 'Conformance class: Application Schema, Cadastral parcel' finished: FAILED"
31.01.2018 00:26:23 - Releasing resources
31.01.2018 00:26:23 - TestRunTask initialized
31.01.2018 00:26:23 - Skipping schema validation because no schema file has been set in the test suite. Data are only checked for well-formedness.
31.01.2018 00:26:23 - Validation ended with 0 error(s)
31.01.2018 00:26:23 - Compiling test script
31.01.2018 00:26:23 - Starting XQuery tests
31.01.2018 00:26:23 - "Testing 1 features"
31.01.2018 00:26:23 - "Indexing features (parsing errors: 0): 41 ms"
31.01.2018 00:26:23 - "Executing Test Suite: /home/tomcat/.etf/projects/ets-repository/data/data-consistency/ets-data-consistency-bsxets.xml"
31.01.2018 00:26:23 - "Statistics table: 1 ms"
31.01.2018 00:26:23 - "Test Suite 'Conformance class: Data consistency, General requirements' started"
31.01.2018 00:26:23 - "Test Case 'Version consistency' started"
31.01.2018 00:26:23 - "Test Assertion 'dc.a.1: Version lifespan plausible': PASSED - 0 ms"
31.01.2018 00:26:23 - "Test Assertion 'dc.a.2: Unique identifier persistency': PASSED_MANUAL"
31.01.2018 00:26:23 - "Test Assertion 'dc.a.3: Spatial object type stable': PASSED_MANUAL"
31.01.2018 00:26:23 - "Test Case 'Version consistency' finished: PASSED_MANUAL"
31.01.2018 00:26:23 - "Test Case 'Temporal consistency' started"
31.01.2018 00:26:23 - "Test Assertion 'dc.b.1: Valid time plausible': PASSED - 0 ms"
31.01.2018 00:26:23 - "Test Case 'Temporal consistency' finished: PASSED"
31.01.2018 00:26:23 - "Test Suite 'Conformance class: Data consistency, General requirements' finished: PASSED_MANUAL"
31.01.2018 00:26:24 - Releasing resources
31.01.2018 00:26:24 - TestRunTask initialized
31.01.2018 00:26:24 - Skipping schema validation because no schema file has been set in the test suite. Data are only checked for well-formedness.
31.01.2018 00:26:24 - Validation ended with 0 error(s)
31.01.2018 00:26:24 - Compiling test script
31.01.2018 00:26:24 - Starting XQuery tests
31.01.2018 00:26:24 - "Testing 1 features"
31.01.2018 00:26:24 - "Executing Test Suite: /home/tomcat/.etf/projects/ets-repository/data-cp/cp-dc/ets-cp-dc-bsxets.xml"
31.01.2018 00:26:24 - "Statistics table: 1 ms"
31.01.2018 00:26:24 - "Test Suite 'Conformance class: Data consistency, Cadastral Parcels' started"
31.01.2018 00:26:24 - "Test Case 'Additional theme-specific consistency rules' started"
31.01.2018 00:26:24 - "Test Assertion 'cp-dc.a.1: Test always passes': PASSED - 0 ms"
31.01.2018 00:26:24 - "Test Case 'Additional theme-specific consistency rules' finished: PASSED"
31.01.2018 00:26:24 - "Test Suite 'Conformance class: Data consistency, Cadastral Parcels' finished: PASSED"
31.01.2018 00:26:24 - Releasing resources
31.01.2018 00:26:24 - TestRunTask initialized
31.01.2018 00:26:24 - Skipping schema validation because no schema file has been set in the test suite. Data are only checked for well-formedness.
31.01.2018 00:26:24 - Validation ended with 0 error(s)
31.01.2018 00:26:24 - Compiling test script
31.01.2018 00:26:24 - Starting XQuery tests
31.01.2018 00:26:24 - "Testing 1 features"
31.01.2018 00:26:24 - "Indexing features (parsing errors: 0): 41 ms"
31.01.2018 00:26:24 - "Executing Test Suite: /home/tomcat/.etf/projects/ets-repository/data/information-accessibility/ets-information-accessibility-bsxets.xml"
31.01.2018 00:26:24 - "Statistics table: 1 ms"
31.01.2018 00:26:24 - "Test Suite 'Conformance class: Information accessibility, General requirements' started"
31.01.2018 00:26:24 - "Test Case 'Coordinate reference systems (CRS)' started"
31.01.2018 00:26:24 - "Test Assertion 'ia.a.1: CRS publicly accessible via HTTP': FAILED - 1 ms"
31.01.2018 00:26:24 - "Test Case 'Coordinate reference systems (CRS)' finished: FAILED"
31.01.2018 00:26:24 - "Test Suite 'Conformance class: Information accessibility, General requirements' finished: FAILED"
31.01.2018 00:26:25 - Releasing resources
31.01.2018 00:26:25 - TestRunTask initialized
31.01.2018 00:26:25 - Skipping schema validation because no schema file has been set in the test suite. Data are only checked for well-formedness.
31.01.2018 00:26:25 - Validation ended with 0 error(s)
31.01.2018 00:26:25 - Compiling test script
31.01.2018 00:26:25 - Starting XQuery tests
31.01.2018 00:26:25 - "Testing 1 features"
31.01.2018 00:26:25 - "Executing Test Suite: /home/tomcat/.etf/projects/ets-repository/data-cp/cp-ia/ets-cp-ia-bsxets.xml"
31.01.2018 00:26:25 - "Statistics table: 0 ms"
31.01.2018 00:26:25 - "Test Suite 'Conformance class: Information accessibility, Cadastral Parcels' started"
31.01.2018 00:26:25 - "Test Case 'Code lists' started"
31.01.2018 00:26:25 - "Test Assertion 'cp-ia.a.1: Code list extensions accessible': PASSED - 0 ms"
31.01.2018 00:26:25 - "Test Case 'Code lists' finished: PASSED"
31.01.2018 00:26:25 - "Test Case 'Feature references' started"
31.01.2018 00:26:25 - "Test Assertion 'cp-ia.b.1: BasicPropertyUnit.AdministrativeUnit and CadastralParcel.AdministrativeUnit': PASSED - 0 ms"
31.01.2018 00:26:25 - "Test Assertion 'cp-ia.b.2: CadastralBoundary.parcel': PASSED - 0 ms"
31.01.2018 00:26:25 - "Test Assertion 'cp-ia.b.3: CadastralParcel.basicPropertyUnit': PASSED - 0 ms"
31.01.2018 00:26:25 - "Test Assertion 'cp-ia.b.4: CadastralParcel.zoning': PASSED - 0 ms"
31.01.2018 00:26:25 - "Test Assertion 'cp-ia.b.5: CadastralZoning.upperLevelUnit': PASSED - 0 ms"
31.01.2018 00:26:25 - "Test Case 'Feature references' finished: PASSED"
31.01.2018 00:26:25 - "Test Suite 'Conformance class: Information accessibility, Cadastral Parcels' finished: PASSED"
31.01.2018 00:26:25 - Releasing resources
31.01.2018 00:26:25 - TestRunTask initialized
31.01.2018 00:26:25 - Skipping schema validation because no schema file has been set in the test suite. Data are only checked for well-formedness.
31.01.2018 00:26:25 - Validation ended with 0 error(s)
31.01.2018 00:26:25 - Compiling test script
31.01.2018 00:26:25 - Starting XQuery tests
31.01.2018 00:26:25 - "Testing 1 features"
31.01.2018 00:26:25 - "Indexing features (parsing errors: 0): 43 ms"
31.01.2018 00:26:25 - "Executing Test Suite: /home/tomcat/.etf/projects/ets-repository/data/reference-systems/ets-reference-systems-bsxets.xml"
31.01.2018 00:26:25 - "Statistics table: 1 ms"
31.01.2018 00:26:25 - "Test Suite 'Conformance class: Reference systems, General requirements' started"
31.01.2018 00:26:25 - "Test Case 'Spatial reference systems' started"
31.01.2018 00:26:25 - "Test Assertion 'rs.a.1: Spatial reference systems in feature geometries': FAILED - 0 ms"
31.01.2018 00:26:25 - "Test Assertion 'rs.a.2: Default spatial reference systems in feature collections': PASSED - 0 ms"
31.01.2018 00:26:25 - "Test Case 'Spatial reference systems' finished: FAILED"
31.01.2018 00:26:25 - "Test Case 'Temporal reference systems' started"
31.01.2018 00:26:25 - "Test Assertion 'rs.a.3: Temporal reference systems in features': PASSED - 0 ms"
31.01.2018 00:26:25 - "Test Case 'Temporal reference systems' finished: PASSED"
31.01.2018 00:26:25 - "Test Suite 'Conformance class: Reference systems, General requirements' finished: FAILED"
31.01.2018 00:26:26 - Releasing resources
31.01.2018 00:26:26 - TestRunTask initialized
31.01.2018 00:26:26 - Skipping schema validation because no schema file has been set in the test suite. Data are only checked for well-formedness.
31.01.2018 00:26:26 - Validation ended with 0 error(s)
31.01.2018 00:26:26 - Compiling test script
31.01.2018 00:26:26 - Starting XQuery tests
31.01.2018 00:26:26 - "Testing 1 features"
31.01.2018 00:26:26 - "Executing Test Suite: /home/tomcat/.etf/projects/ets-repository/data-cp/cp-rs/ets-cp-rs-bsxets.xml"
31.01.2018 00:26:26 - "Statistics table: 0 ms"
31.01.2018 00:26:26 - "Test Suite 'Conformance class: Reference Systems, Cadastral Parcels' started"
31.01.2018 00:26:26 - "Test Case 'Lambert Conformal Conic projection' started"
31.01.2018 00:26:26 - "Test Assertion 'cp-rs.a.1: Verify that data related to the spatial data theme Cadastral Parcels made available in plane coordinates using the Lambert Conformal Conic projection are also available in at least one other of the coordinate reference systems s..."
31.01.2018 00:26:26 - "Test Assertion 'cp-rs.a.2: Verify that if there is a reference to the Lambert Conformal Conic projection in the bounding box of the feature collection, there is also a reference to (at least) one other of the coordinate reference systems specified in sect..."
31.01.2018 00:26:26 - "Test Case 'Lambert Conformal Conic projection' finished: PASSED"
31.01.2018 00:26:26 - "Test Suite 'Conformance class: Reference Systems, Cadastral Parcels' finished: PASSED"
31.01.2018 00:26:26 - Releasing resources
31.01.2018 00:26:26 - Changed state from INITIALIZED to RUNNING
31.01.2018 00:26:26 - Duration: 14sec
31.01.2018 00:26:26 - TestRun finished
31.01.2018 00:26:26 - Changed state from RUNNING to COMPLETED
