15.11.2017 23:25:39 - Preparing Test Run tn-ro:RoadLink (initiated Wed Nov 15 23:25:39 CET 2017)
15.11.2017 23:25:39 - Resolving Executable Test Suite dependencies
15.11.2017 23:25:39 - Preparing 11 Test Task:
15.11.2017 23:25:39 -  TestTask 1 (508542be-720a-4db5-9466-7253068fb337)
15.11.2017 23:25:39 -  will perform tests on Test Object 'get.xml' by using Executable Test Suite 'LAZY.545f9e49-009b-4114-9333-7ca26413b5d4'
15.11.2017 23:25:39 -  with parameters: 
15.11.2017 23:25:39 - etf.testcases = *
15.11.2017 23:25:39 -  TestTask 2 (3a4920c7-a4a3-40a4-a099-00f5323253af)
15.11.2017 23:25:39 -  will perform tests on Test Object 'get.xml' by using Executable Test Suite 'LAZY.09820daf-62b2-4fa3-a95f-56a0d2b7c4d8'
15.11.2017 23:25:39 -  with parameters: 
15.11.2017 23:25:39 - etf.testcases = *
15.11.2017 23:25:39 -  TestTask 3 (c0dd93b1-d7e3-4cf1-9613-2a52de1c4e03)
15.11.2017 23:25:39 -  will perform tests on Test Object 'get.xml' by using Executable Test Suite 'Conformance class: GML application schemas, Transport Networks (EID: 9af1c865-1cf0-43ff-9250-069df01b0948, V: 0.2.1 )'
15.11.2017 23:25:39 -  with parameters: 
15.11.2017 23:25:39 - etf.testcases = *
15.11.2017 23:25:39 -  TestTask 4 (e94656d9-7df6-4ddb-b1c6-7709acc0a691)
15.11.2017 23:25:39 -  will perform tests on Test Object 'get.xml' by using Executable Test Suite 'LAZY.4441cbde-371f-4899-90b3-145f4fd08ebc'
15.11.2017 23:25:39 -  with parameters: 
15.11.2017 23:25:39 - etf.testcases = *
15.11.2017 23:25:39 -  TestTask 5 (0b2fa1e2-cdc1-4df8-86db-b5b17e9a3b52)
15.11.2017 23:25:39 -  will perform tests on Test Object 'get.xml' by using Executable Test Suite 'Conformance class: Application schema, Road Transport Networks (EID: 14986e54-74c4-43b0-979b-d0d3e5cd0e8c, V: 0.2.1 )'
15.11.2017 23:25:39 -  with parameters: 
15.11.2017 23:25:39 - etf.testcases = *
15.11.2017 23:25:39 -  TestTask 6 (83cffeb5-419c-452d-8554-711e881a77b8)
15.11.2017 23:25:39 -  will perform tests on Test Object 'get.xml' by using Executable Test Suite 'LAZY.61070ae8-13cb-4303-a340-72c8b877b00a'
15.11.2017 23:25:39 -  with parameters: 
15.11.2017 23:25:39 - etf.testcases = *
15.11.2017 23:25:39 -  TestTask 7 (445dcf66-903d-41c3-b58f-99f3f6ea620b)
15.11.2017 23:25:39 -  will perform tests on Test Object 'get.xml' by using Executable Test Suite 'Conformance class: Data consistency, Transport Networks (EID: 733af9a0-312b-4f71-9aa2-977cd2134d23, V: 0.2.2 )'
15.11.2017 23:25:39 -  with parameters: 
15.11.2017 23:25:39 - etf.testcases = *
15.11.2017 23:25:39 -  TestTask 8 (ae4d05c7-ae60-433f-b9ae-9dc35cea36a3)
15.11.2017 23:25:39 -  will perform tests on Test Object 'get.xml' by using Executable Test Suite 'LAZY.499937ea-0590-42d2-bd7a-1cafff35ecdb'
15.11.2017 23:25:39 -  with parameters: 
15.11.2017 23:25:39 - etf.testcases = *
15.11.2017 23:25:39 -  TestTask 9 (de87a925-44c1-4c9b-a908-46889173e3e6)
15.11.2017 23:25:39 -  will perform tests on Test Object 'get.xml' by using Executable Test Suite 'Conformance class: Information accessibility, Transport Networks (EID: df5db9a4-b15f-4193-a6ff-6e9951af46f5, V: 0.2.1 )'
15.11.2017 23:25:39 -  with parameters: 
15.11.2017 23:25:39 - etf.testcases = *
15.11.2017 23:25:39 -  TestTask 10 (4858d9ae-b277-4d29-b243-1338e7b2ec29)
15.11.2017 23:25:39 -  will perform tests on Test Object 'get.xml' by using Executable Test Suite 'LAZY.63f586f0-080c-493b-8ca2-9919427440cc'
15.11.2017 23:25:39 -  with parameters: 
15.11.2017 23:25:39 - etf.testcases = *
15.11.2017 23:25:39 -  TestTask 11 (359e6bf9-31e5-4a51-a123-005edb2eb6ee)
15.11.2017 23:25:39 -  will perform tests on Test Object 'get.xml' by using Executable Test Suite 'Conformance class: Reference systems, Transport Networks (EID: 9d35024d-9dd7-43a9-afff-d5aea5f51595, V: 0.2.0 )'
15.11.2017 23:25:39 -  with parameters: 
15.11.2017 23:25:39 - etf.testcases = *
15.11.2017 23:25:39 - Test Tasks prepared and ready to be executed. Waiting for the scheduler to start.
15.11.2017 23:25:39 - Setting state to CREATED
15.11.2017 23:25:39 - Changed state from CREATED to INITIALIZING
15.11.2017 23:25:39 - Starting TestRun.8d62f6df-b364-4bef-94cb-40c32c3fc0e1 at 2017-11-15T23:25:40+01:00
15.11.2017 23:25:40 - Changed state from INITIALIZING to INITIALIZED
15.11.2017 23:25:40 - TestRunTask initialized
15.11.2017 23:25:40 - Creating new tests databases to speed up tests.
15.11.2017 23:25:40 - Skipping schema validation because no schema file has been set in the test suite. Data are only checked for well-formedness.
15.11.2017 23:25:40 - Optimizing last database etf-tdb-402d7e4c-9947-42be-92b2-8f8626964926-0 
15.11.2017 23:25:40 - Import completed
15.11.2017 23:25:41 - Validation ended with 0 error(s)
15.11.2017 23:25:41 - Compiling test script
15.11.2017 23:25:41 - Starting XQuery tests
15.11.2017 23:25:41 - "Testing 1 features"
15.11.2017 23:25:41 - "Executing Test Suite: /home/tomcat/.etf/projects/ets-repository/data-encoding/inspire-gml/ets-inspire-gml-bsxets.xml"
15.11.2017 23:25:41 - "Statistics table: 1 ms"
15.11.2017 23:25:41 - "Test Suite 'Conformance class: INSPIRE GML encoding' started"
15.11.2017 23:25:41 - "Test Case 'Basic tests' started"
15.11.2017 23:25:41 - "Test Assertion 'gml.a.1: Errors loading the XML documents': PASSED - 0 ms"
15.11.2017 23:25:41 - "Test Assertion 'gml.a.2: Document root element': PASSED - 0 ms"
15.11.2017 23:25:41 - "Test Assertion 'gml.a.3: Character encoding': NOT_APPLICABLE"
15.11.2017 23:25:41 - "Test Case 'Basic tests' finished: PASSED"
15.11.2017 23:25:41 - "Test Suite 'Conformance class: INSPIRE GML encoding' finished: PASSED"
15.11.2017 23:25:42 - Releasing resources
15.11.2017 23:25:42 - TestRunTask initialized
15.11.2017 23:25:42 - Recreating new tests databases as the Test Object has changed!
15.11.2017 23:25:42 - Skipping schema validation because no schema file has been set in the test suite. Data are only checked for well-formedness.
15.11.2017 23:25:42 - Optimizing last database etf-tdb-402d7e4c-9947-42be-92b2-8f8626964926-0 
15.11.2017 23:25:42 - Import completed
15.11.2017 23:25:42 - Validation ended with 0 error(s)
15.11.2017 23:25:42 - Compiling test script
15.11.2017 23:25:42 - Starting XQuery tests
15.11.2017 23:25:42 - "Testing 1 features"
15.11.2017 23:25:42 - "Indexing features (parsing errors: 0): 149 ms"
15.11.2017 23:25:42 - "Executing Test Suite: /home/tomcat/.etf/projects/ets-repository/data/schemas/ets-schemas-bsxets.xml"
15.11.2017 23:25:42 - "Statistics table: 1 ms"
15.11.2017 23:25:42 - "Test Suite 'Conformance class: INSPIRE GML application schemas, General requirements' started"
15.11.2017 23:25:42 - "Test Case 'Schema' started"
15.11.2017 23:25:42 - "Test Assertion 'gmlas.a.1: Mapping of source data to INSPIRE': PASSED_MANUAL"
15.11.2017 23:25:42 - "Test Assertion 'gmlas.a.2: Modelling of additional spatial object types': PASSED_MANUAL"
15.11.2017 23:25:42 - "Test Case 'Schema' finished: PASSED_MANUAL"
15.11.2017 23:25:42 - "Test Case 'Schema validation' started"
15.11.2017 23:25:42 - "Test Assertion 'gmlas.b.1: xsi:schemaLocation attribute': PASSED - 0 ms"
15.11.2017 23:25:42 - "Validating get.xml"
15.11.2017 23:25:51 - "Duration: 8922 ms. Errors: 42."
15.11.2017 23:25:51 - "Test Assertion 'gmlas.b.2: validate XML documents': FAILED - 8928 ms"
15.11.2017 23:25:51 - "Test Case 'Schema validation' finished: FAILED"
15.11.2017 23:25:51 - "Test Case 'GML model' started"
15.11.2017 23:25:51 - "Test Assertion 'gmlas.c.1: Consistency with the GML model': PASSED - 0 ms"
15.11.2017 23:25:51 - "Test Assertion 'gmlas.c.2: nilReason attributes require xsi:nil=true': PASSED - 0 ms"
15.11.2017 23:25:51 - "Test Assertion 'gmlas.c.3: nilReason values': PASSED - 0 ms"
15.11.2017 23:25:51 - "Test Case 'GML model' finished: PASSED"
15.11.2017 23:25:51 - "Test Case 'Simple features' started"
15.11.2017 23:25:51 - "Test Assertion 'gmlas.d.1: No spatial topology objects': PASSED - 0 ms"
15.11.2017 23:25:51 - "Test Assertion 'gmlas.d.2: No non-linear interpolation': PASSED - 0 ms"
15.11.2017 23:25:51 - "Test Assertion 'gmlas.d.3: Surface geometry elements': PASSED - 0 ms"
15.11.2017 23:25:51 - "Test Assertion 'gmlas.d.4: No non-planar interpolation': PASSED - 1 ms"
15.11.2017 23:25:51 - "Test Assertion 'gmlas.d.5: Geometry elements': PASSED - 0 ms"
15.11.2017 23:25:51 - "Test Assertion 'gmlas.d.6: Point coordinates in gml:pos': PASSED - 0 ms"
15.11.2017 23:25:51 - "Test Assertion 'gmlas.d.7: Curve/Surface coordinates in gml:posList': PASSED - 0 ms"
15.11.2017 23:25:51 - "Test Assertion 'gmlas.d.8: No array property elements': PASSED - 0 ms"
15.11.2017 23:25:51 - "Test Assertion 'gmlas.d.9: 1, 2 or 3 coordinate dimensions': PASSED - 0 ms"
15.11.2017 23:25:51 - "Test Assertion 'gmlas.d.10: Validate geometries (1)': PASSED - 193 ms"
15.11.2017 23:25:51 - "Test Assertion 'gmlas.d.11: Validate geometries (2)': PASSED - 0 ms"
15.11.2017 23:25:51 - "Test Case 'Simple features' finished: PASSED"
15.11.2017 23:25:51 - "Test Case 'Code list values in basic data types' started"
15.11.2017 23:25:51 - "Test Assertion 'gmlas.e.1: GrammaticalNumber attributes': PASSED - 31 ms"
15.11.2017 23:25:51 - "Test Assertion 'gmlas.e.2: GrammaticalGender attributes': PASSED - 21 ms"
15.11.2017 23:25:51 - "Test Assertion 'gmlas.e.3: NameStatus attributes': PASSED - 21 ms"
15.11.2017 23:25:51 - "Test Assertion 'gmlas.e.4: Nativeness attributes': PASSED - 22 ms"
15.11.2017 23:25:51 - "Test Case 'Code list values in basic data types' finished: PASSED"
15.11.2017 23:25:51 - "Test Case 'Constraints' started"
15.11.2017 23:25:51 - "Test Assertion 'gmlas.f.1: At least one of the two attributes pronunciationSoundLink and pronunciationIPA shall not be void': PASSED - 0 ms"
15.11.2017 23:25:51 - "Test Case 'Constraints' finished: PASSED"
15.11.2017 23:25:51 - "Test Suite 'Conformance class: INSPIRE GML application schemas, General requirements' finished: FAILED"
15.11.2017 23:25:52 - Releasing resources
15.11.2017 23:25:52 - TestRunTask initialized
15.11.2017 23:25:52 - Skipping schema validation because no schema file has been set in the test suite. Data are only checked for well-formedness.
15.11.2017 23:25:52 - Validation ended with 0 error(s)
15.11.2017 23:25:52 - Compiling test script
15.11.2017 23:25:52 - Starting XQuery tests
15.11.2017 23:25:52 - "Testing 1 features"
15.11.2017 23:25:52 - "Indexing features (parsing errors: 0): 152 ms"
15.11.2017 23:25:52 - "Executing Test Suite: /home/tomcat/.etf/projects/ets-repository/data-tn/tn-gml/ets-tn-gml-bsxets.xml"
15.11.2017 23:25:52 - "Statistics table: 0 ms"
15.11.2017 23:25:52 - "Test Suite 'Conformance class: GML application schemas, Transport Networks' started"
15.11.2017 23:25:52 - "Test Case 'Basic test' started"
15.11.2017 23:25:52 - "Test Assertion 'tn-gml.a.1: Transport Network feature in dataset': PASSED - 0 ms"
15.11.2017 23:25:52 - "Test Case 'Basic test' finished: PASSED"
15.11.2017 23:25:52 - "Test Suite 'Conformance class: GML application schemas, Transport Networks' finished: PASSED"
15.11.2017 23:25:53 - Releasing resources
15.11.2017 23:25:53 - TestRunTask initialized
15.11.2017 23:25:53 - Skipping schema validation because no schema file has been set in the test suite. Data are only checked for well-formedness.
15.11.2017 23:25:53 - Validation ended with 0 error(s)
15.11.2017 23:25:53 - Compiling test script
15.11.2017 23:25:53 - Starting XQuery tests
15.11.2017 23:25:53 - "Testing 1 features"
15.11.2017 23:25:53 - "Indexing features (parsing errors: 0): 127 ms"
15.11.2017 23:25:53 - "Executing Test Suite: /home/tomcat/.etf/projects/ets-repository/data-tn/tn-as/ets-tn-as-bsxets.xml"
15.11.2017 23:25:53 - "Statistics table: 0 ms"
15.11.2017 23:25:53 - "Test Suite 'Conformance class: Application schema, Transport Networks Common' started"
15.11.2017 23:25:53 - "Test Case 'Code list values' started"
15.11.2017 23:25:53 - "Test Assertion 'tn-as.a.1: AccessRestrictionValue attributes': PASSED - 12 ms"
15.11.2017 23:25:53 - "Test Assertion 'tn-as.a.2: RestrictionTypeValue attributes': PASSED - 4 ms"
15.11.2017 23:25:53 - "Test Case 'Code list values' finished: PASSED"
15.11.2017 23:25:53 - "Test Case 'Constraints' started"
15.11.2017 23:25:53 - "Test Assertion 'tn-as.b.1: TrafficFlowDirection can only be associated with a spatial object of the type Link or LinkSequence.': PASSED - 0 ms"
15.11.2017 23:25:53 - "Test Assertion 'tn-as.b.2: All transport areas have an external object identifier.': PASSED - 1 ms"
15.11.2017 23:25:53 - "Test Assertion 'tn-as.b.3: All transport links have an external object identifier.': PASSED - 0 ms"
15.11.2017 23:25:53 - "Test Assertion 'tn-as.b.4: All transport link sequences have an external object identifier.': PASSED - 0 ms"
15.11.2017 23:25:53 - "Test Assertion 'tn-as.b.5: All transport link sets have an external object identifier.': PASSED - 0 ms"
15.11.2017 23:25:53 - "Test Assertion 'tn-as.b.6: All transport nodes have an external object identifier.': PASSED - 0 ms"
15.11.2017 23:25:53 - "Test Assertion 'tn-as.b.7: All transport points have an external object identifier.': PASSED - 0 ms"
15.11.2017 23:25:53 - "Test Assertion 'tn-as.b.8: All transport properties have an external object identifier.': PASSED - 0 ms"
15.11.2017 23:25:53 - "Test Assertion 'tn-as.b.9: A transport link sequence must be composed of transport links that all belong to the same transport network.': PASSED - 0 ms"
15.11.2017 23:25:53 - "Test Assertion 'tn-as.b.10: A transport link set must be composed of transport links and or transport link sequences that all belong to the same transport network.': PASSED - 0 ms"
15.11.2017 23:25:53 - "Test Case 'Constraints' finished: PASSED"
15.11.2017 23:25:53 - "Test Case 'Geometry' started"
15.11.2017 23:25:53 - "Test Assertion 'tn-as.c.1: No free transport nodes': PASSED - 0 ms"
15.11.2017 23:25:53 - "Test Assertion 'tn-as.c.2: Intersections only at crossings': PASSED_MANUAL"
15.11.2017 23:25:53 - "Test Case 'Geometry' finished: PASSED_MANUAL"
15.11.2017 23:25:53 - "Test Case 'Network connectivity' started"
15.11.2017 23:25:53 - "Test Assertion 'tn-as.d.1: Connectivity at crossings': PASSED_MANUAL"
15.11.2017 23:25:53 - "Test Assertion 'tn-as.d.2: Unconnected nodes': PASSED_MANUAL"
15.11.2017 23:25:53 - "Test Assertion 'tn-as.d.3: Connectivity tolerance': PASSED_MANUAL"
15.11.2017 23:25:53 - "Test Case 'Network connectivity' finished: PASSED_MANUAL"
15.11.2017 23:25:53 - "Test Case 'Object References' started"
15.11.2017 23:25:53 - "Test Assertion 'tn-as.e.1: Linear references': PASSED_MANUAL"
15.11.2017 23:25:53 - "Test Assertion 'tn-as.e.2: Inter-modal connections': PASSED - 0 ms"
15.11.2017 23:25:53 - "Test Case 'Object References' finished: PASSED_MANUAL"
15.11.2017 23:25:53 - "Test Suite 'Conformance class: Application schema, Transport Networks Common' finished: PASSED_MANUAL"
15.11.2017 23:25:53 - Releasing resources
15.11.2017 23:25:53 - TestRunTask initialized
15.11.2017 23:25:53 - Skipping schema validation because no schema file has been set in the test suite. Data are only checked for well-formedness.
15.11.2017 23:25:53 - Validation ended with 0 error(s)
15.11.2017 23:25:53 - Compiling test script
15.11.2017 23:25:53 - Starting XQuery tests
15.11.2017 23:25:53 - "Testing 1 features"
15.11.2017 23:25:53 - "Executing Test Suite: /home/tomcat/.etf/projects/ets-repository/data-tn/tn-ro-as/ets-tn-ro-as-bsxets.xml"
15.11.2017 23:25:53 - "Statistics table: 0 ms"
15.11.2017 23:25:53 - "Test Suite 'Conformance class: Application schema, Road Transport Networks' started"
15.11.2017 23:25:53 - "Test Case 'Code list values' started"
15.11.2017 23:25:53 - "Test Assertion 'tn-ro-as.a.1: AreaConditionValue attributes': PASSED - 5 ms"
15.11.2017 23:25:53 - "Test Assertion 'tn-ro-as.a.2: FormOfRoadNodeValue attributes': PASSED - 5 ms"
15.11.2017 23:25:53 - "Test Assertion 'tn-ro-as.a.3: FormOfWayValue attributes': PASSED - 5 ms"
15.11.2017 23:25:53 - "Test Assertion 'tn-ro-as.a.4: RoadPartValue attributes': PASSED - 3 ms"
15.11.2017 23:25:53 - "Test Assertion 'tn-ro-as.a.5: RoadServiceTypeValue attributes': PASSED - 3 ms"
15.11.2017 23:25:53 - "Test Assertion 'tn-ro-as.a.6: RoadSurfaceCategoryValue attributes': PASSED - 3 ms"
15.11.2017 23:25:53 - "Test Assertion 'tn-ro-as.a.7: ServiceFacilityValue attributes': PASSED - 4 ms"
15.11.2017 23:25:53 - "Test Assertion 'tn-ro-as.a.8: SpeedLimitSourceValue attributes': PASSED - 3 ms"
15.11.2017 23:25:53 - "Test Assertion 'tn-ro-as.a.9: VehicleTypeValue attributes': PASSED - 5 ms"
15.11.2017 23:25:53 - "Test Assertion 'tn-ro-as.a.10: WeatherConditionValue attributes': PASSED - 4 ms"
15.11.2017 23:25:53 - "Test Case 'Code list values' finished: PASSED"
15.11.2017 23:25:53 - "Test Case 'Constraints' started"
15.11.2017 23:25:53 - "Test Assertion 'tn-ro-as.b.1: FormOfWay can only be associated with a spatial object that is part of a road transport network.': PASSED - 1 ms"
15.11.2017 23:25:53 - "Test Assertion 'tn-ro-as.b.2: FunctionalRoadClass can only be associated with a spatial object that is part of a road transport network.': PASSED - 0 ms"
15.11.2017 23:25:53 - "Test Assertion 'tn-ro-as.b.3: NumberOfLanes can only be associated with a spatial object that is part of a road transport network.': PASSED - 0 ms"
15.11.2017 23:25:53 - "Test Assertion 'tn-ro-as.b.4: RoadName can only be associated with a spatial object that is part of a road transport network.': PASSED - 0 ms"
15.11.2017 23:25:53 - "Test Assertion 'tn-ro-as.b.5: RoadSurfaceCategory can only be associated with a spatial object that is part of a road transport network.': PASSED - 1 ms"
15.11.2017 23:25:53 - "Test Assertion 'tn-ro-as.b.6: RoadWidth can only be associated with a spatial object that is part of a road transport network.': PASSED - 0 ms"
15.11.2017 23:25:53 - "Test Assertion 'tn-ro-as.b.7: SpeedLimit can only be associated with a spatial object that is part of a road transport network.': PASSED - 0 ms"
15.11.2017 23:25:53 - "Test Assertion 'tn-ro-as.b.8: RoadServiceType can only be associated with a spatial object of the type RoadServiceArea or RoadNode (when formOfRoadNode=roadServiceArea)': PASSED - 0 ms"
15.11.2017 23:25:53 - "Test Case 'Constraints' finished: PASSED"
15.11.2017 23:25:53 - "Test Case 'Link centrelines' started"
15.11.2017 23:25:53 - "Test Assertion 'tn-ro-as.c.1: Link centrelines test': PASSED_MANUAL"
15.11.2017 23:25:53 - "Test Case 'Link centrelines' finished: PASSED_MANUAL"
15.11.2017 23:25:53 - "Test Suite 'Conformance class: Application schema, Road Transport Networks' finished: PASSED_MANUAL"
15.11.2017 23:25:54 - Releasing resources
15.11.2017 23:25:54 - TestRunTask initialized
15.11.2017 23:25:54 - Skipping schema validation because no schema file has been set in the test suite. Data are only checked for well-formedness.
15.11.2017 23:25:54 - Validation ended with 0 error(s)
15.11.2017 23:25:54 - Compiling test script
15.11.2017 23:25:54 - Starting XQuery tests
15.11.2017 23:25:54 - "Testing 1 features"
15.11.2017 23:25:54 - "Indexing features (parsing errors: 0): 130 ms"
15.11.2017 23:25:54 - "Executing Test Suite: /home/tomcat/.etf/projects/ets-repository/data/data-consistency/ets-data-consistency-bsxets.xml"
15.11.2017 23:25:54 - "Statistics table: 1 ms"
15.11.2017 23:25:54 - "Test Suite 'Conformance class: Data consistency, General requirements' started"
15.11.2017 23:25:54 - "Test Case 'Version consistency' started"
15.11.2017 23:25:54 - "Test Assertion 'dc.a.1: Version lifespan plausible': PASSED - 0 ms"
15.11.2017 23:25:54 - "Test Assertion 'dc.a.2: Unique identifier persistency': PASSED_MANUAL"
15.11.2017 23:25:54 - "Test Assertion 'dc.a.3: Spatial object type stable': PASSED_MANUAL"
15.11.2017 23:25:54 - "Test Case 'Version consistency' finished: PASSED_MANUAL"
15.11.2017 23:25:54 - "Test Case 'Temporal consistency' started"
15.11.2017 23:25:54 - "Test Assertion 'dc.b.1: Valid time plausible': PASSED - 0 ms"
15.11.2017 23:25:54 - "Test Case 'Temporal consistency' finished: PASSED"
15.11.2017 23:25:54 - "Test Suite 'Conformance class: Data consistency, General requirements' finished: PASSED_MANUAL"
15.11.2017 23:25:54 - Releasing resources
15.11.2017 23:25:54 - TestRunTask initialized
15.11.2017 23:25:54 - Skipping schema validation because no schema file has been set in the test suite. Data are only checked for well-formedness.
15.11.2017 23:25:54 - Validation ended with 0 error(s)
15.11.2017 23:25:54 - Compiling test script
15.11.2017 23:25:54 - Starting XQuery tests
15.11.2017 23:25:54 - "Testing 1 features"
15.11.2017 23:25:54 - "Indexing features (parsing errors: 0): 123 ms"
15.11.2017 23:25:54 - "Executing Test Suite: /home/tomcat/.etf/projects/ets-repository/data-tn/tn-dc/ets-tn-dc-bsxets.xml"
15.11.2017 23:25:54 - "Statistics table: 0 ms"
15.11.2017 23:25:54 - "Test Suite 'Conformance class: Data consistency, Transport Networks' started"
15.11.2017 23:25:54 - "Test Case 'Spatial consistency' started"
15.11.2017 23:25:54 - "Test Assertion 'tn-dc.a.1: Each Transport Network Link or Node geometry is within a Network Area geometry (Road Transport Networks)': PASSED - 0 ms"
15.11.2017 23:25:54 - "Test Assertion 'tn-dc.a.2: Each Transport Network Link or Node geometry is within a Network Area geometry (Railway Transport Networks)': PASSED - 0 ms"
15.11.2017 23:25:54 - "Test Assertion 'tn-dc.a.3: Each Transport Network Link or Node geometry is within a Network Area geometry (Waterway Transport Networks)': PASSED - 0 ms"
15.11.2017 23:25:54 - "Test Assertion 'tn-dc.a.4: Each Transport Network Link or Node geometry is within a Network Area geometry (Air Transport Networks)': PASSED - 0 ms"
15.11.2017 23:25:54 - "Test Assertion 'tn-dc.a.5: Manual review': PASSED_MANUAL"
15.11.2017 23:25:54 - "Test Case 'Spatial consistency' finished: PASSED_MANUAL"
15.11.2017 23:25:54 - "Test Suite 'Conformance class: Data consistency, Transport Networks' finished: PASSED_MANUAL"
15.11.2017 23:25:55 - Releasing resources
15.11.2017 23:25:55 - TestRunTask initialized
15.11.2017 23:25:55 - Skipping schema validation because no schema file has been set in the test suite. Data are only checked for well-formedness.
15.11.2017 23:25:55 - Validation ended with 0 error(s)
15.11.2017 23:25:55 - Compiling test script
15.11.2017 23:25:55 - Starting XQuery tests
15.11.2017 23:25:55 - "Testing 1 features"
15.11.2017 23:25:55 - "Indexing features (parsing errors: 0): 131 ms"
15.11.2017 23:25:55 - "Executing Test Suite: /home/tomcat/.etf/projects/ets-repository/data/information-accessibility/ets-information-accessibility-bsxets.xml"
15.11.2017 23:25:55 - "Statistics table: 0 ms"
15.11.2017 23:25:55 - "Test Suite 'Conformance class: Information accessibility, General requirements' started"
15.11.2017 23:25:55 - "Test Case 'Coordinate reference systems (CRS)' started"
15.11.2017 23:25:55 - "Test Assertion 'ia.a.1: CRS publicly accessible via HTTP': FAILED - 0 ms"
15.11.2017 23:25:55 - "Test Case 'Coordinate reference systems (CRS)' finished: FAILED"
15.11.2017 23:25:55 - "Test Suite 'Conformance class: Information accessibility, General requirements' finished: FAILED"
15.11.2017 23:25:55 - Releasing resources
15.11.2017 23:25:55 - TestRunTask initialized
15.11.2017 23:25:55 - Skipping schema validation because no schema file has been set in the test suite. Data are only checked for well-formedness.
15.11.2017 23:25:55 - Validation ended with 0 error(s)
15.11.2017 23:25:55 - Compiling test script
15.11.2017 23:25:55 - Starting XQuery tests
15.11.2017 23:25:55 - "Testing 1 features"
15.11.2017 23:25:55 - "Executing Test Suite: /home/tomcat/.etf/projects/ets-repository/data-tn/tn-ia/ets-tn-ia-bsxets.xml"
15.11.2017 23:25:55 - "Statistics table: 0 ms"
15.11.2017 23:25:55 - "Test Suite 'Conformance class: Information accessibility, Transport Networks' started"
15.11.2017 23:25:55 - "Test Case 'Code lists' started"
15.11.2017 23:25:55 - "Test Assertion 'tn-ia.a.1: Code list extensions accessible': PASSED - 0 ms"
15.11.2017 23:25:55 - "Test Case 'Code lists' finished: PASSED"
15.11.2017 23:25:55 - "Test Case 'Feature references' started"
15.11.2017 23:25:55 - "Test Assertion 'tn-ia.b.1: MarkerPost.route': PASSED - 0 ms"
15.11.2017 23:25:55 - "Test Assertion 'tn-ia.b.2: TransportLinkSet.post': PASSED - 0 ms"
15.11.2017 23:25:55 - "Test Case 'Feature references' finished: PASSED"
15.11.2017 23:25:55 - "Test Suite 'Conformance class: Information accessibility, Transport Networks' finished: PASSED"
15.11.2017 23:25:56 - Releasing resources
15.11.2017 23:25:56 - TestRunTask initialized
15.11.2017 23:25:56 - Skipping schema validation because no schema file has been set in the test suite. Data are only checked for well-formedness.
15.11.2017 23:25:56 - Validation ended with 0 error(s)
15.11.2017 23:25:56 - Compiling test script
15.11.2017 23:25:56 - Starting XQuery tests
15.11.2017 23:25:56 - "Testing 1 features"
15.11.2017 23:25:56 - "Indexing features (parsing errors: 0): 125 ms"
15.11.2017 23:25:56 - "Executing Test Suite: /home/tomcat/.etf/projects/ets-repository/data/reference-systems/ets-reference-systems-bsxets.xml"
15.11.2017 23:25:56 - "Statistics table: 1 ms"
15.11.2017 23:25:56 - "Test Suite 'Conformance class: Reference systems, General requirements' started"
15.11.2017 23:25:56 - "Test Case 'Spatial reference systems' started"
15.11.2017 23:25:56 - "Test Assertion 'rs.a.1: Spatial reference systems in feature geometries': FAILED - 0 ms"
15.11.2017 23:25:56 - "Test Assertion 'rs.a.2: Default spatial reference systems in feature collections': PASSED - 0 ms"
15.11.2017 23:25:56 - "Test Case 'Spatial reference systems' finished: FAILED"
15.11.2017 23:25:56 - "Test Case 'Temporal reference systems' started"
15.11.2017 23:25:56 - "Test Assertion 'rs.a.3: Temporal reference systems in features': PASSED - 0 ms"
15.11.2017 23:25:56 - "Test Case 'Temporal reference systems' finished: PASSED"
15.11.2017 23:25:56 - "Test Suite 'Conformance class: Reference systems, General requirements' finished: FAILED"
15.11.2017 23:25:56 - Releasing resources
15.11.2017 23:25:56 - TestRunTask initialized
15.11.2017 23:25:56 - Skipping schema validation because no schema file has been set in the test suite. Data are only checked for well-formedness.
15.11.2017 23:25:56 - Validation ended with 0 error(s)
15.11.2017 23:25:56 - Compiling test script
15.11.2017 23:25:56 - Starting XQuery tests
15.11.2017 23:25:56 - "Testing 1 features"
15.11.2017 23:25:56 - "Executing Test Suite: /home/tomcat/.etf/projects/ets-repository/data-tn/tn-rs/ets-tn-rs-bsxets.xml"
15.11.2017 23:25:56 - "Statistics table: 0 ms"
15.11.2017 23:25:56 - "Test Suite 'Conformance class: Reference systems, Transport Networks' started"
15.11.2017 23:25:56 - "Test Case 'Additional theme-specific rules for reference systems' started"
15.11.2017 23:25:56 - "Test Assertion 'tn-rs.a.1: Test always passes': PASSED - 0 ms"
15.11.2017 23:25:56 - "Test Case 'Additional theme-specific rules for reference systems' finished: PASSED"
15.11.2017 23:25:56 - "Test Suite 'Conformance class: Reference systems, Transport Networks' finished: PASSED"
15.11.2017 23:25:56 - Releasing resources
15.11.2017 23:25:56 - Changed state from INITIALIZED to RUNNING
15.11.2017 23:25:57 - Duration: 17sec
15.11.2017 23:25:57 - TestRun finished
15.11.2017 23:25:57 - Changed state from RUNNING to COMPLETED
