06.02.2018 23:08:15 - Preparing Test Run interoperability_17316219_Geodetick&yacute;akartografick&yacute;&uacute;stavBratislava_tn-ro:FormOfWay (initiated Tue Feb 06 23:08:15 CET 2018)
06.02.2018 23:08:15 - Resolving Executable Test Suite dependencies
06.02.2018 23:08:15 - Preparing 11 Test Task:
06.02.2018 23:08:15 -  TestTask 1 (b6efe7b0-785c-4538-9547-06a2f8c07d3b)
06.02.2018 23:08:15 -  will perform tests on Test Object 'get.xml' by using Executable Test Suite 'Conformance class: INSPIRE GML application schemas, General requirements (EID: 09820daf-62b2-4fa3-a95f-56a0d2b7c4d8, V: 0.2.4 )'
06.02.2018 23:08:15 -  with parameters: 
06.02.2018 23:08:15 - etf.testcases = *
06.02.2018 23:08:15 -  TestTask 2 (3b8dce20-22a4-42ce-9c49-209cc00775a6)
06.02.2018 23:08:15 -  will perform tests on Test Object 'get.xml' by using Executable Test Suite 'Conformance class: GML application schemas, Transport Networks (EID: 9af1c865-1cf0-43ff-9250-069df01b0948, V: 0.2.1 )'
06.02.2018 23:08:15 -  with parameters: 
06.02.2018 23:08:15 - etf.testcases = *
06.02.2018 23:08:15 -  TestTask 3 (24360f7f-c778-43c6-8c44-d5e9b97003f4)
06.02.2018 23:08:15 -  will perform tests on Test Object 'get.xml' by using Executable Test Suite 'LAZY.4441cbde-371f-4899-90b3-145f4fd08ebc'
06.02.2018 23:08:15 -  with parameters: 
06.02.2018 23:08:15 - etf.testcases = *
06.02.2018 23:08:15 -  TestTask 4 (7fa0eb56-d63c-4e4d-bdb3-3d1fb12b3bf2)
06.02.2018 23:08:15 -  will perform tests on Test Object 'get.xml' by using Executable Test Suite 'Conformance class: Application schema, Road Transport Networks (EID: 14986e54-74c4-43b0-979b-d0d3e5cd0e8c, V: 0.2.1 )'
06.02.2018 23:08:15 -  with parameters: 
06.02.2018 23:08:15 - etf.testcases = *
06.02.2018 23:08:15 -  TestTask 5 (4acd0d02-af53-4edc-bf39-ad1d80596652)
06.02.2018 23:08:15 -  will perform tests on Test Object 'get.xml' by using Executable Test Suite 'LAZY.545f9e49-009b-4114-9333-7ca26413b5d4'
06.02.2018 23:08:15 -  with parameters: 
06.02.2018 23:08:15 - etf.testcases = *
06.02.2018 23:08:15 -  TestTask 6 (58ef833c-3a5e-40bc-9bec-a7053e6b027a)
06.02.2018 23:08:15 -  will perform tests on Test Object 'get.xml' by using Executable Test Suite 'LAZY.61070ae8-13cb-4303-a340-72c8b877b00a'
06.02.2018 23:08:15 -  with parameters: 
06.02.2018 23:08:15 - etf.testcases = *
06.02.2018 23:08:15 -  TestTask 7 (2c08836c-9e49-43e6-99bd-b5ec3846284d)
06.02.2018 23:08:15 -  will perform tests on Test Object 'get.xml' by using Executable Test Suite 'Conformance class: Data consistency, Transport Networks (EID: 733af9a0-312b-4f71-9aa2-977cd2134d23, V: 0.2.2 )'
06.02.2018 23:08:15 -  with parameters: 
06.02.2018 23:08:15 - etf.testcases = *
06.02.2018 23:08:15 -  TestTask 8 (27fc6c06-bba0-442b-8924-817f0f236435)
06.02.2018 23:08:15 -  will perform tests on Test Object 'get.xml' by using Executable Test Suite 'LAZY.499937ea-0590-42d2-bd7a-1cafff35ecdb'
06.02.2018 23:08:15 -  with parameters: 
06.02.2018 23:08:15 - etf.testcases = *
06.02.2018 23:08:15 -  TestTask 9 (43e687a6-ddb2-4d6e-b30d-1af989a4ec6f)
06.02.2018 23:08:15 -  will perform tests on Test Object 'get.xml' by using Executable Test Suite 'Conformance class: Information accessibility, Transport Networks (EID: df5db9a4-b15f-4193-a6ff-6e9951af46f5, V: 0.2.2 )'
06.02.2018 23:08:15 -  with parameters: 
06.02.2018 23:08:15 - etf.testcases = *
06.02.2018 23:08:15 -  TestTask 10 (1517d6db-d527-4512-bfbe-e8f097e7ad83)
06.02.2018 23:08:15 -  will perform tests on Test Object 'get.xml' by using Executable Test Suite 'LAZY.63f586f0-080c-493b-8ca2-9919427440cc'
06.02.2018 23:08:15 -  with parameters: 
06.02.2018 23:08:15 - etf.testcases = *
06.02.2018 23:08:15 -  TestTask 11 (cea47238-3730-4cd1-b058-4a0efc7a7ee2)
06.02.2018 23:08:15 -  will perform tests on Test Object 'get.xml' by using Executable Test Suite 'Conformance class: Reference systems, Transport Networks (EID: 9d35024d-9dd7-43a9-afff-d5aea5f51595, V: 0.2.0 )'
06.02.2018 23:08:15 -  with parameters: 
06.02.2018 23:08:15 - etf.testcases = *
06.02.2018 23:08:15 - Test Tasks prepared and ready to be executed. Waiting for the scheduler to start.
06.02.2018 23:08:15 - Setting state to CREATED
06.02.2018 23:08:15 - Changed state from CREATED to INITIALIZING
06.02.2018 23:08:41 - Starting TestRun.00bde018-1f55-441d-927f-7d1702bede5a at 2018-02-06T23:08:42+01:00
06.02.2018 23:08:42 - Changed state from INITIALIZING to INITIALIZED
06.02.2018 23:08:42 - TestRunTask initialized
06.02.2018 23:08:42 - Creating new tests databases to speed up tests.
06.02.2018 23:08:42 - Skipping schema validation because no schema file has been set in the test suite. Data are only checked for well-formedness.
06.02.2018 23:08:42 - Optimizing last database etf-tdb-30f0e988-231a-42fd-9e8a-f0ac625f508a-0 
06.02.2018 23:08:42 - Import completed
06.02.2018 23:08:45 - Validation ended with 0 error(s)
06.02.2018 23:08:45 - Compiling test script
06.02.2018 23:08:45 - Starting XQuery tests
06.02.2018 23:08:45 - "Testing 1 features"
06.02.2018 23:08:45 - "Indexing features (parsing errors: 0): 0 ms"
06.02.2018 23:08:45 - "Executing Test Suite: /home/tomcat/.etf/projects/ets-repository/data/schemas/ets-schemas-bsxets.xml"
06.02.2018 23:08:45 - "Statistics table: 1 ms"
06.02.2018 23:08:45 - "Test Suite 'Conformance class: INSPIRE GML application schemas, General requirements' started"
06.02.2018 23:08:45 - "Test Case 'Schema' started"
06.02.2018 23:08:45 - "Test Assertion 'gmlas.a.1: Mapping of source data to INSPIRE': PASSED_MANUAL"
06.02.2018 23:08:45 - "Test Assertion 'gmlas.a.2: Modelling of additional spatial object types': PASSED_MANUAL"
06.02.2018 23:08:45 - "Test Case 'Schema' finished: PASSED_MANUAL"
06.02.2018 23:08:45 - "Test Case 'Schema validation' started"
06.02.2018 23:08:45 - "Test Assertion 'gmlas.b.1: xsi:schemaLocation attribute': PASSED - 0 ms"
06.02.2018 23:08:45 - "Validating get.xml"
06.02.2018 23:08:53 - "Duration: 7429 ms. Errors: 2."
06.02.2018 23:08:53 - "Test Assertion 'gmlas.b.2: validate XML documents': FAILED - 7430 ms"
06.02.2018 23:08:53 - "Test Case 'Schema validation' finished: FAILED"
06.02.2018 23:08:53 - "Test Case 'GML model' started"
06.02.2018 23:08:53 - "Test Assertion 'gmlas.c.1: Consistency with the GML model': PASSED - 1 ms"
06.02.2018 23:08:53 - "Test Assertion 'gmlas.c.2: nilReason attributes require xsi:nil=true': PASSED - 0 ms"
06.02.2018 23:08:53 - "Test Assertion 'gmlas.c.3: nilReason values': PASSED - 0 ms"
06.02.2018 23:08:53 - "Test Case 'GML model' finished: PASSED"
06.02.2018 23:08:53 - "Test Case 'Simple features' started"
06.02.2018 23:08:53 - "Test Assertion 'gmlas.d.1: No spatial topology objects': PASSED - 0 ms"
06.02.2018 23:08:53 - "Test Assertion 'gmlas.d.2: No non-linear interpolation': PASSED - 0 ms"
06.02.2018 23:08:53 - "Test Assertion 'gmlas.d.3: Surface geometry elements': PASSED - 0 ms"
06.02.2018 23:08:53 - "Test Assertion 'gmlas.d.4: No non-planar interpolation': PASSED - 0 ms"
06.02.2018 23:08:53 - "Test Assertion 'gmlas.d.5: Geometry elements': PASSED - 0 ms"
06.02.2018 23:08:53 - "Test Assertion 'gmlas.d.6: Point coordinates in gml:pos': PASSED - 0 ms"
06.02.2018 23:08:53 - "Test Assertion 'gmlas.d.7: Curve/Surface coordinates in gml:posList': PASSED - 0 ms"
06.02.2018 23:08:53 - "Test Assertion 'gmlas.d.8: No array property elements': PASSED - 0 ms"
06.02.2018 23:08:53 - "Test Assertion 'gmlas.d.9: 1, 2 or 3 coordinate dimensions': PASSED - 0 ms"
06.02.2018 23:08:53 - "Test Assertion 'gmlas.d.10: Validate geometries (1)': PASSED - 25 ms"
06.02.2018 23:08:53 - "Test Assertion 'gmlas.d.11: Validate geometries (2)': PASSED - 0 ms"
06.02.2018 23:08:53 - "Test Case 'Simple features' finished: PASSED"
06.02.2018 23:08:53 - "Test Case 'Code list values in basic data types' started"
06.02.2018 23:08:53 - "Test Assertion 'gmlas.e.1: GrammaticalNumber attributes': PASSED - 6 ms"
06.02.2018 23:08:53 - "Test Assertion 'gmlas.e.2: GrammaticalGender attributes': PASSED - 4 ms"
06.02.2018 23:08:53 - "Test Assertion 'gmlas.e.3: NameStatus attributes': PASSED - 9 ms"
06.02.2018 23:08:53 - "Test Assertion 'gmlas.e.4: Nativeness attributes': PASSED - 5 ms"
06.02.2018 23:08:53 - "Test Case 'Code list values in basic data types' finished: PASSED"
06.02.2018 23:08:53 - "Test Case 'Constraints' started"
06.02.2018 23:08:53 - "Test Assertion 'gmlas.f.1: At least one of the two attributes pronunciationSoundLink and pronunciationIPA shall not be void': PASSED - 0 ms"
06.02.2018 23:08:53 - "Test Case 'Constraints' finished: PASSED"
06.02.2018 23:08:53 - "Test Suite 'Conformance class: INSPIRE GML application schemas, General requirements' finished: FAILED"
06.02.2018 23:08:58 - Releasing resources
06.02.2018 23:08:58 - TestRunTask initialized
06.02.2018 23:08:58 - Recreating new tests databases as the Test Object has changed!
06.02.2018 23:08:58 - Skipping schema validation because no schema file has been set in the test suite. Data are only checked for well-formedness.
06.02.2018 23:08:58 - Optimizing last database etf-tdb-30f0e988-231a-42fd-9e8a-f0ac625f508a-0 
06.02.2018 23:08:58 - Import completed
06.02.2018 23:08:59 - Validation ended with 0 error(s)
06.02.2018 23:08:59 - Compiling test script
06.02.2018 23:08:59 - Starting XQuery tests
06.02.2018 23:08:59 - "Testing 1 features"
06.02.2018 23:08:59 - "Indexing features (parsing errors: 0): 0 ms"
06.02.2018 23:08:59 - "Executing Test Suite: /home/tomcat/.etf/projects/ets-repository/data-tn/tn-gml/ets-tn-gml-bsxets.xml"
06.02.2018 23:08:59 - "Statistics table: 1 ms"
06.02.2018 23:08:59 - "Test Suite 'Conformance class: GML application schemas, Transport Networks' started"
06.02.2018 23:08:59 - "Test Case 'Basic test' started"
06.02.2018 23:08:59 - "Test Assertion 'tn-gml.a.1: Transport Network feature in dataset': PASSED - 0 ms"
06.02.2018 23:08:59 - "Test Case 'Basic test' finished: PASSED"
06.02.2018 23:08:59 - "Test Suite 'Conformance class: GML application schemas, Transport Networks' finished: PASSED"
06.02.2018 23:08:59 - Releasing resources
06.02.2018 23:08:59 - TestRunTask initialized
06.02.2018 23:08:59 - Skipping schema validation because no schema file has been set in the test suite. Data are only checked for well-formedness.
06.02.2018 23:08:59 - Validation ended with 0 error(s)
06.02.2018 23:08:59 - Compiling test script
06.02.2018 23:08:59 - Starting XQuery tests
06.02.2018 23:08:59 - "Testing 1 features"
06.02.2018 23:08:59 - "Indexing features (parsing errors: 0): 0 ms"
06.02.2018 23:08:59 - "Executing Test Suite: /home/tomcat/.etf/projects/ets-repository/data-tn/tn-as/ets-tn-as-bsxets.xml"
06.02.2018 23:08:59 - "Statistics table: 0 ms"
06.02.2018 23:08:59 - "Test Suite 'Conformance class: Application schema, Transport Networks Common' started"
06.02.2018 23:08:59 - "Test Case 'Code list values' started"
06.02.2018 23:08:59 - "Test Assertion 'tn-as.a.1: AccessRestrictionValue attributes': PASSED - 117 ms"
06.02.2018 23:08:59 - "Test Assertion 'tn-as.a.2: RestrictionTypeValue attributes': PASSED - 25 ms"
06.02.2018 23:08:59 - "Test Case 'Code list values' finished: PASSED"
06.02.2018 23:08:59 - "Test Case 'Constraints' started"
06.02.2018 23:08:59 - "Test Assertion 'tn-as.b.1: TrafficFlowDirection can only be associated with a spatial object of the type Link or LinkSequence.': PASSED - 1 ms"
06.02.2018 23:08:59 - "Test Assertion 'tn-as.b.2: All transport areas have an external object identifier.': PASSED - 0 ms"
06.02.2018 23:08:59 - "Test Assertion 'tn-as.b.3: All transport links have an external object identifier.': PASSED - 0 ms"
06.02.2018 23:08:59 - "Test Assertion 'tn-as.b.4: All transport link sequences have an external object identifier.': PASSED - 0 ms"
06.02.2018 23:08:59 - "Test Assertion 'tn-as.b.5: All transport link sets have an external object identifier.': PASSED - 0 ms"
06.02.2018 23:08:59 - "Test Assertion 'tn-as.b.6: All transport nodes have an external object identifier.': PASSED - 0 ms"
06.02.2018 23:08:59 - "Test Assertion 'tn-as.b.7: All transport points have an external object identifier.': PASSED - 0 ms"
06.02.2018 23:08:59 - "Test Assertion 'tn-as.b.8: All transport properties have an external object identifier.': PASSED - 0 ms"
06.02.2018 23:08:59 - "Test Assertion 'tn-as.b.9: A transport link sequence must be composed of transport links that all belong to the same transport network.': PASSED - 0 ms"
06.02.2018 23:08:59 - "Test Assertion 'tn-as.b.10: A transport link set must be composed of transport links and or transport link sequences that all belong to the same transport network.': PASSED - 0 ms"
06.02.2018 23:08:59 - "Test Case 'Constraints' finished: PASSED"
06.02.2018 23:08:59 - "Test Case 'Geometry' started"
06.02.2018 23:08:59 - "Test Assertion 'tn-as.c.1: No free transport nodes': PASSED - 0 ms"
06.02.2018 23:08:59 - "Test Assertion 'tn-as.c.2: Intersections only at crossings': PASSED_MANUAL"
06.02.2018 23:08:59 - "Test Case 'Geometry' finished: PASSED_MANUAL"
06.02.2018 23:08:59 - "Test Case 'Network connectivity' started"
06.02.2018 23:08:59 - "Test Assertion 'tn-as.d.1: Connectivity at crossings': PASSED_MANUAL"
06.02.2018 23:08:59 - "Test Assertion 'tn-as.d.2: Unconnected nodes': PASSED_MANUAL"
06.02.2018 23:08:59 - "Test Assertion 'tn-as.d.3: Connectivity tolerance': PASSED_MANUAL"
06.02.2018 23:08:59 - "Test Case 'Network connectivity' finished: PASSED_MANUAL"
06.02.2018 23:08:59 - "Test Case 'Object References' started"
06.02.2018 23:08:59 - "Test Assertion 'tn-as.e.1: Linear references': PASSED_MANUAL"
06.02.2018 23:08:59 - "Test Assertion 'tn-as.e.2: Inter-modal connections': PASSED - 0 ms"
06.02.2018 23:08:59 - "Test Case 'Object References' finished: PASSED_MANUAL"
06.02.2018 23:08:59 - "Test Suite 'Conformance class: Application schema, Transport Networks Common' finished: PASSED_MANUAL"
06.02.2018 23:09:03 - Releasing resources
06.02.2018 23:09:03 - TestRunTask initialized
06.02.2018 23:09:03 - Skipping schema validation because no schema file has been set in the test suite. Data are only checked for well-formedness.
06.02.2018 23:09:03 - Validation ended with 0 error(s)
06.02.2018 23:09:03 - Compiling test script
06.02.2018 23:09:03 - Starting XQuery tests
06.02.2018 23:09:04 - "Testing 1 features"
06.02.2018 23:09:04 - "Executing Test Suite: /home/tomcat/.etf/projects/ets-repository/data-tn/tn-ro-as/ets-tn-ro-as-bsxets.xml"
06.02.2018 23:09:04 - "Statistics table: 1 ms"
06.02.2018 23:09:04 - "Test Suite 'Conformance class: Application schema, Road Transport Networks' started"
06.02.2018 23:09:04 - "Test Case 'Code list values' started"
06.02.2018 23:09:04 - "Test Assertion 'tn-ro-as.a.1: AreaConditionValue attributes': PASSED - 14 ms"
06.02.2018 23:09:04 - "Test Assertion 'tn-ro-as.a.2: FormOfRoadNodeValue attributes': PASSED - 5 ms"
06.02.2018 23:09:04 - "Test Assertion 'tn-ro-as.a.3: FormOfWayValue attributes': PASSED - 4 ms"
06.02.2018 23:09:04 - "Test Assertion 'tn-ro-as.a.4: RoadPartValue attributes': PASSED - 14 ms"
06.02.2018 23:09:04 - "Test Assertion 'tn-ro-as.a.5: RoadServiceTypeValue attributes': PASSED - 5 ms"
06.02.2018 23:09:04 - "Test Assertion 'tn-ro-as.a.6: RoadSurfaceCategoryValue attributes': PASSED - 4 ms"
06.02.2018 23:09:04 - "Test Assertion 'tn-ro-as.a.7: ServiceFacilityValue attributes': PASSED - 4 ms"
06.02.2018 23:09:04 - "Test Assertion 'tn-ro-as.a.8: SpeedLimitSourceValue attributes': PASSED - 4 ms"
06.02.2018 23:09:04 - "Test Assertion 'tn-ro-as.a.9: VehicleTypeValue attributes': PASSED - 10 ms"
06.02.2018 23:09:04 - "Test Assertion 'tn-ro-as.a.10: WeatherConditionValue attributes': PASSED - 4 ms"
06.02.2018 23:09:04 - "Test Case 'Code list values' finished: PASSED"
06.02.2018 23:09:04 - "Test Case 'Constraints' started"
06.02.2018 23:09:04 - "Checking URL: 'https://zbgisws.skgeodesy.sk/inspire_transport_networks_wfs/service.svc/get?SERVICE=WFS&amp;VERSION=2.0.0&amp;REQUEST=GetFeature&amp;STOREDQUERY_ID=urn:ogc:def:query:OGC-WFS::GetFeatureById&amp;id=netElementL.1400000'"
06.02.2018 23:09:34 - "Exception: Timeout exceeded. URL: https://zbgisws.skgeodesy.sk/inspire_transport_networks_wfs/service.svc/get?SERVICE=WFS&amp;VERSION=2.0.0&amp;REQUEST=GetFeature&amp;STOREDQUERY_ID=urn:ogc:def:query:OGC-WFS::GetFeatureById&amp;id=netElementL.1400000"
06.02.2018 23:09:34 - "Test Assertion 'tn-ro-as.b.1: FormOfWay can only be associated with a spatial object that is part of a road transport network.': FAILED - 30142 ms"
06.02.2018 23:09:34 - "Test Assertion 'tn-ro-as.b.2: FunctionalRoadClass can only be associated with a spatial object that is part of a road transport network.': PASSED - 0 ms"
06.02.2018 23:09:34 - "Test Assertion 'tn-ro-as.b.3: NumberOfLanes can only be associated with a spatial object that is part of a road transport network.': PASSED - 0 ms"
06.02.2018 23:09:34 - "Test Assertion 'tn-ro-as.b.4: RoadName can only be associated with a spatial object that is part of a road transport network.': PASSED - 0 ms"
06.02.2018 23:09:34 - "Test Assertion 'tn-ro-as.b.5: RoadSurfaceCategory can only be associated with a spatial object that is part of a road transport network.': PASSED - 0 ms"
06.02.2018 23:09:34 - "Test Assertion 'tn-ro-as.b.6: RoadWidth can only be associated with a spatial object that is part of a road transport network.': PASSED - 0 ms"
06.02.2018 23:09:34 - "Test Assertion 'tn-ro-as.b.7: SpeedLimit can only be associated with a spatial object that is part of a road transport network.': PASSED - 0 ms"
06.02.2018 23:09:34 - "Test Assertion 'tn-ro-as.b.8: RoadServiceType can only be associated with a spatial object of the type RoadServiceArea or RoadNode (when formOfRoadNode=roadServiceArea)': PASSED - 0 ms"
06.02.2018 23:09:34 - "Test Case 'Constraints' finished: FAILED"
06.02.2018 23:09:34 - "Test Case 'Link centrelines' started"
06.02.2018 23:09:34 - "Test Assertion 'tn-ro-as.c.1: Link centrelines test': PASSED_MANUAL"
06.02.2018 23:09:34 - "Test Case 'Link centrelines' finished: PASSED_MANUAL"
06.02.2018 23:09:34 - "Test Suite 'Conformance class: Application schema, Road Transport Networks' finished: FAILED"
06.02.2018 23:09:34 - Releasing resources
06.02.2018 23:09:34 - TestRunTask initialized
06.02.2018 23:09:34 - Skipping schema validation because no schema file has been set in the test suite. Data are only checked for well-formedness.
06.02.2018 23:09:34 - Validation ended with 0 error(s)
06.02.2018 23:09:34 - Compiling test script
06.02.2018 23:09:34 - Starting XQuery tests
06.02.2018 23:09:34 - "Testing 1 features"
06.02.2018 23:09:34 - "Executing Test Suite: /home/tomcat/.etf/projects/ets-repository/data-encoding/inspire-gml/ets-inspire-gml-bsxets.xml"
06.02.2018 23:09:34 - "Statistics table: 0 ms"
06.02.2018 23:09:34 - "Test Suite 'Conformance class: INSPIRE GML encoding' started"
06.02.2018 23:09:34 - "Test Case 'Basic tests' started"
06.02.2018 23:09:34 - "Test Assertion 'gml.a.1: Errors loading the XML documents': PASSED - 0 ms"
06.02.2018 23:09:34 - "Test Assertion 'gml.a.2: Document root element': PASSED - 0 ms"
06.02.2018 23:09:34 - "Test Assertion 'gml.a.3: Character encoding': NOT_APPLICABLE"
06.02.2018 23:09:34 - "Test Case 'Basic tests' finished: PASSED"
06.02.2018 23:09:34 - "Test Suite 'Conformance class: INSPIRE GML encoding' finished: PASSED"
06.02.2018 23:09:34 - Releasing resources
06.02.2018 23:09:34 - TestRunTask initialized
06.02.2018 23:09:34 - Skipping schema validation because no schema file has been set in the test suite. Data are only checked for well-formedness.
06.02.2018 23:09:34 - Validation ended with 0 error(s)
06.02.2018 23:09:34 - Compiling test script
06.02.2018 23:09:34 - Starting XQuery tests
06.02.2018 23:09:34 - "Testing 1 features"
06.02.2018 23:09:34 - "Indexing features (parsing errors: 0): 0 ms"
06.02.2018 23:09:34 - "Executing Test Suite: /home/tomcat/.etf/projects/ets-repository/data/data-consistency/ets-data-consistency-bsxets.xml"
06.02.2018 23:09:34 - "Statistics table: 0 ms"
06.02.2018 23:09:34 - "Test Suite 'Conformance class: Data consistency, General requirements' started"
06.02.2018 23:09:34 - "Test Case 'Version consistency' started"
06.02.2018 23:09:34 - "Test Assertion 'dc.a.1: Version lifespan plausible': PASSED - 0 ms"
06.02.2018 23:09:34 - "Test Assertion 'dc.a.2: Unique identifier persistency': PASSED_MANUAL"
06.02.2018 23:09:34 - "Test Assertion 'dc.a.3: Spatial object type stable': PASSED_MANUAL"
06.02.2018 23:09:34 - "Test Case 'Version consistency' finished: PASSED_MANUAL"
06.02.2018 23:09:34 - "Test Case 'Temporal consistency' started"
06.02.2018 23:09:34 - "Test Assertion 'dc.b.1: Valid time plausible': PASSED - 0 ms"
06.02.2018 23:09:34 - "Test Case 'Temporal consistency' finished: PASSED"
06.02.2018 23:09:34 - "Test Suite 'Conformance class: Data consistency, General requirements' finished: PASSED_MANUAL"
06.02.2018 23:09:35 - Releasing resources
06.02.2018 23:09:35 - TestRunTask initialized
06.02.2018 23:09:35 - Skipping schema validation because no schema file has been set in the test suite. Data are only checked for well-formedness.
06.02.2018 23:09:35 - Validation ended with 0 error(s)
06.02.2018 23:09:35 - Compiling test script
06.02.2018 23:09:35 - Starting XQuery tests
06.02.2018 23:09:35 - "Testing 1 features"
06.02.2018 23:09:35 - "Indexing features (parsing errors: 0): 0 ms"
06.02.2018 23:09:35 - "Executing Test Suite: /home/tomcat/.etf/projects/ets-repository/data-tn/tn-dc/ets-tn-dc-bsxets.xml"
06.02.2018 23:09:35 - "Statistics table: 0 ms"
06.02.2018 23:09:35 - "Test Suite 'Conformance class: Data consistency, Transport Networks' started"
06.02.2018 23:09:35 - "Test Case 'Spatial consistency' started"
06.02.2018 23:09:35 - "Test Assertion 'tn-dc.a.1: Each Transport Network Link or Node geometry is within a Network Area geometry (Road Transport Networks)': PASSED - 0 ms"
06.02.2018 23:09:35 - "Test Assertion 'tn-dc.a.2: Each Transport Network Link or Node geometry is within a Network Area geometry (Railway Transport Networks)': PASSED - 0 ms"
06.02.2018 23:09:35 - "Test Assertion 'tn-dc.a.3: Each Transport Network Link or Node geometry is within a Network Area geometry (Waterway Transport Networks)': PASSED - 0 ms"
06.02.2018 23:09:35 - "Test Assertion 'tn-dc.a.4: Each Transport Network Link or Node geometry is within a Network Area geometry (Air Transport Networks)': PASSED - 0 ms"
06.02.2018 23:09:35 - "Test Assertion 'tn-dc.a.5: Manual review': PASSED_MANUAL"
06.02.2018 23:09:35 - "Test Case 'Spatial consistency' finished: PASSED_MANUAL"
06.02.2018 23:09:35 - "Test Suite 'Conformance class: Data consistency, Transport Networks' finished: PASSED_MANUAL"
06.02.2018 23:09:35 - Releasing resources
06.02.2018 23:09:35 - TestRunTask initialized
06.02.2018 23:09:35 - Skipping schema validation because no schema file has been set in the test suite. Data are only checked for well-formedness.
06.02.2018 23:09:35 - Validation ended with 0 error(s)
06.02.2018 23:09:35 - Compiling test script
06.02.2018 23:09:35 - Starting XQuery tests
06.02.2018 23:09:35 - "Testing 1 features"
06.02.2018 23:09:35 - "Indexing features (parsing errors: 0): 1 ms"
06.02.2018 23:09:35 - "Executing Test Suite: /home/tomcat/.etf/projects/ets-repository/data/information-accessibility/ets-information-accessibility-bsxets.xml"
06.02.2018 23:09:35 - "Statistics table: 0 ms"
06.02.2018 23:09:35 - "Test Suite 'Conformance class: Information accessibility, General requirements' started"
06.02.2018 23:09:35 - "Test Case 'Coordinate reference systems (CRS)' started"
06.02.2018 23:09:35 - "Test Assertion 'ia.a.1: CRS publicly accessible via HTTP': PASSED - 0 ms"
06.02.2018 23:09:35 - "Test Case 'Coordinate reference systems (CRS)' finished: PASSED"
06.02.2018 23:09:35 - "Test Suite 'Conformance class: Information accessibility, General requirements' finished: PASSED"
06.02.2018 23:09:35 - Releasing resources
06.02.2018 23:09:35 - TestRunTask initialized
06.02.2018 23:09:35 - Skipping schema validation because no schema file has been set in the test suite. Data are only checked for well-formedness.
06.02.2018 23:09:35 - Validation ended with 0 error(s)
06.02.2018 23:09:35 - Compiling test script
06.02.2018 23:09:35 - Starting XQuery tests
06.02.2018 23:09:35 - "Testing 1 features"
06.02.2018 23:09:35 - "Executing Test Suite: /home/tomcat/.etf/projects/ets-repository/data-tn/tn-ia/ets-tn-ia-bsxets.xml"
06.02.2018 23:09:35 - "Statistics table: 0 ms"
06.02.2018 23:09:35 - "Test Suite 'Conformance class: Information accessibility, Transport Networks' started"
06.02.2018 23:09:35 - "Test Case 'Code lists' started"
06.02.2018 23:09:35 - "Test Assertion 'tn-ia.a.1: Code list extensions accessible': PASSED - 0 ms"
06.02.2018 23:09:35 - "Test Case 'Code lists' finished: PASSED"
06.02.2018 23:09:35 - "Test Case 'Feature references' started"
06.02.2018 23:09:35 - "Test Assertion 'tn-ia.b.1: MarkerPost.route': PASSED - 0 ms"
06.02.2018 23:09:35 - "Test Assertion 'tn-ia.b.2: TransportLinkSet.post': PASSED - 0 ms"
06.02.2018 23:09:35 - "Test Case 'Feature references' finished: PASSED"
06.02.2018 23:09:35 - "Test Suite 'Conformance class: Information accessibility, Transport Networks' finished: PASSED"
06.02.2018 23:09:35 - Releasing resources
06.02.2018 23:09:35 - TestRunTask initialized
06.02.2018 23:09:35 - Skipping schema validation because no schema file has been set in the test suite. Data are only checked for well-formedness.
06.02.2018 23:09:35 - Validation ended with 0 error(s)
06.02.2018 23:09:35 - Compiling test script
06.02.2018 23:09:35 - Starting XQuery tests
06.02.2018 23:09:35 - "Testing 1 features"
06.02.2018 23:09:35 - "Indexing features (parsing errors: 0): 0 ms"
06.02.2018 23:09:35 - "Executing Test Suite: /home/tomcat/.etf/projects/ets-repository/data/reference-systems/ets-reference-systems-bsxets.xml"
06.02.2018 23:09:35 - "Statistics table: 0 ms"
06.02.2018 23:09:35 - "Test Suite 'Conformance class: Reference systems, General requirements' started"
06.02.2018 23:09:35 - "Test Case 'Spatial reference systems' started"
06.02.2018 23:09:35 - "Test Assertion 'rs.a.1: Spatial reference systems in feature geometries': PASSED - 0 ms"
06.02.2018 23:09:35 - "Test Assertion 'rs.a.2: Default spatial reference systems in feature collections': PASSED - 0 ms"
06.02.2018 23:09:35 - "Test Case 'Spatial reference systems' finished: PASSED"
06.02.2018 23:09:35 - "Test Case 'Temporal reference systems' started"
06.02.2018 23:09:35 - "Test Assertion 'rs.a.3: Temporal reference systems in features': PASSED - 0 ms"
06.02.2018 23:09:35 - "Test Case 'Temporal reference systems' finished: PASSED"
06.02.2018 23:09:35 - "Test Suite 'Conformance class: Reference systems, General requirements' finished: PASSED"
06.02.2018 23:09:35 - Releasing resources
06.02.2018 23:09:35 - TestRunTask initialized
06.02.2018 23:09:35 - Skipping schema validation because no schema file has been set in the test suite. Data are only checked for well-formedness.
06.02.2018 23:09:35 - Validation ended with 0 error(s)
06.02.2018 23:09:35 - Compiling test script
06.02.2018 23:09:35 - Starting XQuery tests
06.02.2018 23:09:35 - "Testing 1 features"
06.02.2018 23:09:35 - "Executing Test Suite: /home/tomcat/.etf/projects/ets-repository/data-tn/tn-rs/ets-tn-rs-bsxets.xml"
06.02.2018 23:09:35 - "Statistics table: 0 ms"
06.02.2018 23:09:35 - "Test Suite 'Conformance class: Reference systems, Transport Networks' started"
06.02.2018 23:09:35 - "Test Case 'Additional theme-specific rules for reference systems' started"
06.02.2018 23:09:35 - "Test Assertion 'tn-rs.a.1: Test always passes': PASSED - 0 ms"
06.02.2018 23:09:35 - "Test Case 'Additional theme-specific rules for reference systems' finished: PASSED"
06.02.2018 23:09:35 - "Test Suite 'Conformance class: Reference systems, Transport Networks' finished: PASSED"
06.02.2018 23:09:36 - Releasing resources
06.02.2018 23:09:36 - Changed state from INITIALIZED to RUNNING
06.02.2018 23:09:36 - Duration: 1min
06.02.2018 23:09:36 - TestRun finished
06.02.2018 23:09:36 - Changed state from RUNNING to COMPLETED
