12.12.2017 02:13:42 - Preparing Test Run downloadService_17316219_Geodetick&yacute; a kartografick&yacute; &uacute;stav Bratislava_INSPIRE Download Service - Hydrography (initiated Tue Dec 12 02:13:42 CET 2017)
12.12.2017 02:13:42 - Resolving Executable Test Suite dependencies
12.12.2017 02:13:42 - Preparing 2 Test Task:
12.12.2017 02:13:42 -  TestTask 1 (dfce4743-18e3-483b-9ed5-6f0f423c3ef4)
12.12.2017 02:13:42 -  will perform tests on Test Object 'INSPIRE Download Service - Hydrography' by using Executable Test Suite 'WFS 2.0 (OGC 09-025r2/ISO 19142) Conformance Test Suite (EID: 95a1b6fc-2b55-3d43-9502-3b8b605bda10, V: 1.26.0 )'
12.12.2017 02:13:42 -  with parameters: 
12.12.2017 02:13:42 - etf.testcases = *
12.12.2017 02:13:42 -  TestTask 2 (06b66bc7-8359-417c-9934-9ecda1494272)
12.12.2017 02:13:42 -  will perform tests on Test Object 'INSPIRE Download Service - Hydrography' by using Executable Test Suite 'Conformance Class: Download Service - Direct WFS (EID: ed2d3501-d700-4ff9-b9bf-070dece8ddbd, V: 1.0.2 )'
12.12.2017 02:13:42 -  with parameters: 
12.12.2017 02:13:42 - etf.testcases = *
12.12.2017 02:13:42 - Test Tasks prepared and ready to be executed. Waiting for the scheduler to start.
12.12.2017 02:13:42 - Setting state to CREATED
12.12.2017 02:13:42 - Changed state from CREATED to INITIALIZING
12.12.2017 02:13:42 - Starting TestRun.ed9e50f7-94f1-4413-83b0-c7c045077cdd at 2017-12-12T02:13:44+01:00
12.12.2017 02:13:44 - Changed state from INITIALIZING to INITIALIZED
12.12.2017 02:13:44 - TestRunTask initialized
12.12.2017 02:13:44 - Invoking TEAM Engine remotely. This may take a while. Progress messages are not supported.
12.12.2017 02:13:44 - Timeout is set to: 20min
12.12.2017 02:33:44 - The OGC TEAM Engine is taking too long to respond.
12.12.2017 02:33:44 - Checking availability...
12.12.2017 02:33:45 - ...[OK]. The OGC TEAM Engine is available. You may need to ask the system administrator to increase the OGC TEAM Engine test driver timeout.
12.12.2017 02:33:45 - Releasing resources
12.12.2017 02:33:45 - Project Properties: 
12.12.2017 02:33:45 - etf.testcases - * 
12.12.2017 02:33:45 - serviceEndpoint - https://zbgisws.skgeodesy.sk/inspire_hydrography_wfs/service.svc/get?ACCEPTVERSIONS=2.0.0&request=GetCapabilities&service=WFS&VERSION=2.0.0 
12.12.2017 02:33:45 - username -  
12.12.2017 02:33:45 - authUser -  
12.12.2017 02:33:45 - authMethod - basic 
12.12.2017 02:33:45 - TestRunTask initialized
12.12.2017 02:33:54 ERROR Service returned an exception: Operation request contains an invalid parameter value.
12.12.2017 02:33:54 ERROR Assertion failed with error 'TR.unexpectedException'
12.12.2017 02:33:54 ERROR Assertion failed with error 'TR.initializationAndBasicChecksFailed'
12.12.2017 02:33:54 ERROR Assertion failed with error 'TR.initializationAndBasicChecksFailed'
12.12.2017 02:33:54 ERROR Assertion failed with error 'TR.initializationAndBasicChecksFailed'
12.12.2017 02:33:54 - Releasing resources
12.12.2017 02:33:54 - Changed state from INITIALIZED to RUNNING
12.12.2017 02:33:55 - Duration: 20min
12.12.2017 02:33:55 - TestRun finished
12.12.2017 02:33:55 - Changed state from RUNNING to COMPLETED
