31.01.2018 01:26:54 - Preparing Test Run interoperability_null_GeodeticandCartographicInstituteBratislava_cp:CadastralParcel (initiated Wed Jan 31 01:26:54 CET 2018)
31.01.2018 01:26:54 - Resolving Executable Test Suite dependencies
31.01.2018 01:26:54 - Preparing 10 Test Task:
31.01.2018 01:26:54 -  TestTask 1 (f0ab2886-373b-4a75-ae50-070a484ea487)
31.01.2018 01:26:54 -  will perform tests on Test Object 'service.xml' by using Executable Test Suite 'LAZY.545f9e49-009b-4114-9333-7ca26413b5d4'
31.01.2018 01:26:54 -  with parameters: 
31.01.2018 01:26:54 - etf.testcases = *
31.01.2018 01:26:54 -  TestTask 2 (66103a09-237c-4786-8f0e-90ce4d3eac38)
31.01.2018 01:26:54 -  will perform tests on Test Object 'service.xml' by using Executable Test Suite 'LAZY.09820daf-62b2-4fa3-a95f-56a0d2b7c4d8'
31.01.2018 01:26:54 -  with parameters: 
31.01.2018 01:26:54 - etf.testcases = *
31.01.2018 01:26:54 -  TestTask 3 (08e3bec8-d8a3-4ba0-93cc-aabe393334d5)
31.01.2018 01:26:54 -  will perform tests on Test Object 'service.xml' by using Executable Test Suite 'LAZY.18b742d0-15eb-421f-bbec-7c8c5cf7ee1a'
31.01.2018 01:26:54 -  with parameters: 
31.01.2018 01:26:54 - etf.testcases = *
31.01.2018 01:26:54 -  TestTask 4 (9a9660c3-5a6d-4431-b165-33c4bdc94f2b)
31.01.2018 01:26:54 -  will perform tests on Test Object 'service.xml' by using Executable Test Suite 'Conformance class: Application Schema, Cadastral parcel (EID: 1f9bc92a-5879-4e9b-bcbe-1d2d0cab0aab, V: 0.2.2 )'
31.01.2018 01:26:54 -  with parameters: 
31.01.2018 01:26:54 - etf.testcases = *
31.01.2018 01:26:54 -  TestTask 5 (69b7a334-9ece-4f84-bb6b-61dcdee0e483)
31.01.2018 01:26:54 -  will perform tests on Test Object 'service.xml' by using Executable Test Suite 'LAZY.61070ae8-13cb-4303-a340-72c8b877b00a'
31.01.2018 01:26:54 -  with parameters: 
31.01.2018 01:26:54 - etf.testcases = *
31.01.2018 01:26:54 -  TestTask 6 (6de3654d-ea71-4bc4-ad61-8a25b51ec4c0)
31.01.2018 01:26:54 -  will perform tests on Test Object 'service.xml' by using Executable Test Suite 'Conformance class: Data consistency, Cadastral Parcels (EID: 92032cdb-db88-42aa-96c0-70a1af9e68b1, V: 0.2.0 )'
31.01.2018 01:26:54 -  with parameters: 
31.01.2018 01:26:54 - etf.testcases = *
31.01.2018 01:26:54 -  TestTask 7 (8d3ff7cf-c29d-419a-bb6c-fa506493bdea)
31.01.2018 01:26:54 -  will perform tests on Test Object 'service.xml' by using Executable Test Suite 'LAZY.499937ea-0590-42d2-bd7a-1cafff35ecdb'
31.01.2018 01:26:54 -  with parameters: 
31.01.2018 01:26:54 - etf.testcases = *
31.01.2018 01:26:54 -  TestTask 8 (081f6359-f5c7-4673-8f7e-8e4ae7ff61e3)
31.01.2018 01:26:54 -  will perform tests on Test Object 'service.xml' by using Executable Test Suite 'Conformance class: Information accessibility, Cadastral Parcels (EID: c4fbae00-3070-49fa-b803-24c66c31ac70, V: 0.2.1 )'
31.01.2018 01:26:54 -  with parameters: 
31.01.2018 01:26:54 - etf.testcases = *
31.01.2018 01:26:54 -  TestTask 9 (37b2bf6a-2815-4d8a-8c1f-4884877453c9)
31.01.2018 01:26:54 -  will perform tests on Test Object 'service.xml' by using Executable Test Suite 'LAZY.63f586f0-080c-493b-8ca2-9919427440cc'
31.01.2018 01:26:54 -  with parameters: 
31.01.2018 01:26:54 - etf.testcases = *
31.01.2018 01:26:54 -  TestTask 10 (40ac5736-3e65-42ec-b54b-c84f314d33bd)
31.01.2018 01:26:54 -  will perform tests on Test Object 'service.xml' by using Executable Test Suite 'Conformance class: Reference Systems, Cadastral Parcels (EID: dbcc48ae-6871-4444-8e95-547bc22aacb2, V: 0.2.1 )'
31.01.2018 01:26:54 -  with parameters: 
31.01.2018 01:26:54 - etf.testcases = *
31.01.2018 01:26:54 - Test Tasks prepared and ready to be executed. Waiting for the scheduler to start.
31.01.2018 01:26:54 - Setting state to CREATED
31.01.2018 01:26:54 - Changed state from CREATED to INITIALIZING
31.01.2018 01:26:54 - Starting TestRun.15ccb75e-4774-4ad8-8f62-df1e8ad8538e at 2018-01-31T01:26:55+01:00
31.01.2018 01:26:55 - Changed state from INITIALIZING to INITIALIZED
31.01.2018 01:26:55 - TestRunTask initialized
31.01.2018 01:26:55 - Creating new tests databases to speed up tests.
31.01.2018 01:26:55 - Skipping schema validation because no schema file has been set in the test suite. Data are only checked for well-formedness.
31.01.2018 01:26:55 - Optimizing last database etf-tdb-f5b0dbcb-c771-4b9e-9695-c04c0a258176-0 
31.01.2018 01:26:55 - Import completed
31.01.2018 01:26:57 - Validation ended with 0 error(s)
31.01.2018 01:26:57 - Compiling test script
31.01.2018 01:26:57 - Starting XQuery tests
31.01.2018 01:26:57 - "Testing 1 features"
31.01.2018 01:26:57 - "Executing Test Suite: /home/tomcat/.etf/projects/ets-repository/data-encoding/inspire-gml/ets-inspire-gml-bsxets.xml"
31.01.2018 01:26:57 - "Statistics table: 1 ms"
31.01.2018 01:26:57 - "Test Suite 'Conformance class: INSPIRE GML encoding' started"
31.01.2018 01:26:57 - "Test Case 'Basic tests' started"
31.01.2018 01:26:57 - "Test Assertion 'gml.a.1: Errors loading the XML documents': PASSED - 0 ms"
31.01.2018 01:26:57 - "Test Assertion 'gml.a.2: Document root element': PASSED - 0 ms"
31.01.2018 01:26:57 - "Test Assertion 'gml.a.3: Character encoding': NOT_APPLICABLE"
31.01.2018 01:26:57 - "Test Case 'Basic tests' finished: PASSED"
31.01.2018 01:26:57 - "Test Suite 'Conformance class: INSPIRE GML encoding' finished: PASSED"
31.01.2018 01:26:57 - Releasing resources
31.01.2018 01:26:57 - TestRunTask initialized
31.01.2018 01:26:57 - Recreating new tests databases as the Test Object has changed!
31.01.2018 01:26:57 - Skipping schema validation because no schema file has been set in the test suite. Data are only checked for well-formedness.
31.01.2018 01:26:57 - Optimizing last database etf-tdb-f5b0dbcb-c771-4b9e-9695-c04c0a258176-0 
31.01.2018 01:26:57 - Import completed
31.01.2018 01:26:57 - Validation ended with 0 error(s)
31.01.2018 01:26:57 - Compiling test script
31.01.2018 01:26:57 - Starting XQuery tests
31.01.2018 01:26:57 - "Testing 1 features"
31.01.2018 01:26:57 - "Indexing features (parsing errors: 0): 40 ms"
31.01.2018 01:26:57 - "Executing Test Suite: /home/tomcat/.etf/projects/ets-repository/data/schemas/ets-schemas-bsxets.xml"
31.01.2018 01:26:57 - "Statistics table: 0 ms"
31.01.2018 01:26:57 - "Test Suite 'Conformance class: INSPIRE GML application schemas, General requirements' started"
31.01.2018 01:26:57 - "Test Case 'Schema' started"
31.01.2018 01:26:57 - "Test Assertion 'gmlas.a.1: Mapping of source data to INSPIRE': PASSED_MANUAL"
31.01.2018 01:26:57 - "Test Assertion 'gmlas.a.2: Modelling of additional spatial object types': PASSED_MANUAL"
31.01.2018 01:26:57 - "Test Case 'Schema' finished: PASSED_MANUAL"
31.01.2018 01:26:57 - "Test Case 'Schema validation' started"
31.01.2018 01:26:57 - "Test Assertion 'gmlas.b.1: xsi:schemaLocation attribute': PASSED - 0 ms"
31.01.2018 01:26:57 - "Validating service.xml"
31.01.2018 01:27:03 - "Duration: 5548 ms. Errors: 0."
31.01.2018 01:27:03 - "Test Assertion 'gmlas.b.2: validate XML documents': PASSED - 5550 ms"
31.01.2018 01:27:03 - "Test Case 'Schema validation' finished: PASSED"
31.01.2018 01:27:03 - "Test Case 'GML model' started"
31.01.2018 01:27:03 - "Test Assertion 'gmlas.c.1: Consistency with the GML model': PASSED - 1 ms"
31.01.2018 01:27:03 - "Test Assertion 'gmlas.c.2: nilReason attributes require xsi:nil=true': PASSED - 0 ms"
31.01.2018 01:27:03 - "Test Assertion 'gmlas.c.3: nilReason values': PASSED - 0 ms"
31.01.2018 01:27:03 - "Test Case 'GML model' finished: PASSED"
31.01.2018 01:27:03 - "Test Case 'Simple features' started"
31.01.2018 01:27:03 - "Test Assertion 'gmlas.d.1: No spatial topology objects': PASSED - 0 ms"
31.01.2018 01:27:03 - "Test Assertion 'gmlas.d.2: No non-linear interpolation': PASSED - 0 ms"
31.01.2018 01:27:03 - "Test Assertion 'gmlas.d.3: Surface geometry elements': PASSED - 0 ms"
31.01.2018 01:27:03 - "Test Assertion 'gmlas.d.4: No non-planar interpolation': PASSED - 0 ms"
31.01.2018 01:27:03 - "Test Assertion 'gmlas.d.5: Geometry elements': PASSED - 0 ms"
31.01.2018 01:27:03 - "Test Assertion 'gmlas.d.6: Point coordinates in gml:pos': PASSED - 0 ms"
31.01.2018 01:27:03 - "Test Assertion 'gmlas.d.7: Curve/Surface coordinates in gml:posList': PASSED - 0 ms"
31.01.2018 01:27:03 - "Test Assertion 'gmlas.d.8: No array property elements': PASSED - 0 ms"
31.01.2018 01:27:03 - "Test Assertion 'gmlas.d.9: 1, 2 or 3 coordinate dimensions': PASSED - 0 ms"
31.01.2018 01:27:03 - "Test Assertion 'gmlas.d.10: Validate geometries (1)': PASSED - 0 ms"
31.01.2018 01:27:03 - "Test Assertion 'gmlas.d.11: Validate geometries (2)': PASSED - 0 ms"
31.01.2018 01:27:03 - "Test Case 'Simple features' finished: PASSED"
31.01.2018 01:27:03 - "Test Case 'Code list values in basic data types' started"
31.01.2018 01:27:03 - "Test Assertion 'gmlas.e.1: GrammaticalNumber attributes': PASSED - 7 ms"
31.01.2018 01:27:03 - "Test Assertion 'gmlas.e.2: GrammaticalGender attributes': PASSED - 4 ms"
31.01.2018 01:27:03 - "Test Assertion 'gmlas.e.3: NameStatus attributes': PASSED - 3 ms"
31.01.2018 01:27:03 - "Test Assertion 'gmlas.e.4: Nativeness attributes': PASSED - 3 ms"
31.01.2018 01:27:03 - "Test Case 'Code list values in basic data types' finished: PASSED"
31.01.2018 01:27:03 - "Test Case 'Constraints' started"
31.01.2018 01:27:03 - "Test Assertion 'gmlas.f.1: At least one of the two attributes pronunciationSoundLink and pronunciationIPA shall not be void': PASSED - 0 ms"
31.01.2018 01:27:03 - "Test Case 'Constraints' finished: PASSED"
31.01.2018 01:27:03 - "Test Suite 'Conformance class: INSPIRE GML application schemas, General requirements' finished: PASSED_MANUAL"
31.01.2018 01:27:04 - Releasing resources
31.01.2018 01:27:04 - TestRunTask initialized
31.01.2018 01:27:04 - Skipping schema validation because no schema file has been set in the test suite. Data are only checked for well-formedness.
31.01.2018 01:27:04 - Validation ended with 0 error(s)
31.01.2018 01:27:04 - Compiling test script
31.01.2018 01:27:04 - Starting XQuery tests
31.01.2018 01:27:04 - "Testing 1 features"
31.01.2018 01:27:04 - "Executing Test Suite: /home/tomcat/.etf/projects/ets-repository/data-cp/cp-gml/ets-cp-gml-bsxets.xml"
31.01.2018 01:27:04 - "Statistics table: 0 ms"
31.01.2018 01:27:04 - "Test Suite 'Conformance class: GML application schemas, Cadastral Parcels' started"
31.01.2018 01:27:04 - "Test Case 'Basic test' started"
31.01.2018 01:27:04 - "Test Assertion 'cp-gml.a.1: CadastralParcel feature in dataset': PASSED - 0 ms"
31.01.2018 01:27:04 - "Test Case 'Basic test' finished: PASSED"
31.01.2018 01:27:04 - "Test Suite 'Conformance class: GML application schemas, Cadastral Parcels' finished: PASSED"
31.01.2018 01:27:04 - Releasing resources
31.01.2018 01:27:04 - TestRunTask initialized
31.01.2018 01:27:04 - Skipping schema validation because no schema file has been set in the test suite. Data are only checked for well-formedness.
31.01.2018 01:27:04 - Validation ended with 0 error(s)
31.01.2018 01:27:04 - Compiling test script
31.01.2018 01:27:04 - Starting XQuery tests
31.01.2018 01:27:04 - "Testing 1 features"
31.01.2018 01:27:04 - "Indexing features (parsing errors: 0): 40 ms"
31.01.2018 01:27:04 - "Executing Test Suite: /home/tomcat/.etf/projects/ets-repository/data-cp/cp-as/ets-cp-as-bsxets.xml"
31.01.2018 01:27:04 - "Statistics table: 1 ms"
31.01.2018 01:27:04 - "Test Suite 'Conformance class: Application Schema, Cadastral parcel' started"
31.01.2018 01:27:04 - "Test Case 'Modelling of object references' started"
31.01.2018 01:27:04 - "Test Assertion 'cp-as.a.1: Verify whether all instances of the spatial object type CadastralParcel carry as a thematic identifier the attribute nationalCadastralReference.': PASSED - 0 ms"
31.01.2018 01:27:04 - "Test Assertion 'cp-as.a.2: Manual review - Verify that the value of the attribute nationalCadastralReference enables the users to make the link with rights, owners and other cadastral information in national cadastral registers or equivalent.': PASSED_MAN..."
31.01.2018 01:27:04 - "Test Case 'Modelling of object references' finished: PASSED_MANUAL"
31.01.2018 01:27:04 - "Test Case 'Cadastral Boundaries' started"
31.01.2018 01:27:04 - "Test Assertion 'cp-as.b.1: Cadastral boundaries corresponding to the outline of a cadastral parcel form closed ring(s).': NOT_APPLICABLE"
31.01.2018 01:27:04 - "Test Case 'Cadastral Boundaries' finished: NOT_APPLICABLE"
31.01.2018 01:27:04 - "Test Case 'Code list values' started"
31.01.2018 01:27:04 - "Test Assertion 'cp-as.c.1: CadastralZoningLevel attributes': PASSED - 4 ms"
31.01.2018 01:27:04 - "Test Case 'Code list values' finished: PASSED"
31.01.2018 01:27:04 - "Test Case 'Constraints' started"
31.01.2018 01:27:04 - "Test Assertion 'cp-as.d.1: Value of areaValue shall be given in square meters': PASSED - 0 ms"
31.01.2018 01:27:04 - "Test Assertion 'cp-as.d.2: Value of estimatedAccuracy shall be given in meters': PASSED - 0 ms"
31.01.2018 01:27:04 - "Test Assertion 'cp-as.d.3: Type of geometry shall be GM_Surface or GM_MultiSurface': PASSED - 0 ms"
31.01.2018 01:27:04 - "Test Assertion 'cp-as.d.4: A lower level cadastral zoning shall be part of an upper level zoning.': PASSED - 0 ms"
31.01.2018 01:27:04 - "Test Case 'Constraints' finished: PASSED"
31.01.2018 01:27:04 - "Test Suite 'Conformance class: Application Schema, Cadastral parcel' finished: PASSED_MANUAL"
31.01.2018 01:27:04 - Releasing resources
31.01.2018 01:27:04 - TestRunTask initialized
31.01.2018 01:27:04 - Skipping schema validation because no schema file has been set in the test suite. Data are only checked for well-formedness.
31.01.2018 01:27:04 - Validation ended with 0 error(s)
31.01.2018 01:27:04 - Compiling test script
31.01.2018 01:27:04 - Starting XQuery tests
31.01.2018 01:27:04 - "Testing 1 features"
31.01.2018 01:27:05 - "Indexing features (parsing errors: 0): 41 ms"
31.01.2018 01:27:05 - "Executing Test Suite: /home/tomcat/.etf/projects/ets-repository/data/data-consistency/ets-data-consistency-bsxets.xml"
31.01.2018 01:27:05 - "Statistics table: 0 ms"
31.01.2018 01:27:05 - "Test Suite 'Conformance class: Data consistency, General requirements' started"
31.01.2018 01:27:05 - "Test Case 'Version consistency' started"
31.01.2018 01:27:05 - "Test Assertion 'dc.a.1: Version lifespan plausible': PASSED - 0 ms"
31.01.2018 01:27:05 - "Test Assertion 'dc.a.2: Unique identifier persistency': PASSED_MANUAL"
31.01.2018 01:27:05 - "Test Assertion 'dc.a.3: Spatial object type stable': PASSED_MANUAL"
31.01.2018 01:27:05 - "Test Case 'Version consistency' finished: PASSED_MANUAL"
31.01.2018 01:27:05 - "Test Case 'Temporal consistency' started"
31.01.2018 01:27:05 - "Test Assertion 'dc.b.1: Valid time plausible': PASSED - 0 ms"
31.01.2018 01:27:05 - "Test Case 'Temporal consistency' finished: PASSED"
31.01.2018 01:27:05 - "Test Suite 'Conformance class: Data consistency, General requirements' finished: PASSED_MANUAL"
31.01.2018 01:27:05 - Releasing resources
31.01.2018 01:27:05 - TestRunTask initialized
31.01.2018 01:27:05 - Skipping schema validation because no schema file has been set in the test suite. Data are only checked for well-formedness.
31.01.2018 01:27:05 - Validation ended with 0 error(s)
31.01.2018 01:27:05 - Compiling test script
31.01.2018 01:27:05 - Starting XQuery tests
31.01.2018 01:27:05 - "Testing 1 features"
31.01.2018 01:27:05 - "Executing Test Suite: /home/tomcat/.etf/projects/ets-repository/data-cp/cp-dc/ets-cp-dc-bsxets.xml"
31.01.2018 01:27:05 - "Statistics table: 0 ms"
31.01.2018 01:27:05 - "Test Suite 'Conformance class: Data consistency, Cadastral Parcels' started"
31.01.2018 01:27:05 - "Test Case 'Additional theme-specific consistency rules' started"
31.01.2018 01:27:05 - "Test Assertion 'cp-dc.a.1: Test always passes': PASSED - 0 ms"
31.01.2018 01:27:05 - "Test Case 'Additional theme-specific consistency rules' finished: PASSED"
31.01.2018 01:27:05 - "Test Suite 'Conformance class: Data consistency, Cadastral Parcels' finished: PASSED"
31.01.2018 01:27:05 - Releasing resources
31.01.2018 01:27:05 - TestRunTask initialized
31.01.2018 01:27:05 - Skipping schema validation because no schema file has been set in the test suite. Data are only checked for well-formedness.
31.01.2018 01:27:05 - Validation ended with 0 error(s)
31.01.2018 01:27:05 - Compiling test script
31.01.2018 01:27:05 - Starting XQuery tests
31.01.2018 01:27:05 - "Testing 1 features"
31.01.2018 01:27:05 - "Indexing features (parsing errors: 0): 40 ms"
31.01.2018 01:27:05 - "Executing Test Suite: /home/tomcat/.etf/projects/ets-repository/data/information-accessibility/ets-information-accessibility-bsxets.xml"
31.01.2018 01:27:05 - "Statistics table: 0 ms"
31.01.2018 01:27:05 - "Test Suite 'Conformance class: Information accessibility, General requirements' started"
31.01.2018 01:27:05 - "Test Case 'Coordinate reference systems (CRS)' started"
31.01.2018 01:27:05 - "Test Assertion 'ia.a.1: CRS publicly accessible via HTTP': FAILED - 1 ms"
31.01.2018 01:27:05 - "Test Case 'Coordinate reference systems (CRS)' finished: FAILED"
31.01.2018 01:27:05 - "Test Suite 'Conformance class: Information accessibility, General requirements' finished: FAILED"
31.01.2018 01:27:06 - Releasing resources
31.01.2018 01:27:06 - TestRunTask initialized
31.01.2018 01:27:06 - Skipping schema validation because no schema file has been set in the test suite. Data are only checked for well-formedness.
31.01.2018 01:27:06 - Validation ended with 0 error(s)
31.01.2018 01:27:06 - Compiling test script
31.01.2018 01:27:06 - Starting XQuery tests
31.01.2018 01:27:06 - "Testing 1 features"
31.01.2018 01:27:06 - "Executing Test Suite: /home/tomcat/.etf/projects/ets-repository/data-cp/cp-ia/ets-cp-ia-bsxets.xml"
31.01.2018 01:27:06 - "Statistics table: 0 ms"
31.01.2018 01:27:06 - "Test Suite 'Conformance class: Information accessibility, Cadastral Parcels' started"
31.01.2018 01:27:06 - "Test Case 'Code lists' started"
31.01.2018 01:27:06 - "Test Assertion 'cp-ia.a.1: Code list extensions accessible': PASSED - 0 ms"
31.01.2018 01:27:06 - "Test Case 'Code lists' finished: PASSED"
31.01.2018 01:27:06 - "Test Case 'Feature references' started"
31.01.2018 01:27:06 - "Test Assertion 'cp-ia.b.1: BasicPropertyUnit.AdministrativeUnit and CadastralParcel.AdministrativeUnit': PASSED - 0 ms"
31.01.2018 01:27:06 - "Test Assertion 'cp-ia.b.2: CadastralBoundary.parcel': PASSED - 0 ms"
31.01.2018 01:27:06 - "Test Assertion 'cp-ia.b.3: CadastralParcel.basicPropertyUnit': PASSED - 0 ms"
31.01.2018 01:27:06 - "Checking URL: 'https://inspire.skgeodesy.sk/eskn/rest/services/INSPIREWFS/uo_wfs_inspire/GeoDataServer/exts/InspireFeatureDownload/service?SERVICE=WFS&amp;VERSION=2.0.0&amp;REQUEST=GetFeature&amp;STOREDQUERY_ID=urn:ogc:def:query:OGC-WFS::GetFeatureById&amp;..."
31.01.2018 01:27:12 - "Test Assertion 'cp-ia.b.4: CadastralParcel.zoning': FAILED - 6537 ms"
31.01.2018 01:27:12 - "Test Assertion 'cp-ia.b.5: CadastralZoning.upperLevelUnit': PASSED - 0 ms"
31.01.2018 01:27:12 - "Test Case 'Feature references' finished: FAILED"
31.01.2018 01:27:12 - "Test Suite 'Conformance class: Information accessibility, Cadastral Parcels' finished: FAILED"
31.01.2018 01:27:13 - Releasing resources
31.01.2018 01:27:13 - TestRunTask initialized
31.01.2018 01:27:13 - Skipping schema validation because no schema file has been set in the test suite. Data are only checked for well-formedness.
31.01.2018 01:27:13 - Validation ended with 0 error(s)
31.01.2018 01:27:13 - Compiling test script
31.01.2018 01:27:13 - Starting XQuery tests
31.01.2018 01:27:13 - "Testing 1 features"
31.01.2018 01:27:13 - "Indexing features (parsing errors: 0): 40 ms"
31.01.2018 01:27:13 - "Executing Test Suite: /home/tomcat/.etf/projects/ets-repository/data/reference-systems/ets-reference-systems-bsxets.xml"
31.01.2018 01:27:13 - "Statistics table: 1 ms"
31.01.2018 01:27:13 - "Test Suite 'Conformance class: Reference systems, General requirements' started"
31.01.2018 01:27:13 - "Test Case 'Spatial reference systems' started"
31.01.2018 01:27:13 - "Test Assertion 'rs.a.1: Spatial reference systems in feature geometries': FAILED - 0 ms"
31.01.2018 01:27:13 - "Test Assertion 'rs.a.2: Default spatial reference systems in feature collections': PASSED - 0 ms"
31.01.2018 01:27:13 - "Test Case 'Spatial reference systems' finished: FAILED"
31.01.2018 01:27:13 - "Test Case 'Temporal reference systems' started"
31.01.2018 01:27:13 - "Test Assertion 'rs.a.3: Temporal reference systems in features': PASSED - 0 ms"
31.01.2018 01:27:13 - "Test Case 'Temporal reference systems' finished: PASSED"
31.01.2018 01:27:13 - "Test Suite 'Conformance class: Reference systems, General requirements' finished: FAILED"
31.01.2018 01:27:14 - Releasing resources
31.01.2018 01:27:14 - TestRunTask initialized
31.01.2018 01:27:14 - Skipping schema validation because no schema file has been set in the test suite. Data are only checked for well-formedness.
31.01.2018 01:27:14 - Validation ended with 0 error(s)
31.01.2018 01:27:14 - Compiling test script
31.01.2018 01:27:14 - Starting XQuery tests
31.01.2018 01:27:14 - "Testing 1 features"
31.01.2018 01:27:14 - "Executing Test Suite: /home/tomcat/.etf/projects/ets-repository/data-cp/cp-rs/ets-cp-rs-bsxets.xml"
31.01.2018 01:27:14 - "Statistics table: 0 ms"
31.01.2018 01:27:14 - "Test Suite 'Conformance class: Reference Systems, Cadastral Parcels' started"
31.01.2018 01:27:14 - "Test Case 'Lambert Conformal Conic projection' started"
31.01.2018 01:27:14 - "Test Assertion 'cp-rs.a.1: Verify that data related to the spatial data theme Cadastral Parcels made available in plane coordinates using the Lambert Conformal Conic projection are also available in at least one other of the coordinate reference systems s..."
31.01.2018 01:27:14 - "Test Assertion 'cp-rs.a.2: Verify that if there is a reference to the Lambert Conformal Conic projection in the bounding box of the feature collection, there is also a reference to (at least) one other of the coordinate reference systems specified in sect..."
31.01.2018 01:27:14 - "Test Case 'Lambert Conformal Conic projection' finished: PASSED"
31.01.2018 01:27:14 - "Test Suite 'Conformance class: Reference Systems, Cadastral Parcels' finished: PASSED"
31.01.2018 01:27:14 - Releasing resources
31.01.2018 01:27:14 - Changed state from INITIALIZED to RUNNING
31.01.2018 01:27:14 - Duration: 20sec
31.01.2018 01:27:14 - TestRun finished
31.01.2018 01:27:14 - Changed state from RUNNING to COMPLETED
