15.11.2017 16:47:45 - Preparing Test Run metadata (initiated Wed Nov 15 16:47:45 CET 2017)
15.11.2017 16:47:45 - Resolving Executable Test Suite dependencies
15.11.2017 16:47:45 - Preparing 2 Test Task:
15.11.2017 16:47:45 -  TestTask 1 (ce01f6af-f223-45a6-a102-457224b6dc65)
15.11.2017 16:47:45 -  will perform tests on Test Object 'GetRecordByIdResponse.xml' by using Executable Test Suite 'LAZY.e3500038-e37c-4dcf-806c-6bc82d585b3b'
15.11.2017 16:47:45 -  with parameters: 
15.11.2017 16:47:45 - etf.testcases = *
15.11.2017 16:47:45 -  TestTask 2 (b55cf5e6-a7ce-4287-8d8d-27e84308b5a3)
15.11.2017 16:47:45 -  will perform tests on Test Object 'GetRecordByIdResponse.xml' by using Executable Test Suite 'Conformance class: INSPIRE Profile based on EN ISO 19115 and EN ISO 19119 (EID: ec7323d5-d8f0-4cfe-b23a-b826df86d58c, V: 0.2.4 )'
15.11.2017 16:47:45 -  with parameters: 
15.11.2017 16:47:45 - etf.testcases = *
15.11.2017 16:47:45 - Test Tasks prepared and ready to be executed. Waiting for the scheduler to start.
15.11.2017 16:47:45 - Setting state to CREATED
15.11.2017 16:47:45 - Changed state from CREATED to INITIALIZING
15.11.2017 16:47:45 - Starting TestRun.37ff847c-c34a-470e-9965-f89c9c736caf at 2017-11-15T16:47:46+01:00
15.11.2017 16:47:46 - Changed state from INITIALIZING to INITIALIZED
15.11.2017 16:47:46 - TestRunTask initialized
15.11.2017 16:47:46 - Creating new tests databases to speed up tests.
15.11.2017 16:47:46 - Skipping schema validation because no schema file has been set in the test suite. Data are only checked for well-formedness.
15.11.2017 16:47:46 - Optimizing last database etf-tdb-ad7856f6-cb86-4943-b06f-291a3f3200eb-0 
15.11.2017 16:47:46 - Import completed
15.11.2017 16:47:47 - Validation ended with 0 error(s)
15.11.2017 16:47:47 - Compiling test script
15.11.2017 16:47:47 - Starting XQuery tests
15.11.2017 16:47:47 - "Testing 1 records"
15.11.2017 16:47:47 - "Executing Test Suite: /home/tomcat/.etf/projects/ets-repository/metadata/xml/ets-md-xml-bsxets.xml"
15.11.2017 16:47:47 - "Statistics table: 0 ms"
15.11.2017 16:47:47 - "Test Suite 'Conformance class: XML encoding of ISO 19115/19119 metadata' started"
15.11.2017 16:47:47 - "Test Case 'Schema validation' started"
15.11.2017 16:47:49 - "Validating file GetRecordByIdResponse.xml: 1874 ms"
15.11.2017 16:47:49 - "Test Assertion 'md-xml.a.1: Validate XML documents': PASSED - 1874 ms"
15.11.2017 16:47:49 - "Test Case 'Schema validation' finished: PASSED"
15.11.2017 16:47:49 - "Test Suite 'Conformance class: XML encoding of ISO 19115/19119 metadata' finished: PASSED"
15.11.2017 16:47:49 - Releasing resources
15.11.2017 16:47:49 - TestRunTask initialized
15.11.2017 16:47:49 - Recreating new tests databases as the Test Object has changed!
15.11.2017 16:47:49 - Skipping schema validation because no schema file has been set in the test suite. Data are only checked for well-formedness.
15.11.2017 16:47:49 - Optimizing last database etf-tdb-ad7856f6-cb86-4943-b06f-291a3f3200eb-0 
15.11.2017 16:47:49 - Import completed
15.11.2017 16:47:49 - Validation ended with 0 error(s)
15.11.2017 16:47:49 - Compiling test script
15.11.2017 16:47:49 - Starting XQuery tests
15.11.2017 16:47:49 - "Testing 1 records"
15.11.2017 16:47:49 - "Executing Test Suite: /home/tomcat/.etf/projects/ets-repository/metadata/iso/ets-md-iso-bsxets.xml"
15.11.2017 16:47:49 - "Statistics table: 0 ms"
15.11.2017 16:47:49 - "Test Suite 'Conformance class: INSPIRE Profile based on EN ISO 19115 and EN ISO 19119' started"
15.11.2017 16:47:49 - "Test Case 'Common tests' started"
15.11.2017 16:47:49 - "Test Assertion 'md-iso.a.1: Title': PASSED - 0 ms"
15.11.2017 16:47:49 - "Test Assertion 'md-iso.a.2: Abstract': PASSED - 0 ms"
15.11.2017 16:47:49 - "Test Assertion 'md-iso.a.3: Access and use conditions': PASSED_MANUAL - 1 ms"
15.11.2017 16:47:49 - "Test Assertion 'md-iso.a.4: Public access': PASSED - 0 ms"
15.11.2017 16:47:49 - "Test Assertion 'md-iso.a.5: Specification': PASSED - 0 ms"
15.11.2017 16:47:49 - "Test Assertion 'md-iso.a.6: Language': PASSED - 0 ms"
15.11.2017 16:47:49 - "Test Assertion 'md-iso.a.7: Metadata contact': PASSED - 0 ms"
15.11.2017 16:47:49 - "Test Assertion 'md-iso.a.8: Metadata contact role': PASSED - 0 ms"
15.11.2017 16:47:49 - "Test Assertion 'md-iso.a.9: Resource creation date': PASSED - 0 ms"
15.11.2017 16:47:49 - "Test Assertion 'md-iso.a.10: Responsible party contact info': PASSED - 0 ms"
15.11.2017 16:47:49 - "Test Assertion 'md-iso.a.11: Responsible party role': PASSED - 0 ms"
15.11.2017 16:47:49 - "Test Case 'Common tests' finished: PASSED_MANUAL"
15.11.2017 16:47:49 - "Test Case 'Hierarchy level' started"
15.11.2017 16:47:49 - "Test Assertion 'md-iso.b.1: Hierarchy': PASSED - 0 ms"
15.11.2017 16:47:49 - "Test Case 'Hierarchy level' finished: PASSED"
15.11.2017 16:47:49 - "Test Case 'Dataset (series) tests' started"
15.11.2017 16:47:49 - "Test Assertion 'md-iso.c.1: Dataset identification': PASSED - 0 ms"
15.11.2017 16:47:49 - "Test Assertion 'md-iso.c.2: Dataset language': PASSED - 1 ms"
15.11.2017 16:47:49 - "Checking URL: 'http://www.geoportal.sk'"
15.11.2017 16:47:49 - "Checking URL: 'https://www.geoportal.sk/'"
15.11.2017 16:47:49 - "Exception: sun.security.validator.ValidatorException: PKIX path building failed: sun.security.provider.certpath.SunCertPathBuilderException: unable to find valid certification path to requested target URL: https://www.geoportal.sk/"
15.11.2017 16:47:49 - "Test Assertion 'md-iso.c.3: Dataset linkage': FAILED - 178 ms"
15.11.2017 16:47:49 - "Test Assertion 'md-iso.c.4: Dataset conformity': PASSED - 0 ms"
15.11.2017 16:47:49 - "Test Assertion 'md-iso.c.5: Dataset topic': PASSED - 0 ms"
15.11.2017 16:47:49 - "Test Assertion 'md-iso.c.6: Dataset geographic Bounding box': PASSED_MANUAL - 0 ms"
15.11.2017 16:47:49 - "Test Assertion 'md-iso.c.7: Dataset lineage': PASSED - 0 ms"
15.11.2017 16:47:49 - "Test Case 'Dataset (series) tests' finished: FAILED"
15.11.2017 16:47:49 - "Test Case 'Service tests' started"
15.11.2017 16:47:49 - "Test Assertion 'md-iso.d.1: Service type': PASSED - 0 ms"
15.11.2017 16:47:49 - "Test Assertion 'md-iso.d.2: Service linkage': PASSED - 0 ms"
15.11.2017 16:47:49 - "Test Assertion 'md-iso.d.3: Coupled resource': PASSED - 0 ms"
15.11.2017 16:47:49 - "Test Case 'Service tests' finished: PASSED"
15.11.2017 16:47:49 - "Test Case 'Keywords' started"
15.11.2017 16:47:49 - "Test Assertion 'md-iso.e.1: Keywords': PASSED - 1 ms"
15.11.2017 16:47:49 - "Test Case 'Keywords' finished: PASSED"
15.11.2017 16:47:49 - "Test Case 'Keywords - details' started"
15.11.2017 16:47:49 - "Checking URL: 'http://inspire.ec.europa.eu/theme/theme.bg.atom'"
15.11.2017 16:47:49 - "Checking URL: 'http://inspire.ec.europa.eu/theme/theme.cs.atom'"
15.11.2017 16:47:50 - "Checking URL: 'http://inspire.ec.europa.eu/theme/theme.da.atom'"
15.11.2017 16:47:50 - "Checking URL: 'http://inspire.ec.europa.eu/theme/theme.de.atom'"
15.11.2017 16:47:50 - "Checking URL: 'http://inspire.ec.europa.eu/theme/theme.et.atom'"
15.11.2017 16:47:50 - "Checking URL: 'http://inspire.ec.europa.eu/theme/theme.el.atom'"
15.11.2017 16:47:50 - "Checking URL: 'http://inspire.ec.europa.eu/theme/theme.en.atom'"
15.11.2017 16:47:50 - "Checking URL: 'http://inspire.ec.europa.eu/theme/theme.es.atom'"
15.11.2017 16:47:50 - "Checking URL: 'http://inspire.ec.europa.eu/theme/theme.fr.atom'"
15.11.2017 16:47:50 - "Checking URL: 'http://inspire.ec.europa.eu/theme/theme.hr.atom'"
15.11.2017 16:47:50 - "Checking URL: 'http://inspire.ec.europa.eu/theme/theme.it.atom'"
15.11.2017 16:47:50 - "Checking URL: 'http://inspire.ec.europa.eu/theme/theme.lv.atom'"
15.11.2017 16:47:50 - "Checking URL: 'http://inspire.ec.europa.eu/theme/theme.lt.atom'"
15.11.2017 16:47:50 - "Checking URL: 'http://inspire.ec.europa.eu/theme/theme.hu.atom'"
15.11.2017 16:47:50 - "Checking URL: 'http://inspire.ec.europa.eu/theme/theme.mt.atom'"
15.11.2017 16:47:50 - "Checking URL: 'http://inspire.ec.europa.eu/theme/theme.nl.atom'"
15.11.2017 16:47:50 - "Checking URL: 'http://inspire.ec.europa.eu/theme/theme.pl.atom'"
15.11.2017 16:47:50 - "Checking URL: 'http://inspire.ec.europa.eu/theme/theme.pt.atom'"
15.11.2017 16:47:50 - "Checking URL: 'http://inspire.ec.europa.eu/theme/theme.ro.atom'"
15.11.2017 16:47:50 - "Checking URL: 'http://inspire.ec.europa.eu/theme/theme.sk.atom'"
15.11.2017 16:47:50 - "Checking URL: 'http://inspire.ec.europa.eu/theme/theme.sl.atom'"
15.11.2017 16:47:50 - "Checking URL: 'http://inspire.ec.europa.eu/theme/theme.fi.atom'"
15.11.2017 16:47:50 - "Checking URL: 'http://inspire.ec.europa.eu/theme/theme.sv.atom'"
15.11.2017 16:47:50 - "Checking URL: 'http://inspire.ec.europa.eu/theme/theme.en.atom'"
15.11.2017 16:47:50 - "Test Assertion 'md-iso.f.1: Dataset keyword': PASSED - 360 ms"
15.11.2017 16:47:50 - "Test Assertion 'md-iso.f.2: Service keyword': PASSED - 0 ms"
15.11.2017 16:47:50 - "Test Assertion 'md-iso.f.3: Keywords in vocabulary grouped': PASSED - 0 ms"
15.11.2017 16:47:50 - "Test Assertion 'md-iso.f.4: Vocabulary information': PASSED - 0 ms"
15.11.2017 16:47:50 - "Test Case 'Keywords - details' finished: PASSED"
15.11.2017 16:47:50 - "Test Case 'Temporal extent' started"
15.11.2017 16:47:50 - "Test Assertion 'md-iso.g.1: Temporal extent': PASSED - 0 ms"
15.11.2017 16:47:50 - "Test Case 'Temporal extent' finished: PASSED"
15.11.2017 16:47:50 - "Test Case 'Temporal extent - details' started"
15.11.2017 16:47:50 - "Test Assertion 'md-iso.h.1: Temporal date': PASSED - 0 ms"
15.11.2017 16:47:50 - "Test Case 'Temporal extent - details' finished: PASSED"
15.11.2017 16:47:50 - "Test Suite 'Conformance class: INSPIRE Profile based on EN ISO 19115 and EN ISO 19119' finished: FAILED"
15.11.2017 16:47:51 - Releasing resources
15.11.2017 16:47:51 - Changed state from INITIALIZED to RUNNING
15.11.2017 16:47:51 - Duration: 6sec
15.11.2017 16:47:51 - TestRun finished
15.11.2017 16:47:51 - Changed state from RUNNING to COMPLETED
