15.11.2017 23:43:13 - Preparing Test Run tn-ro:RoadWidth (initiated Wed Nov 15 23:43:13 CET 2017)
15.11.2017 23:43:13 - Resolving Executable Test Suite dependencies
15.11.2017 23:43:13 - Preparing 11 Test Task:
15.11.2017 23:43:13 -  TestTask 1 (37b6bbff-d237-48b5-84ba-f2c54587c20c)
15.11.2017 23:43:13 -  will perform tests on Test Object 'get.xml' by using Executable Test Suite 'LAZY.545f9e49-009b-4114-9333-7ca26413b5d4'
15.11.2017 23:43:13 -  with parameters: 
15.11.2017 23:43:13 - etf.testcases = *
15.11.2017 23:43:13 -  TestTask 2 (af70841f-c5ed-4bc6-86e9-b2205403415f)
15.11.2017 23:43:13 -  will perform tests on Test Object 'get.xml' by using Executable Test Suite 'LAZY.09820daf-62b2-4fa3-a95f-56a0d2b7c4d8'
15.11.2017 23:43:13 -  with parameters: 
15.11.2017 23:43:13 - etf.testcases = *
15.11.2017 23:43:13 -  TestTask 3 (509dd877-bd1a-4af5-bf86-ef30b764da21)
15.11.2017 23:43:13 -  will perform tests on Test Object 'get.xml' by using Executable Test Suite 'Conformance class: GML application schemas, Transport Networks (EID: 9af1c865-1cf0-43ff-9250-069df01b0948, V: 0.2.1 )'
15.11.2017 23:43:13 -  with parameters: 
15.11.2017 23:43:13 - etf.testcases = *
15.11.2017 23:43:13 -  TestTask 4 (759abe60-620b-4daf-aac3-47e45eb8dddb)
15.11.2017 23:43:13 -  will perform tests on Test Object 'get.xml' by using Executable Test Suite 'LAZY.4441cbde-371f-4899-90b3-145f4fd08ebc'
15.11.2017 23:43:13 -  with parameters: 
15.11.2017 23:43:13 - etf.testcases = *
15.11.2017 23:43:13 -  TestTask 5 (052aa140-c683-4ae2-b814-6dc9639a278f)
15.11.2017 23:43:13 -  will perform tests on Test Object 'get.xml' by using Executable Test Suite 'Conformance class: Application schema, Road Transport Networks (EID: 14986e54-74c4-43b0-979b-d0d3e5cd0e8c, V: 0.2.1 )'
15.11.2017 23:43:13 -  with parameters: 
15.11.2017 23:43:13 - etf.testcases = *
15.11.2017 23:43:13 -  TestTask 6 (1c28322a-4f3d-45e3-8c6e-679982d0f9b5)
15.11.2017 23:43:13 -  will perform tests on Test Object 'get.xml' by using Executable Test Suite 'LAZY.61070ae8-13cb-4303-a340-72c8b877b00a'
15.11.2017 23:43:13 -  with parameters: 
15.11.2017 23:43:13 - etf.testcases = *
15.11.2017 23:43:13 -  TestTask 7 (f7ab382b-57a7-48f5-8969-b35c6f105324)
15.11.2017 23:43:13 -  will perform tests on Test Object 'get.xml' by using Executable Test Suite 'Conformance class: Data consistency, Transport Networks (EID: 733af9a0-312b-4f71-9aa2-977cd2134d23, V: 0.2.2 )'
15.11.2017 23:43:13 -  with parameters: 
15.11.2017 23:43:13 - etf.testcases = *
15.11.2017 23:43:13 -  TestTask 8 (bee71e6d-1b26-426c-a20f-ce3879528adb)
15.11.2017 23:43:13 -  will perform tests on Test Object 'get.xml' by using Executable Test Suite 'LAZY.499937ea-0590-42d2-bd7a-1cafff35ecdb'
15.11.2017 23:43:13 -  with parameters: 
15.11.2017 23:43:13 - etf.testcases = *
15.11.2017 23:43:13 -  TestTask 9 (1cee7cd1-3e86-4320-bd21-80a5e9fec39c)
15.11.2017 23:43:13 -  will perform tests on Test Object 'get.xml' by using Executable Test Suite 'Conformance class: Information accessibility, Transport Networks (EID: df5db9a4-b15f-4193-a6ff-6e9951af46f5, V: 0.2.1 )'
15.11.2017 23:43:13 -  with parameters: 
15.11.2017 23:43:13 - etf.testcases = *
15.11.2017 23:43:13 -  TestTask 10 (675b67d0-54de-419b-abb3-359eea5c5a1a)
15.11.2017 23:43:13 -  will perform tests on Test Object 'get.xml' by using Executable Test Suite 'LAZY.63f586f0-080c-493b-8ca2-9919427440cc'
15.11.2017 23:43:13 -  with parameters: 
15.11.2017 23:43:13 - etf.testcases = *
15.11.2017 23:43:13 -  TestTask 11 (407dcb31-c5e2-490e-9f51-8935278df745)
15.11.2017 23:43:13 -  will perform tests on Test Object 'get.xml' by using Executable Test Suite 'Conformance class: Reference systems, Transport Networks (EID: 9d35024d-9dd7-43a9-afff-d5aea5f51595, V: 0.2.0 )'
15.11.2017 23:43:13 -  with parameters: 
15.11.2017 23:43:13 - etf.testcases = *
15.11.2017 23:43:13 - Test Tasks prepared and ready to be executed. Waiting for the scheduler to start.
15.11.2017 23:43:13 - Setting state to CREATED
15.11.2017 23:43:13 - Changed state from CREATED to INITIALIZING
15.11.2017 23:43:13 - Starting TestRun.7d282ec5-693c-4793-8687-c0b4d626eb15 at 2017-11-15T23:43:14+01:00
15.11.2017 23:43:14 - Changed state from INITIALIZING to INITIALIZED
15.11.2017 23:43:14 - TestRunTask initialized
15.11.2017 23:43:14 - Creating new tests databases to speed up tests.
15.11.2017 23:43:14 - Skipping schema validation because no schema file has been set in the test suite. Data are only checked for well-formedness.
15.11.2017 23:43:14 - Optimizing last database etf-tdb-6dae4a5a-22a4-46d1-80f3-22bc030cb1cb-0 
15.11.2017 23:43:15 - Import completed
15.11.2017 23:43:16 - Validation ended with 0 error(s)
15.11.2017 23:43:16 - Compiling test script
15.11.2017 23:43:16 - Starting XQuery tests
15.11.2017 23:43:16 - "Testing 1 features"
15.11.2017 23:43:16 - "Executing Test Suite: /home/tomcat/.etf/projects/ets-repository/data-encoding/inspire-gml/ets-inspire-gml-bsxets.xml"
15.11.2017 23:43:16 - "Statistics table: 0 ms"
15.11.2017 23:43:16 - "Test Suite 'Conformance class: INSPIRE GML encoding' started"
15.11.2017 23:43:16 - "Test Case 'Basic tests' started"
15.11.2017 23:43:16 - "Test Assertion 'gml.a.1: Errors loading the XML documents': PASSED - 0 ms"
15.11.2017 23:43:16 - "Test Assertion 'gml.a.2: Document root element': PASSED - 0 ms"
15.11.2017 23:43:16 - "Test Assertion 'gml.a.3: Character encoding': NOT_APPLICABLE"
15.11.2017 23:43:16 - "Test Case 'Basic tests' finished: PASSED"
15.11.2017 23:43:16 - "Test Suite 'Conformance class: INSPIRE GML encoding' finished: PASSED"
15.11.2017 23:43:16 - Releasing resources
15.11.2017 23:43:16 - TestRunTask initialized
15.11.2017 23:43:16 - Recreating new tests databases as the Test Object has changed!
15.11.2017 23:43:16 - Skipping schema validation because no schema file has been set in the test suite. Data are only checked for well-formedness.
15.11.2017 23:43:16 - Optimizing last database etf-tdb-6dae4a5a-22a4-46d1-80f3-22bc030cb1cb-0 
15.11.2017 23:43:16 - Import completed
15.11.2017 23:43:16 - Validation ended with 0 error(s)
15.11.2017 23:43:16 - Compiling test script
15.11.2017 23:43:16 - Starting XQuery tests
15.11.2017 23:43:17 - "Testing 1 features"
15.11.2017 23:43:17 - "Indexing features (parsing errors: 0): 0 ms"
15.11.2017 23:43:17 - "Executing Test Suite: /home/tomcat/.etf/projects/ets-repository/data/schemas/ets-schemas-bsxets.xml"
15.11.2017 23:43:17 - "Statistics table: 1 ms"
15.11.2017 23:43:17 - "Test Suite 'Conformance class: INSPIRE GML application schemas, General requirements' started"
15.11.2017 23:43:17 - "Test Case 'Schema' started"
15.11.2017 23:43:17 - "Test Assertion 'gmlas.a.1: Mapping of source data to INSPIRE': PASSED_MANUAL"
15.11.2017 23:43:17 - "Test Assertion 'gmlas.a.2: Modelling of additional spatial object types': PASSED_MANUAL"
15.11.2017 23:43:17 - "Test Case 'Schema' finished: PASSED_MANUAL"
15.11.2017 23:43:17 - "Test Case 'Schema validation' started"
15.11.2017 23:43:17 - "Test Assertion 'gmlas.b.1: xsi:schemaLocation attribute': PASSED - 1 ms"
15.11.2017 23:43:17 - "Validating get.xml"
15.11.2017 23:43:25 - "Duration: 8837 ms. Errors: 0."
15.11.2017 23:43:25 - "Test Assertion 'gmlas.b.2: validate XML documents': PASSED - 8837 ms"
15.11.2017 23:43:25 - "Test Case 'Schema validation' finished: PASSED"
15.11.2017 23:43:25 - "Test Case 'GML model' started"
15.11.2017 23:43:25 - "Test Assertion 'gmlas.c.1: Consistency with the GML model': PASSED - 0 ms"
15.11.2017 23:43:25 - "Test Assertion 'gmlas.c.2: nilReason attributes require xsi:nil=true': PASSED - 0 ms"
15.11.2017 23:43:25 - "Test Assertion 'gmlas.c.3: nilReason values': PASSED - 0 ms"
15.11.2017 23:43:25 - "Test Case 'GML model' finished: PASSED"
15.11.2017 23:43:25 - "Test Case 'Simple features' started"
15.11.2017 23:43:25 - "Test Assertion 'gmlas.d.1: No spatial topology objects': PASSED - 0 ms"
15.11.2017 23:43:25 - "Test Assertion 'gmlas.d.2: No non-linear interpolation': PASSED - 1 ms"
15.11.2017 23:43:25 - "Test Assertion 'gmlas.d.3: Surface geometry elements': PASSED - 0 ms"
15.11.2017 23:43:25 - "Test Assertion 'gmlas.d.4: No non-planar interpolation': PASSED - 0 ms"
15.11.2017 23:43:25 - "Test Assertion 'gmlas.d.5: Geometry elements': PASSED - 0 ms"
15.11.2017 23:43:25 - "Test Assertion 'gmlas.d.6: Point coordinates in gml:pos': PASSED - 0 ms"
15.11.2017 23:43:25 - "Test Assertion 'gmlas.d.7: Curve/Surface coordinates in gml:posList': PASSED - 0 ms"
15.11.2017 23:43:25 - "Test Assertion 'gmlas.d.8: No array property elements': PASSED - 0 ms"
15.11.2017 23:43:25 - "Test Assertion 'gmlas.d.9: 1, 2 or 3 coordinate dimensions': PASSED - 0 ms"
15.11.2017 23:43:25 - "Test Assertion 'gmlas.d.10: Validate geometries (1)': PASSED - 88 ms"
15.11.2017 23:43:25 - "Test Assertion 'gmlas.d.11: Validate geometries (2)': PASSED - 0 ms"
15.11.2017 23:43:25 - "Test Case 'Simple features' finished: PASSED"
15.11.2017 23:43:25 - "Test Case 'Code list values in basic data types' started"
15.11.2017 23:43:25 - "Test Assertion 'gmlas.e.1: GrammaticalNumber attributes': PASSED - 5 ms"
15.11.2017 23:43:25 - "Test Assertion 'gmlas.e.2: GrammaticalGender attributes': PASSED - 4 ms"
15.11.2017 23:43:25 - "Test Assertion 'gmlas.e.3: NameStatus attributes': PASSED - 3 ms"
15.11.2017 23:43:25 - "Test Assertion 'gmlas.e.4: Nativeness attributes': PASSED - 4 ms"
15.11.2017 23:43:25 - "Test Case 'Code list values in basic data types' finished: PASSED"
15.11.2017 23:43:25 - "Test Case 'Constraints' started"
15.11.2017 23:43:25 - "Test Assertion 'gmlas.f.1: At least one of the two attributes pronunciationSoundLink and pronunciationIPA shall not be void': PASSED - 0 ms"
15.11.2017 23:43:25 - "Test Case 'Constraints' finished: PASSED"
15.11.2017 23:43:25 - "Test Suite 'Conformance class: INSPIRE GML application schemas, General requirements' finished: PASSED_MANUAL"
15.11.2017 23:43:26 - Releasing resources
15.11.2017 23:43:26 - TestRunTask initialized
15.11.2017 23:43:26 - Skipping schema validation because no schema file has been set in the test suite. Data are only checked for well-formedness.
15.11.2017 23:43:26 - Validation ended with 0 error(s)
15.11.2017 23:43:26 - Compiling test script
15.11.2017 23:43:26 - Starting XQuery tests
15.11.2017 23:43:26 - "Testing 1 features"
15.11.2017 23:43:26 - "Indexing features (parsing errors: 0): 0 ms"
15.11.2017 23:43:26 - "Executing Test Suite: /home/tomcat/.etf/projects/ets-repository/data-tn/tn-gml/ets-tn-gml-bsxets.xml"
15.11.2017 23:43:26 - "Statistics table: 0 ms"
15.11.2017 23:43:26 - "Test Suite 'Conformance class: GML application schemas, Transport Networks' started"
15.11.2017 23:43:26 - "Test Case 'Basic test' started"
15.11.2017 23:43:26 - "Test Assertion 'tn-gml.a.1: Transport Network feature in dataset': PASSED - 1 ms"
15.11.2017 23:43:26 - "Test Case 'Basic test' finished: PASSED"
15.11.2017 23:43:26 - "Test Suite 'Conformance class: GML application schemas, Transport Networks' finished: PASSED"
15.11.2017 23:43:26 - Releasing resources
15.11.2017 23:43:26 - TestRunTask initialized
15.11.2017 23:43:26 - Skipping schema validation because no schema file has been set in the test suite. Data are only checked for well-formedness.
15.11.2017 23:43:26 - Validation ended with 0 error(s)
15.11.2017 23:43:26 - Compiling test script
15.11.2017 23:43:26 - Starting XQuery tests
15.11.2017 23:43:26 - "Testing 1 features"
15.11.2017 23:43:26 - "Indexing features (parsing errors: 0): 0 ms"
15.11.2017 23:43:26 - "Executing Test Suite: /home/tomcat/.etf/projects/ets-repository/data-tn/tn-as/ets-tn-as-bsxets.xml"
15.11.2017 23:43:26 - "Statistics table: 1 ms"
15.11.2017 23:43:26 - "Test Suite 'Conformance class: Application schema, Transport Networks Common' started"
15.11.2017 23:43:26 - "Test Case 'Code list values' started"
15.11.2017 23:43:26 - "Test Assertion 'tn-as.a.1: AccessRestrictionValue attributes': PASSED - 5 ms"
15.11.2017 23:43:26 - "Test Assertion 'tn-as.a.2: RestrictionTypeValue attributes': PASSED - 4 ms"
15.11.2017 23:43:26 - "Test Case 'Code list values' finished: PASSED"
15.11.2017 23:43:26 - "Test Case 'Constraints' started"
15.11.2017 23:43:26 - "Test Assertion 'tn-as.b.1: TrafficFlowDirection can only be associated with a spatial object of the type Link or LinkSequence.': PASSED - 0 ms"
15.11.2017 23:43:26 - "Test Assertion 'tn-as.b.2: All transport areas have an external object identifier.': PASSED - 0 ms"
15.11.2017 23:43:26 - "Test Assertion 'tn-as.b.3: All transport links have an external object identifier.': PASSED - 0 ms"
15.11.2017 23:43:26 - "Test Assertion 'tn-as.b.4: All transport link sequences have an external object identifier.': PASSED - 0 ms"
15.11.2017 23:43:26 - "Test Assertion 'tn-as.b.5: All transport link sets have an external object identifier.': PASSED - 0 ms"
15.11.2017 23:43:26 - "Test Assertion 'tn-as.b.6: All transport nodes have an external object identifier.': PASSED - 0 ms"
15.11.2017 23:43:26 - "Test Assertion 'tn-as.b.7: All transport points have an external object identifier.': PASSED - 0 ms"
15.11.2017 23:43:26 - "Test Assertion 'tn-as.b.8: All transport properties have an external object identifier.': PASSED - 0 ms"
15.11.2017 23:43:26 - "Test Assertion 'tn-as.b.9: A transport link sequence must be composed of transport links that all belong to the same transport network.': PASSED - 0 ms"
15.11.2017 23:43:26 - "Test Assertion 'tn-as.b.10: A transport link set must be composed of transport links and or transport link sequences that all belong to the same transport network.': PASSED - 0 ms"
15.11.2017 23:43:26 - "Test Case 'Constraints' finished: PASSED"
15.11.2017 23:43:26 - "Test Case 'Geometry' started"
15.11.2017 23:43:26 - "Test Assertion 'tn-as.c.1: No free transport nodes': PASSED - 0 ms"
15.11.2017 23:43:26 - "Test Assertion 'tn-as.c.2: Intersections only at crossings': PASSED_MANUAL"
15.11.2017 23:43:26 - "Test Case 'Geometry' finished: PASSED_MANUAL"
15.11.2017 23:43:26 - "Test Case 'Network connectivity' started"
15.11.2017 23:43:26 - "Test Assertion 'tn-as.d.1: Connectivity at crossings': PASSED_MANUAL"
15.11.2017 23:43:26 - "Test Assertion 'tn-as.d.2: Unconnected nodes': PASSED_MANUAL"
15.11.2017 23:43:26 - "Test Assertion 'tn-as.d.3: Connectivity tolerance': PASSED_MANUAL"
15.11.2017 23:43:26 - "Test Case 'Network connectivity' finished: PASSED_MANUAL"
15.11.2017 23:43:26 - "Test Case 'Object References' started"
15.11.2017 23:43:26 - "Test Assertion 'tn-as.e.1: Linear references': PASSED_MANUAL"
15.11.2017 23:43:26 - "Test Assertion 'tn-as.e.2: Inter-modal connections': PASSED - 0 ms"
15.11.2017 23:43:26 - "Test Case 'Object References' finished: PASSED_MANUAL"
15.11.2017 23:43:26 - "Test Suite 'Conformance class: Application schema, Transport Networks Common' finished: PASSED_MANUAL"
15.11.2017 23:43:27 - Releasing resources
15.11.2017 23:43:27 - TestRunTask initialized
15.11.2017 23:43:27 - Skipping schema validation because no schema file has been set in the test suite. Data are only checked for well-formedness.
15.11.2017 23:43:27 - Validation ended with 0 error(s)
15.11.2017 23:43:27 - Compiling test script
15.11.2017 23:43:27 - Starting XQuery tests
15.11.2017 23:43:27 - "Testing 1 features"
15.11.2017 23:43:27 - "Executing Test Suite: /home/tomcat/.etf/projects/ets-repository/data-tn/tn-ro-as/ets-tn-ro-as-bsxets.xml"
15.11.2017 23:43:27 - "Statistics table: 1 ms"
15.11.2017 23:43:27 - "Test Suite 'Conformance class: Application schema, Road Transport Networks' started"
15.11.2017 23:43:27 - "Test Case 'Code list values' started"
15.11.2017 23:43:27 - "Test Assertion 'tn-ro-as.a.1: AreaConditionValue attributes': PASSED - 5 ms"
15.11.2017 23:43:27 - "Test Assertion 'tn-ro-as.a.2: FormOfRoadNodeValue attributes': PASSED - 4 ms"
15.11.2017 23:43:27 - "Test Assertion 'tn-ro-as.a.3: FormOfWayValue attributes': PASSED - 5 ms"
15.11.2017 23:43:27 - "Test Assertion 'tn-ro-as.a.4: RoadPartValue attributes': PASSED - 3 ms"
15.11.2017 23:43:27 - "Test Assertion 'tn-ro-as.a.5: RoadServiceTypeValue attributes': PASSED - 4 ms"
15.11.2017 23:43:27 - "Test Assertion 'tn-ro-as.a.6: RoadSurfaceCategoryValue attributes': PASSED - 4 ms"
15.11.2017 23:43:27 - "Test Assertion 'tn-ro-as.a.7: ServiceFacilityValue attributes': PASSED - 5 ms"
15.11.2017 23:43:27 - "Test Assertion 'tn-ro-as.a.8: SpeedLimitSourceValue attributes': PASSED - 3 ms"
15.11.2017 23:43:27 - "Test Assertion 'tn-ro-as.a.9: VehicleTypeValue attributes': PASSED - 8 ms"
15.11.2017 23:43:27 - "Test Assertion 'tn-ro-as.a.10: WeatherConditionValue attributes': PASSED - 4 ms"
15.11.2017 23:43:27 - "Test Case 'Code list values' finished: PASSED"
15.11.2017 23:43:27 - "Test Case 'Constraints' started"
15.11.2017 23:43:27 - "Test Assertion 'tn-ro-as.b.1: FormOfWay can only be associated with a spatial object that is part of a road transport network.': PASSED - 0 ms"
15.11.2017 23:43:27 - "Test Assertion 'tn-ro-as.b.2: FunctionalRoadClass can only be associated with a spatial object that is part of a road transport network.': PASSED - 0 ms"
15.11.2017 23:43:27 - "Test Assertion 'tn-ro-as.b.3: NumberOfLanes can only be associated with a spatial object that is part of a road transport network.': PASSED - 0 ms"
15.11.2017 23:43:27 - "Test Assertion 'tn-ro-as.b.4: RoadName can only be associated with a spatial object that is part of a road transport network.': PASSED - 0 ms"
15.11.2017 23:43:27 - "Test Assertion 'tn-ro-as.b.5: RoadSurfaceCategory can only be associated with a spatial object that is part of a road transport network.': PASSED - 0 ms"
15.11.2017 23:43:27 - "Checking URL: 'https://test-zbgisws.skgeodesy.sk/inspire_transport_networks_wfs/service.svc/get?SERVICE=WFS&amp;VERSION=2.0.0&amp;REQUEST=GetFeature&amp;STOREDQUERY_ID=urn:ogc:def:query:OGC-WFS::GetFeatureById&amp;id=netElementL.1400000'"
15.11.2017 23:43:57 - "Exception: Timeout exceeded. URL: https://test-zbgisws.skgeodesy.sk/inspire_transport_networks_wfs/service.svc/get?SERVICE=WFS&amp;VERSION=2.0.0&amp;REQUEST=GetFeature&amp;STOREDQUERY_ID=urn:ogc:def:query:OGC-WFS::GetFeatureById&amp;id=netElementL.1400000"
15.11.2017 23:43:57 - "Test Assertion 'tn-ro-as.b.6: RoadWidth can only be associated with a spatial object that is part of a road transport network.': FAILED - 30006 ms"
15.11.2017 23:43:57 - "Test Assertion 'tn-ro-as.b.7: SpeedLimit can only be associated with a spatial object that is part of a road transport network.': PASSED - 0 ms"
15.11.2017 23:43:57 - "Test Assertion 'tn-ro-as.b.8: RoadServiceType can only be associated with a spatial object of the type RoadServiceArea or RoadNode (when formOfRoadNode=roadServiceArea)': PASSED - 0 ms"
15.11.2017 23:43:57 - "Test Case 'Constraints' finished: FAILED"
15.11.2017 23:43:57 - "Test Case 'Link centrelines' started"
15.11.2017 23:43:57 - "Test Assertion 'tn-ro-as.c.1: Link centrelines test': PASSED_MANUAL"
15.11.2017 23:43:57 - "Test Case 'Link centrelines' finished: PASSED_MANUAL"
15.11.2017 23:43:57 - "Test Suite 'Conformance class: Application schema, Road Transport Networks' finished: FAILED"
15.11.2017 23:43:57 - Releasing resources
15.11.2017 23:43:57 - TestRunTask initialized
15.11.2017 23:43:57 - Skipping schema validation because no schema file has been set in the test suite. Data are only checked for well-formedness.
15.11.2017 23:43:57 - Validation ended with 0 error(s)
15.11.2017 23:43:57 - Compiling test script
15.11.2017 23:43:57 - Starting XQuery tests
15.11.2017 23:43:58 - "Testing 1 features"
15.11.2017 23:43:58 - "Indexing features (parsing errors: 0): 0 ms"
15.11.2017 23:43:58 - "Executing Test Suite: /home/tomcat/.etf/projects/ets-repository/data/data-consistency/ets-data-consistency-bsxets.xml"
15.11.2017 23:43:58 - "Statistics table: 0 ms"
15.11.2017 23:43:58 - "Test Suite 'Conformance class: Data consistency, General requirements' started"
15.11.2017 23:43:58 - "Test Case 'Version consistency' started"
15.11.2017 23:43:58 - "Test Assertion 'dc.a.1: Version lifespan plausible': PASSED - 0 ms"
15.11.2017 23:43:58 - "Test Assertion 'dc.a.2: Unique identifier persistency': PASSED_MANUAL"
15.11.2017 23:43:58 - "Test Assertion 'dc.a.3: Spatial object type stable': PASSED_MANUAL"
15.11.2017 23:43:58 - "Test Case 'Version consistency' finished: PASSED_MANUAL"
15.11.2017 23:43:58 - "Test Case 'Temporal consistency' started"
15.11.2017 23:43:58 - "Test Assertion 'dc.b.1: Valid time plausible': PASSED - 0 ms"
15.11.2017 23:43:58 - "Test Case 'Temporal consistency' finished: PASSED"
15.11.2017 23:43:58 - "Test Suite 'Conformance class: Data consistency, General requirements' finished: PASSED_MANUAL"
15.11.2017 23:43:58 - Releasing resources
15.11.2017 23:43:58 - TestRunTask initialized
15.11.2017 23:43:58 - Skipping schema validation because no schema file has been set in the test suite. Data are only checked for well-formedness.
15.11.2017 23:43:58 - Validation ended with 0 error(s)
15.11.2017 23:43:58 - Compiling test script
15.11.2017 23:43:58 - Starting XQuery tests
15.11.2017 23:43:58 - "Testing 1 features"
15.11.2017 23:43:58 - "Indexing features (parsing errors: 0): 0 ms"
15.11.2017 23:43:58 - "Executing Test Suite: /home/tomcat/.etf/projects/ets-repository/data-tn/tn-dc/ets-tn-dc-bsxets.xml"
15.11.2017 23:43:58 - "Statistics table: 0 ms"
15.11.2017 23:43:58 - "Test Suite 'Conformance class: Data consistency, Transport Networks' started"
15.11.2017 23:43:58 - "Test Case 'Spatial consistency' started"
15.11.2017 23:43:58 - "Test Assertion 'tn-dc.a.1: Each Transport Network Link or Node geometry is within a Network Area geometry (Road Transport Networks)': PASSED - 0 ms"
15.11.2017 23:43:58 - "Test Assertion 'tn-dc.a.2: Each Transport Network Link or Node geometry is within a Network Area geometry (Railway Transport Networks)': PASSED - 0 ms"
15.11.2017 23:43:58 - "Test Assertion 'tn-dc.a.3: Each Transport Network Link or Node geometry is within a Network Area geometry (Waterway Transport Networks)': PASSED - 0 ms"
15.11.2017 23:43:58 - "Test Assertion 'tn-dc.a.4: Each Transport Network Link or Node geometry is within a Network Area geometry (Air Transport Networks)': PASSED - 0 ms"
15.11.2017 23:43:58 - "Test Assertion 'tn-dc.a.5: Manual review': PASSED_MANUAL"
15.11.2017 23:43:58 - "Test Case 'Spatial consistency' finished: PASSED_MANUAL"
15.11.2017 23:43:58 - "Test Suite 'Conformance class: Data consistency, Transport Networks' finished: PASSED_MANUAL"
15.11.2017 23:43:58 - Releasing resources
15.11.2017 23:43:58 - TestRunTask initialized
15.11.2017 23:43:58 - Skipping schema validation because no schema file has been set in the test suite. Data are only checked for well-formedness.
15.11.2017 23:43:58 - Validation ended with 0 error(s)
15.11.2017 23:43:58 - Compiling test script
15.11.2017 23:43:58 - Starting XQuery tests
15.11.2017 23:43:58 - "Testing 1 features"
15.11.2017 23:43:58 - "Indexing features (parsing errors: 0): 0 ms"
15.11.2017 23:43:58 - "Executing Test Suite: /home/tomcat/.etf/projects/ets-repository/data/information-accessibility/ets-information-accessibility-bsxets.xml"
15.11.2017 23:43:58 - "Statistics table: 0 ms"
15.11.2017 23:43:58 - "Test Suite 'Conformance class: Information accessibility, General requirements' started"
15.11.2017 23:43:58 - "Test Case 'Coordinate reference systems (CRS)' started"
15.11.2017 23:43:58 - "Test Assertion 'ia.a.1: CRS publicly accessible via HTTP': PASSED - 0 ms"
15.11.2017 23:43:58 - "Test Case 'Coordinate reference systems (CRS)' finished: PASSED"
15.11.2017 23:43:58 - "Test Suite 'Conformance class: Information accessibility, General requirements' finished: PASSED"
15.11.2017 23:43:59 - Releasing resources
15.11.2017 23:43:59 - TestRunTask initialized
15.11.2017 23:43:59 - Skipping schema validation because no schema file has been set in the test suite. Data are only checked for well-formedness.
15.11.2017 23:43:59 - Validation ended with 0 error(s)
15.11.2017 23:43:59 - Compiling test script
15.11.2017 23:43:59 - Starting XQuery tests
15.11.2017 23:43:59 - "Testing 1 features"
15.11.2017 23:43:59 - "Executing Test Suite: /home/tomcat/.etf/projects/ets-repository/data-tn/tn-ia/ets-tn-ia-bsxets.xml"
15.11.2017 23:43:59 - "Statistics table: 1 ms"
15.11.2017 23:43:59 - "Test Suite 'Conformance class: Information accessibility, Transport Networks' started"
15.11.2017 23:43:59 - "Test Case 'Code lists' started"
15.11.2017 23:43:59 - "Test Assertion 'tn-ia.a.1: Code list extensions accessible': PASSED - 0 ms"
15.11.2017 23:43:59 - "Test Case 'Code lists' finished: PASSED"
15.11.2017 23:43:59 - "Test Case 'Feature references' started"
15.11.2017 23:43:59 - "Test Assertion 'tn-ia.b.1: MarkerPost.route': PASSED - 0 ms"
15.11.2017 23:43:59 - "Test Assertion 'tn-ia.b.2: TransportLinkSet.post': PASSED - 1 ms"
15.11.2017 23:43:59 - "Test Case 'Feature references' finished: PASSED"
15.11.2017 23:43:59 - "Test Suite 'Conformance class: Information accessibility, Transport Networks' finished: PASSED"
15.11.2017 23:43:59 - Releasing resources
15.11.2017 23:43:59 - TestRunTask initialized
15.11.2017 23:43:59 - Skipping schema validation because no schema file has been set in the test suite. Data are only checked for well-formedness.
15.11.2017 23:43:59 - Validation ended with 0 error(s)
15.11.2017 23:43:59 - Compiling test script
15.11.2017 23:43:59 - Starting XQuery tests
15.11.2017 23:43:59 - "Testing 1 features"
15.11.2017 23:43:59 - "Indexing features (parsing errors: 0): 0 ms"
15.11.2017 23:43:59 - "Executing Test Suite: /home/tomcat/.etf/projects/ets-repository/data/reference-systems/ets-reference-systems-bsxets.xml"
15.11.2017 23:43:59 - "Statistics table: 1 ms"
15.11.2017 23:43:59 - "Test Suite 'Conformance class: Reference systems, General requirements' started"
15.11.2017 23:43:59 - "Test Case 'Spatial reference systems' started"
15.11.2017 23:43:59 - "Test Assertion 'rs.a.1: Spatial reference systems in feature geometries': PASSED - 0 ms"
15.11.2017 23:43:59 - "Test Assertion 'rs.a.2: Default spatial reference systems in feature collections': PASSED - 0 ms"
15.11.2017 23:43:59 - "Test Case 'Spatial reference systems' finished: PASSED"
15.11.2017 23:43:59 - "Test Case 'Temporal reference systems' started"
15.11.2017 23:43:59 - "Test Assertion 'rs.a.3: Temporal reference systems in features': PASSED - 0 ms"
15.11.2017 23:43:59 - "Test Case 'Temporal reference systems' finished: PASSED"
15.11.2017 23:43:59 - "Test Suite 'Conformance class: Reference systems, General requirements' finished: PASSED"
15.11.2017 23:43:59 - Releasing resources
15.11.2017 23:43:59 - TestRunTask initialized
15.11.2017 23:43:59 - Skipping schema validation because no schema file has been set in the test suite. Data are only checked for well-formedness.
15.11.2017 23:43:59 - Validation ended with 0 error(s)
15.11.2017 23:43:59 - Compiling test script
15.11.2017 23:43:59 - Starting XQuery tests
15.11.2017 23:43:59 - "Testing 1 features"
15.11.2017 23:43:59 - "Executing Test Suite: /home/tomcat/.etf/projects/ets-repository/data-tn/tn-rs/ets-tn-rs-bsxets.xml"
15.11.2017 23:43:59 - "Statistics table: 0 ms"
15.11.2017 23:43:59 - "Test Suite 'Conformance class: Reference systems, Transport Networks' started"
15.11.2017 23:43:59 - "Test Case 'Additional theme-specific rules for reference systems' started"
15.11.2017 23:43:59 - "Test Assertion 'tn-rs.a.1: Test always passes': PASSED - 0 ms"
15.11.2017 23:43:59 - "Test Case 'Additional theme-specific rules for reference systems' finished: PASSED"
15.11.2017 23:43:59 - "Test Suite 'Conformance class: Reference systems, Transport Networks' finished: PASSED"
15.11.2017 23:44:00 - Releasing resources
15.11.2017 23:44:00 - Changed state from INITIALIZED to RUNNING
15.11.2017 23:44:00 - Duration: 46sec
15.11.2017 23:44:00 - TestRun finished
15.11.2017 23:44:00 - Changed state from RUNNING to COMPLETED
