22.11.2017 22:08:11 - Preparing Test Run downloadService (initiated Wed Nov 22 22:08:11 CET 2017)
22.11.2017 22:08:11 - Resolving Executable Test Suite dependencies
22.11.2017 22:08:11 - Preparing 2 Test Task:
22.11.2017 22:08:11 -  TestTask 1 (bd594fbf-0952-4f73-9ed1-be3ad434d03a)
22.11.2017 22:08:11 -  will perform tests on Test Object 'SK_SOP_INSPIRE_Download_Service' by using Executable Test Suite 'WFS 2.0 (OGC 09-025r2/ISO 19142) Conformance Test Suite (EID: 95a1b6fc-2b55-3d43-9502-3b8b605bda10, V: 1.26.0 )'
22.11.2017 22:08:11 -  with parameters: 
22.11.2017 22:08:11 - etf.testcases = *
22.11.2017 22:08:11 -  TestTask 2 (b2ddfcee-bc25-47ff-92aa-fc08c2280121)
22.11.2017 22:08:11 -  will perform tests on Test Object 'SK_SOP_INSPIRE_Download_Service' by using Executable Test Suite 'Conformance Class: Download Service - Direct WFS (EID: ed2d3501-d700-4ff9-b9bf-070dece8ddbd, V: 1.0.0 )'
22.11.2017 22:08:11 -  with parameters: 
22.11.2017 22:08:11 - etf.testcases = *
22.11.2017 22:08:11 - Test Tasks prepared and ready to be executed. Waiting for the scheduler to start.
22.11.2017 22:08:11 - Setting state to CREATED
22.11.2017 22:08:11 - Changed state from CREATED to INITIALIZING
22.11.2017 22:08:11 - Starting TestRun.5733308b-118f-4934-b8b3-f6e4d3c85fa7 at 2017-11-22T22:08:13+01:00
22.11.2017 22:08:13 - Changed state from INITIALIZING to INITIALIZED
22.11.2017 22:08:13 - TestRunTask initialized
22.11.2017 22:08:17 - Releasing resources
22.11.2017 22:08:17 - Project Properties: 
22.11.2017 22:08:17 - etf.testcases - * 
22.11.2017 22:08:17 - download.1 - file:/home/tomcat/.etf/testdata/ows.xml-c75b3782-c98a-455c-b4d2-a0a4e112e36f/ 
22.11.2017 22:08:17 - data - http://inspire.biomonitoring.sk/geoserver/ows?service=WFS&request=GetCapabilities 
22.11.2017 22:08:17 - username -  
22.11.2017 22:08:17 - authUser -  
22.11.2017 22:08:17 - authMethod - basic 
22.11.2017 22:08:17 - TestRunTask initialized
22.11.2017 22:08:17 ERROR Exception occurred in Test Step: java.lang.NullPointerException
22.11.2017 22:08:17 ERROR Exception occurred in Test Step: java.lang.NullPointerException
22.11.2017 22:08:17 ERROR Exception occurred in Test Step: java.lang.NullPointerException
22.11.2017 22:08:17 ERROR Exception occurred in Test Step: java.lang.NullPointerException
22.11.2017 22:08:17 ERROR Exception occurred in Test Step: java.lang.NullPointerException
22.11.2017 22:08:17 - Releasing resources
22.11.2017 22:08:17 - Changed state from INITIALIZED to RUNNING
22.11.2017 22:08:18 - Duration: 6sec
22.11.2017 22:08:18 - TestRun finished
22.11.2017 22:08:18 - Changed state from RUNNING to COMPLETED
