05.02.2018 21:48:07 - Preparing Test Run metadata_00626031_Slovensk&aacute;agent&uacute;raživotn&eacute;hoprostredia_Informačn&yacute; syst&eacute;m prevencie z&aacute;važn&yacute;ch priemyseln&yacute;ch hav&aacute;ri&iacute; (Register podniky) - hranice are&aacute;lov podnikov - WMS (initiated Mon Feb 05 21:48:07 CET 2018)
05.02.2018 21:48:07 - Resolving Executable Test Suite dependencies
05.02.2018 21:48:07 - Preparing 2 Test Task:
05.02.2018 21:48:07 -  TestTask 1 (e9910305-3ad4-4c68-99f5-0c01cfbf0ce2)
05.02.2018 21:48:07 -  will perform tests on Test Object 'GetRecordByIdResponse.xml' by using Executable Test Suite 'LAZY.e3500038-e37c-4dcf-806c-6bc82d585b3b'
05.02.2018 21:48:07 -  with parameters: 
05.02.2018 21:48:07 - etf.testcases = *
05.02.2018 21:48:07 -  TestTask 2 (8efeb1ff-52e0-41f4-bccd-acf826ef46e9)
05.02.2018 21:48:07 -  will perform tests on Test Object 'GetRecordByIdResponse.xml' by using Executable Test Suite 'Conformance class: INSPIRE Profile based on EN ISO 19115 and EN ISO 19119 (EID: ec7323d5-d8f0-4cfe-b23a-b826df86d58c, V: 0.2.5 )'
05.02.2018 21:48:07 -  with parameters: 
05.02.2018 21:48:07 - etf.testcases = *
05.02.2018 21:48:07 - Test Tasks prepared and ready to be executed. Waiting for the scheduler to start.
05.02.2018 21:48:07 - Setting state to CREATED
05.02.2018 21:48:07 - Changed state from CREATED to INITIALIZING
05.02.2018 21:48:07 - Starting TestRun.92f61587-d945-42d5-ab6d-31d9f94f64af at 2018-02-05T21:48:09+01:00
05.02.2018 21:48:09 - Changed state from INITIALIZING to INITIALIZED
05.02.2018 21:48:09 - TestRunTask initialized
05.02.2018 21:48:09 - Creating new tests databases to speed up tests.
05.02.2018 21:48:09 - Skipping schema validation because no schema file has been set in the test suite. Data are only checked for well-formedness.
05.02.2018 21:48:09 - Optimizing last database etf-tdb-66138101-3f73-4091-8137-38a730272e40-0 
05.02.2018 21:48:09 - Import completed
05.02.2018 21:48:09 - Validation ended with 0 error(s)
05.02.2018 21:48:09 - Compiling test script
05.02.2018 21:48:09 - Starting XQuery tests
05.02.2018 21:48:09 - "Testing 1 records"
05.02.2018 21:48:09 - "Executing Test Suite: /home/tomcat/.etf/projects/ets-repository/metadata/xml/ets-md-xml-bsxets.xml"
05.02.2018 21:48:09 - "Statistics table: 1 ms"
05.02.2018 21:48:09 - "Test Suite 'Conformance class: XML encoding of ISO 19115/19119 metadata' started"
05.02.2018 21:48:09 - "Test Case 'Schema validation' started"
05.02.2018 21:48:10 - "Validating file GetRecordByIdResponse.xml: 1204 ms"
05.02.2018 21:48:10 - "Test Assertion 'md-xml.a.1: Validate XML documents': PASSED - 1205 ms"
05.02.2018 21:48:10 - "Test Case 'Schema validation' finished: PASSED"
05.02.2018 21:48:10 - "Test Suite 'Conformance class: XML encoding of ISO 19115/19119 metadata' finished: PASSED"
05.02.2018 21:48:11 - Releasing resources
05.02.2018 21:48:11 - TestRunTask initialized
05.02.2018 21:48:11 - Recreating new tests databases as the Test Object has changed!
05.02.2018 21:48:11 - Skipping schema validation because no schema file has been set in the test suite. Data are only checked for well-formedness.
05.02.2018 21:48:11 - Optimizing last database etf-tdb-66138101-3f73-4091-8137-38a730272e40-0 
05.02.2018 21:48:11 - Import completed
05.02.2018 21:48:11 - Validation ended with 0 error(s)
05.02.2018 21:48:11 - Compiling test script
05.02.2018 21:48:11 - Starting XQuery tests
05.02.2018 21:48:11 - "Testing 1 records"
05.02.2018 21:48:11 - "Executing Test Suite: /home/tomcat/.etf/projects/ets-repository/metadata/iso/ets-md-iso-bsxets.xml"
05.02.2018 21:48:11 - "Statistics table: 1 ms"
05.02.2018 21:48:11 - "Test Suite 'Conformance class: INSPIRE Profile based on EN ISO 19115 and EN ISO 19119' started"
05.02.2018 21:48:11 - "Test Case 'Common tests' started"
05.02.2018 21:48:11 - "Test Assertion 'md-iso.a.1: Title': PASSED - 0 ms"
05.02.2018 21:48:11 - "Test Assertion 'md-iso.a.2: Abstract': PASSED - 0 ms"
05.02.2018 21:48:11 - "Test Assertion 'md-iso.a.3: Access and use conditions': PASSED_MANUAL - 0 ms"
05.02.2018 21:48:11 - "Test Assertion 'md-iso.a.4: Public access': PASSED - 0 ms"
05.02.2018 21:48:11 - "Test Assertion 'md-iso.a.5: Specification': PASSED - 0 ms"
05.02.2018 21:48:11 - "Test Assertion 'md-iso.a.6: Language': PASSED - 0 ms"
05.02.2018 21:48:11 - "Test Assertion 'md-iso.a.7: Metadata contact': PASSED - 1 ms"
05.02.2018 21:48:11 - "Test Assertion 'md-iso.a.8: Metadata contact role': PASSED - 0 ms"
05.02.2018 21:48:11 - "Test Assertion 'md-iso.a.9: Resource creation date': PASSED - 0 ms"
05.02.2018 21:48:11 - "Test Assertion 'md-iso.a.10: Responsible party contact info': PASSED - 1 ms"
05.02.2018 21:48:11 - "Test Assertion 'md-iso.a.11: Responsible party role': PASSED - 0 ms"
05.02.2018 21:48:11 - "Test Case 'Common tests' finished: PASSED_MANUAL"
05.02.2018 21:48:11 - "Test Case 'Hierarchy level' started"
05.02.2018 21:48:11 - "Test Assertion 'md-iso.b.1: Hierarchy': PASSED - 0 ms"
05.02.2018 21:48:11 - "Test Case 'Hierarchy level' finished: PASSED"
05.02.2018 21:48:11 - "Test Case 'Dataset (series) tests' started"
05.02.2018 21:48:11 - "Test Assertion 'md-iso.c.1: Dataset identification': PASSED - 1 ms"
05.02.2018 21:48:11 - "Test Assertion 'md-iso.c.2: Dataset language': PASSED - 0 ms"
05.02.2018 21:48:11 - "Test Assertion 'md-iso.c.3: Dataset linkage': PASSED - 0 ms"
05.02.2018 21:48:11 - "Test Assertion 'md-iso.c.4: Dataset conformity': PASSED - 0 ms"
05.02.2018 21:48:11 - "Test Assertion 'md-iso.c.5: Dataset topic': PASSED - 0 ms"
05.02.2018 21:48:11 - "Test Assertion 'md-iso.c.6: Dataset geographic Bounding box': PASSED - 0 ms"
05.02.2018 21:48:11 - "Test Assertion 'md-iso.c.7: Dataset lineage': PASSED - 0 ms"
05.02.2018 21:48:11 - "Test Case 'Dataset (series) tests' finished: PASSED"
05.02.2018 21:48:11 - "Test Case 'Service tests' started"
05.02.2018 21:48:11 - "Test Assertion 'md-iso.d.1: Service type': PASSED - 0 ms"
05.02.2018 21:48:11 - "Checking URL: 'http://nipi.sazp.sk/arcgis/services/seveso/podnik_pzph/MapServer/WMSserver'"
05.02.2018 21:48:11 - "Checking URL: 'http://charon.sazp.sk/SevesoPublic/PriestoroveUdaje.aspx'"
05.02.2018 21:48:12 - "Test Assertion 'md-iso.d.2: Service linkage': PASSED_MANUAL - 781 ms"
05.02.2018 21:48:12 - "Checking URL: 'http://nipi.sazp.sk/arcgis/services/seveso/podnik_pzph/MapServer/WMSServer?'"
05.02.2018 21:48:12 - "Test Assertion 'md-iso.d.3: Coupled resource': FAILED - 107 ms"
05.02.2018 21:48:12 - "Test Case 'Service tests' finished: FAILED"
05.02.2018 21:48:12 - "Test Case 'Keywords' started"
05.02.2018 21:48:12 - "Test Assertion 'md-iso.e.1: Keywords': PASSED - 0 ms"
05.02.2018 21:48:12 - "Test Case 'Keywords' finished: PASSED"
05.02.2018 21:48:12 - "Test Case 'Keywords - details' started"
05.02.2018 21:48:12 - "Test Assertion 'md-iso.f.1: Dataset keyword': PASSED - 0 ms"
05.02.2018 21:48:12 - "Checking URL: 'http://inspire.ec.europa.eu/metadata-codelist/SpatialDataServiceCategory/SpatialDataServiceCategory.en.atom'"
05.02.2018 21:48:12 - "Test Assertion 'md-iso.f.2: Service keyword': PASSED - 29 ms"
05.02.2018 21:48:12 - "Test Assertion 'md-iso.f.3: Keywords in vocabulary grouped': FAILED - 1 ms"
05.02.2018 21:48:12 - "Test Assertion 'md-iso.f.4: Vocabulary information': PASSED - 0 ms"
05.02.2018 21:48:12 - "Test Case 'Keywords - details' finished: FAILED"
05.02.2018 21:48:12 - "Test Case 'Temporal extent' started"
05.02.2018 21:48:12 - "Test Assertion 'md-iso.g.1: Temporal extent': PASSED - 0 ms"
05.02.2018 21:48:12 - "Test Case 'Temporal extent' finished: PASSED"
05.02.2018 21:48:12 - "Test Case 'Temporal extent - details' started"
05.02.2018 21:48:12 - "Test Assertion 'md-iso.h.1: Temporal date': PASSED - 0 ms"
05.02.2018 21:48:12 - "Test Case 'Temporal extent - details' finished: PASSED"
05.02.2018 21:48:12 - "Test Suite 'Conformance class: INSPIRE Profile based on EN ISO 19115 and EN ISO 19119' finished: FAILED"
05.02.2018 21:48:12 - Releasing resources
05.02.2018 21:48:12 - Changed state from INITIALIZED to RUNNING
05.02.2018 21:48:12 - Duration: 5sec
05.02.2018 21:48:12 - TestRun finished
05.02.2018 21:48:12 - Changed state from RUNNING to COMPLETED
