06.02.2018 23:05:58 - Preparing Test Run interoperability_17316219_Geodetick&yacute;akartografick&yacute;&uacute;stavBratislava_tn-ra:NominalTrackGauge (initiated Tue Feb 06 23:05:58 CET 2018)
06.02.2018 23:05:58 - Resolving Executable Test Suite dependencies
06.02.2018 23:05:58 - Preparing 11 Test Task:
06.02.2018 23:05:58 -  TestTask 1 (1c7861a5-d079-4e15-a749-1a4150e28174)
06.02.2018 23:05:58 -  will perform tests on Test Object 'get.xml' by using Executable Test Suite 'Conformance class: INSPIRE GML application schemas, General requirements (EID: 09820daf-62b2-4fa3-a95f-56a0d2b7c4d8, V: 0.2.4 )'
06.02.2018 23:05:58 -  with parameters: 
06.02.2018 23:05:58 - etf.testcases = *
06.02.2018 23:05:58 -  TestTask 2 (d824cc3d-3541-4414-90e6-2b7479c73fb6)
06.02.2018 23:05:58 -  will perform tests on Test Object 'get.xml' by using Executable Test Suite 'Conformance class: GML application schemas, Transport Networks (EID: 9af1c865-1cf0-43ff-9250-069df01b0948, V: 0.2.1 )'
06.02.2018 23:05:58 -  with parameters: 
06.02.2018 23:05:58 - etf.testcases = *
06.02.2018 23:05:58 -  TestTask 3 (7d44f886-20d2-4afb-80b3-1281dc2a2ac6)
06.02.2018 23:05:58 -  will perform tests on Test Object 'get.xml' by using Executable Test Suite 'LAZY.4441cbde-371f-4899-90b3-145f4fd08ebc'
06.02.2018 23:05:58 -  with parameters: 
06.02.2018 23:05:58 - etf.testcases = *
06.02.2018 23:05:58 -  TestTask 4 (119dac9f-dc71-410c-b52a-745f6fbe656d)
06.02.2018 23:05:58 -  will perform tests on Test Object 'get.xml' by using Executable Test Suite 'Conformance class: Application schema, Rail Transport Networks (EID: e2610a9f-6432-489d-8238-92b1193e7a3d, V: 0.2.1 )'
06.02.2018 23:05:58 -  with parameters: 
06.02.2018 23:05:58 - etf.testcases = *
06.02.2018 23:05:58 -  TestTask 5 (6318a05a-63d4-4130-8546-3783fc8ecc91)
06.02.2018 23:05:58 -  will perform tests on Test Object 'get.xml' by using Executable Test Suite 'LAZY.545f9e49-009b-4114-9333-7ca26413b5d4'
06.02.2018 23:05:58 -  with parameters: 
06.02.2018 23:05:58 - etf.testcases = *
06.02.2018 23:05:58 -  TestTask 6 (d3a216fb-afdc-4b9f-b085-b621fa6c5768)
06.02.2018 23:05:58 -  will perform tests on Test Object 'get.xml' by using Executable Test Suite 'LAZY.61070ae8-13cb-4303-a340-72c8b877b00a'
06.02.2018 23:05:58 -  with parameters: 
06.02.2018 23:05:58 - etf.testcases = *
06.02.2018 23:05:58 -  TestTask 7 (ff1ea7cb-a52d-4e83-9d18-e08f4d3a205b)
06.02.2018 23:05:58 -  will perform tests on Test Object 'get.xml' by using Executable Test Suite 'Conformance class: Data consistency, Transport Networks (EID: 733af9a0-312b-4f71-9aa2-977cd2134d23, V: 0.2.2 )'
06.02.2018 23:05:58 -  with parameters: 
06.02.2018 23:05:58 - etf.testcases = *
06.02.2018 23:05:58 -  TestTask 8 (31ee16e1-82f9-4205-b941-4df3638e712a)
06.02.2018 23:05:58 -  will perform tests on Test Object 'get.xml' by using Executable Test Suite 'LAZY.499937ea-0590-42d2-bd7a-1cafff35ecdb'
06.02.2018 23:05:58 -  with parameters: 
06.02.2018 23:05:58 - etf.testcases = *
06.02.2018 23:05:58 -  TestTask 9 (ba40a41c-1dea-4043-8785-18a79cf88dba)
06.02.2018 23:05:58 -  will perform tests on Test Object 'get.xml' by using Executable Test Suite 'Conformance class: Information accessibility, Transport Networks (EID: df5db9a4-b15f-4193-a6ff-6e9951af46f5, V: 0.2.2 )'
06.02.2018 23:05:58 -  with parameters: 
06.02.2018 23:05:58 - etf.testcases = *
06.02.2018 23:05:58 -  TestTask 10 (b833a863-1fde-4ae0-9a47-cf92604c3a8f)
06.02.2018 23:05:58 -  will perform tests on Test Object 'get.xml' by using Executable Test Suite 'LAZY.63f586f0-080c-493b-8ca2-9919427440cc'
06.02.2018 23:05:58 -  with parameters: 
06.02.2018 23:05:58 - etf.testcases = *
06.02.2018 23:05:58 -  TestTask 11 (706f2e70-834f-420c-ac64-a7d7f8ed2159)
06.02.2018 23:05:58 -  will perform tests on Test Object 'get.xml' by using Executable Test Suite 'Conformance class: Reference systems, Transport Networks (EID: 9d35024d-9dd7-43a9-afff-d5aea5f51595, V: 0.2.0 )'
06.02.2018 23:05:58 -  with parameters: 
06.02.2018 23:05:58 - etf.testcases = *
06.02.2018 23:05:58 - Test Tasks prepared and ready to be executed. Waiting for the scheduler to start.
06.02.2018 23:05:58 - Setting state to CREATED
06.02.2018 23:05:58 - Changed state from CREATED to INITIALIZING
06.02.2018 23:06:08 - Starting TestRun.2898c4ae-f00b-418a-9c07-b579d30fde9e at 2018-02-06T23:06:10+01:00
06.02.2018 23:06:10 - Changed state from INITIALIZING to INITIALIZED
06.02.2018 23:06:10 - TestRunTask initialized
06.02.2018 23:06:10 - Creating new tests databases to speed up tests.
06.02.2018 23:06:10 - Skipping schema validation because no schema file has been set in the test suite. Data are only checked for well-formedness.
06.02.2018 23:06:10 - Optimizing last database etf-tdb-b586f403-5e95-4923-9e87-2e43e2e0672e-0 
06.02.2018 23:06:10 - Import completed
06.02.2018 23:06:10 - Validation ended with 0 error(s)
06.02.2018 23:06:10 - Compiling test script
06.02.2018 23:06:10 - Starting XQuery tests
06.02.2018 23:06:10 - "Testing 1 features"
06.02.2018 23:06:10 - "Indexing features (parsing errors: 0): 0 ms"
06.02.2018 23:06:10 - "Executing Test Suite: /home/tomcat/.etf/projects/ets-repository/data/schemas/ets-schemas-bsxets.xml"
06.02.2018 23:06:10 - "Statistics table: 0 ms"
06.02.2018 23:06:10 - "Test Suite 'Conformance class: INSPIRE GML application schemas, General requirements' started"
06.02.2018 23:06:10 - "Test Case 'Schema' started"
06.02.2018 23:06:10 - "Test Assertion 'gmlas.a.1: Mapping of source data to INSPIRE': PASSED_MANUAL"
06.02.2018 23:06:10 - "Test Assertion 'gmlas.a.2: Modelling of additional spatial object types': PASSED_MANUAL"
06.02.2018 23:06:10 - "Test Case 'Schema' finished: PASSED_MANUAL"
06.02.2018 23:06:10 - "Test Case 'Schema validation' started"
06.02.2018 23:06:10 - "Test Assertion 'gmlas.b.1: xsi:schemaLocation attribute': PASSED - 0 ms"
06.02.2018 23:06:10 - "Validating get.xml"
06.02.2018 23:06:17 - "Duration: 6457 ms. Errors: 0."
06.02.2018 23:06:17 - "Test Assertion 'gmlas.b.2: validate XML documents': PASSED - 6457 ms"
06.02.2018 23:06:17 - "Test Case 'Schema validation' finished: PASSED"
06.02.2018 23:06:17 - "Test Case 'GML model' started"
06.02.2018 23:06:17 - "Test Assertion 'gmlas.c.1: Consistency with the GML model': PASSED - 0 ms"
06.02.2018 23:06:17 - "Test Assertion 'gmlas.c.2: nilReason attributes require xsi:nil=true': PASSED - 0 ms"
06.02.2018 23:06:17 - "Test Assertion 'gmlas.c.3: nilReason values': PASSED - 0 ms"
06.02.2018 23:06:17 - "Test Case 'GML model' finished: PASSED"
06.02.2018 23:06:17 - "Test Case 'Simple features' started"
06.02.2018 23:06:17 - "Test Assertion 'gmlas.d.1: No spatial topology objects': PASSED - 0 ms"
06.02.2018 23:06:17 - "Test Assertion 'gmlas.d.2: No non-linear interpolation': PASSED - 0 ms"
06.02.2018 23:06:17 - "Test Assertion 'gmlas.d.3: Surface geometry elements': PASSED - 0 ms"
06.02.2018 23:06:17 - "Test Assertion 'gmlas.d.4: No non-planar interpolation': PASSED - 0 ms"
06.02.2018 23:06:17 - "Test Assertion 'gmlas.d.5: Geometry elements': PASSED - 0 ms"
06.02.2018 23:06:17 - "Test Assertion 'gmlas.d.6: Point coordinates in gml:pos': PASSED - 0 ms"
06.02.2018 23:06:17 - "Test Assertion 'gmlas.d.7: Curve/Surface coordinates in gml:posList': PASSED - 0 ms"
06.02.2018 23:06:17 - "Test Assertion 'gmlas.d.8: No array property elements': PASSED - 0 ms"
06.02.2018 23:06:17 - "Test Assertion 'gmlas.d.9: 1, 2 or 3 coordinate dimensions': PASSED - 0 ms"
06.02.2018 23:06:17 - "Test Assertion 'gmlas.d.10: Validate geometries (1)': PASSED - 24 ms"
06.02.2018 23:06:17 - "Test Assertion 'gmlas.d.11: Validate geometries (2)': PASSED - 0 ms"
06.02.2018 23:06:17 - "Test Case 'Simple features' finished: PASSED"
06.02.2018 23:06:17 - "Test Case 'Code list values in basic data types' started"
06.02.2018 23:06:17 - "Test Assertion 'gmlas.e.1: GrammaticalNumber attributes': PASSED - 5 ms"
06.02.2018 23:06:17 - "Test Assertion 'gmlas.e.2: GrammaticalGender attributes': PASSED - 4 ms"
06.02.2018 23:06:17 - "Test Assertion 'gmlas.e.3: NameStatus attributes': PASSED - 4 ms"
06.02.2018 23:06:17 - "Test Assertion 'gmlas.e.4: Nativeness attributes': PASSED - 4 ms"
06.02.2018 23:06:17 - "Test Case 'Code list values in basic data types' finished: PASSED"
06.02.2018 23:06:17 - "Test Case 'Constraints' started"
06.02.2018 23:06:17 - "Test Assertion 'gmlas.f.1: At least one of the two attributes pronunciationSoundLink and pronunciationIPA shall not be void': PASSED - 0 ms"
06.02.2018 23:06:17 - "Test Case 'Constraints' finished: PASSED"
06.02.2018 23:06:17 - "Test Suite 'Conformance class: INSPIRE GML application schemas, General requirements' finished: PASSED_MANUAL"
06.02.2018 23:06:17 - Releasing resources
06.02.2018 23:06:17 - TestRunTask initialized
06.02.2018 23:06:17 - Recreating new tests databases as the Test Object has changed!
06.02.2018 23:06:17 - Skipping schema validation because no schema file has been set in the test suite. Data are only checked for well-formedness.
06.02.2018 23:06:17 - Optimizing last database etf-tdb-b586f403-5e95-4923-9e87-2e43e2e0672e-0 
06.02.2018 23:06:17 - Import completed
06.02.2018 23:06:17 - Validation ended with 0 error(s)
06.02.2018 23:06:17 - Compiling test script
06.02.2018 23:06:17 - Starting XQuery tests
06.02.2018 23:06:17 - "Testing 1 features"
06.02.2018 23:06:17 - "Indexing features (parsing errors: 0): 0 ms"
06.02.2018 23:06:17 - "Executing Test Suite: /home/tomcat/.etf/projects/ets-repository/data-tn/tn-gml/ets-tn-gml-bsxets.xml"
06.02.2018 23:06:17 - "Statistics table: 1 ms"
06.02.2018 23:06:17 - "Test Suite 'Conformance class: GML application schemas, Transport Networks' started"
06.02.2018 23:06:17 - "Test Case 'Basic test' started"
06.02.2018 23:06:17 - "Test Assertion 'tn-gml.a.1: Transport Network feature in dataset': PASSED - 0 ms"
06.02.2018 23:06:17 - "Test Case 'Basic test' finished: PASSED"
06.02.2018 23:06:17 - "Test Suite 'Conformance class: GML application schemas, Transport Networks' finished: PASSED"
06.02.2018 23:06:17 - Releasing resources
06.02.2018 23:06:17 - TestRunTask initialized
06.02.2018 23:06:17 - Skipping schema validation because no schema file has been set in the test suite. Data are only checked for well-formedness.
06.02.2018 23:06:17 - Validation ended with 0 error(s)
06.02.2018 23:06:17 - Compiling test script
06.02.2018 23:06:17 - Starting XQuery tests
06.02.2018 23:06:18 - "Testing 1 features"
06.02.2018 23:06:18 - "Indexing features (parsing errors: 0): 0 ms"
06.02.2018 23:06:18 - "Executing Test Suite: /home/tomcat/.etf/projects/ets-repository/data-tn/tn-as/ets-tn-as-bsxets.xml"
06.02.2018 23:06:18 - "Statistics table: 0 ms"
06.02.2018 23:06:18 - "Test Suite 'Conformance class: Application schema, Transport Networks Common' started"
06.02.2018 23:06:18 - "Test Case 'Code list values' started"
06.02.2018 23:06:18 - "Test Assertion 'tn-as.a.1: AccessRestrictionValue attributes': PASSED - 4 ms"
06.02.2018 23:06:18 - "Test Assertion 'tn-as.a.2: RestrictionTypeValue attributes': PASSED - 5 ms"
06.02.2018 23:06:18 - "Test Case 'Code list values' finished: PASSED"
06.02.2018 23:06:18 - "Test Case 'Constraints' started"
06.02.2018 23:06:18 - "Test Assertion 'tn-as.b.1: TrafficFlowDirection can only be associated with a spatial object of the type Link or LinkSequence.': PASSED - 1 ms"
06.02.2018 23:06:18 - "Test Assertion 'tn-as.b.2: All transport areas have an external object identifier.': PASSED - 0 ms"
06.02.2018 23:06:18 - "Test Assertion 'tn-as.b.3: All transport links have an external object identifier.': PASSED - 0 ms"
06.02.2018 23:06:18 - "Test Assertion 'tn-as.b.4: All transport link sequences have an external object identifier.': PASSED - 0 ms"
06.02.2018 23:06:18 - "Test Assertion 'tn-as.b.5: All transport link sets have an external object identifier.': PASSED - 1 ms"
06.02.2018 23:06:18 - "Test Assertion 'tn-as.b.6: All transport nodes have an external object identifier.': PASSED - 0 ms"
06.02.2018 23:06:18 - "Test Assertion 'tn-as.b.7: All transport points have an external object identifier.': PASSED - 0 ms"
06.02.2018 23:06:18 - "Test Assertion 'tn-as.b.8: All transport properties have an external object identifier.': PASSED - 0 ms"
06.02.2018 23:06:18 - "Test Assertion 'tn-as.b.9: A transport link sequence must be composed of transport links that all belong to the same transport network.': PASSED - 0 ms"
06.02.2018 23:06:18 - "Test Assertion 'tn-as.b.10: A transport link set must be composed of transport links and or transport link sequences that all belong to the same transport network.': PASSED - 0 ms"
06.02.2018 23:06:18 - "Test Case 'Constraints' finished: PASSED"
06.02.2018 23:06:18 - "Test Case 'Geometry' started"
06.02.2018 23:06:18 - "Test Assertion 'tn-as.c.1: No free transport nodes': PASSED - 0 ms"
06.02.2018 23:06:18 - "Test Assertion 'tn-as.c.2: Intersections only at crossings': PASSED_MANUAL"
06.02.2018 23:06:18 - "Test Case 'Geometry' finished: PASSED_MANUAL"
06.02.2018 23:06:18 - "Test Case 'Network connectivity' started"
06.02.2018 23:06:18 - "Test Assertion 'tn-as.d.1: Connectivity at crossings': PASSED_MANUAL"
06.02.2018 23:06:18 - "Test Assertion 'tn-as.d.2: Unconnected nodes': PASSED_MANUAL"
06.02.2018 23:06:18 - "Test Assertion 'tn-as.d.3: Connectivity tolerance': PASSED_MANUAL"
06.02.2018 23:06:18 - "Test Case 'Network connectivity' finished: PASSED_MANUAL"
06.02.2018 23:06:18 - "Test Case 'Object References' started"
06.02.2018 23:06:18 - "Test Assertion 'tn-as.e.1: Linear references': PASSED_MANUAL"
06.02.2018 23:06:18 - "Test Assertion 'tn-as.e.2: Inter-modal connections': PASSED - 0 ms"
06.02.2018 23:06:18 - "Test Case 'Object References' finished: PASSED_MANUAL"
06.02.2018 23:06:18 - "Test Suite 'Conformance class: Application schema, Transport Networks Common' finished: PASSED_MANUAL"
06.02.2018 23:06:18 - Releasing resources
06.02.2018 23:06:18 - TestRunTask initialized
06.02.2018 23:06:18 - Skipping schema validation because no schema file has been set in the test suite. Data are only checked for well-formedness.
06.02.2018 23:06:18 - Validation ended with 0 error(s)
06.02.2018 23:06:18 - Compiling test script
06.02.2018 23:06:18 - Starting XQuery tests
06.02.2018 23:06:18 - "Testing 1 features"
06.02.2018 23:06:18 - "Executing Test Suite: /home/tomcat/.etf/projects/ets-repository/data-tn/tn-ra-as/ets-tn-ra-as-bsxets.xml"
06.02.2018 23:06:18 - "Statistics table: 0 ms"
06.02.2018 23:06:18 - "Test Suite 'Conformance class: Application schema, Rail Transport Networks' started"
06.02.2018 23:06:18 - "Test Case 'Code list values' started"
06.02.2018 23:06:18 - "Test Assertion 'tn-ra-as.a.1: FormOfRailwayNodeValue attributes': PASSED - 5 ms"
06.02.2018 23:06:18 - "Test Assertion 'tn-ra-as.a.2: RailwayTypeValue attributes': PASSED - 4 ms"
06.02.2018 23:06:18 - "Test Assertion 'tn-ra-as.a.3: RailwayUseValue attributes': PASSED - 3 ms"
06.02.2018 23:06:18 - "Test Case 'Code list values' finished: PASSED"
06.02.2018 23:06:18 - "Test Case 'Constraints' started"
06.02.2018 23:06:18 - "Test Assertion 'tn-ra-as.b.1: DesignSpeed can only be associated with a spatial object that is part of a railway transport network.': PASSED - 0 ms"
06.02.2018 23:06:18 - "Checking URL: 'https://zbgisws.skgeodesy.sk/inspire_transport_networks_wfs/service.svc/get?SERVICE=WFS&amp;VERSION=2.0.0&amp;REQUEST=GetFeature&amp;STOREDQUERY_ID=urn:ogc:def:query:OGC-WFS::GetFeatureById&amp;id=netElementL.1300000'"
06.02.2018 23:06:48 - "Exception: Timeout exceeded. URL: https://zbgisws.skgeodesy.sk/inspire_transport_networks_wfs/service.svc/get?SERVICE=WFS&amp;VERSION=2.0.0&amp;REQUEST=GetFeature&amp;STOREDQUERY_ID=urn:ogc:def:query:OGC-WFS::GetFeatureById&amp;id=netElementL.1300000"
06.02.2018 23:06:48 - "Test Assertion 'tn-ra-as.b.2: NominalTrackGauge can only be associated with a spatial object that is part of a railway transport network.': FAILED - 30033 ms"
06.02.2018 23:06:48 - "Test Assertion 'tn-ra-as.b.3: NumberOfTracks can only be associated with a spatial object that is part of a railway transport network.': PASSED - 0 ms"
06.02.2018 23:06:48 - "Test Assertion 'tn-ra-as.b.4: RailwayElectrification can only be associated with a spatial object that is part of a railway transport network.': PASSED - 0 ms"
06.02.2018 23:06:48 - "Test Assertion 'tn-ra-as.b.5: RailwayStationCode can only be associated with a spatial object that is part of a railway transport network.': PASSED - 0 ms"
06.02.2018 23:06:48 - "Test Assertion 'tn-ra-as.b.6: RailwayType can only be associated with a spatial object that is part of a railway transport network.': PASSED - 0 ms"
06.02.2018 23:06:48 - "Test Assertion 'tn-ra-as.b.7: RailwayUse can only be associated with a spatial object that is part of a railway transport network.': PASSED - 0 ms"
06.02.2018 23:06:48 - "Test Assertion 'tn-ra-as.b.8: For a railway station node, the value for the ""formOfNode"" attribute shall always be ""RailwayStop"".': PASSED - 0 ms"
06.02.2018 23:06:48 - "Test Assertion 'tn-ra-as.b.9: For a railway yard node, the value for the ""formOfNode"" attribute shall always be ""RailwayStop"".': PASSED - 0 ms"
06.02.2018 23:06:48 - "Test Case 'Constraints' finished: FAILED"
06.02.2018 23:06:48 - "Test Case 'Link centrelines' started"
06.02.2018 23:06:48 - "Test Assertion 'tn-ro-as.a.1: Link centrelines test': PASSED_MANUAL"
06.02.2018 23:06:48 - "Test Case 'Link centrelines' finished: PASSED_MANUAL"
06.02.2018 23:06:48 - "Test Suite 'Conformance class: Application schema, Rail Transport Networks' finished: FAILED"
06.02.2018 23:06:48 - Releasing resources
06.02.2018 23:06:48 - TestRunTask initialized
06.02.2018 23:06:48 - Skipping schema validation because no schema file has been set in the test suite. Data are only checked for well-formedness.
06.02.2018 23:06:48 - Validation ended with 0 error(s)
06.02.2018 23:06:48 - Compiling test script
06.02.2018 23:06:48 - Starting XQuery tests
06.02.2018 23:06:48 - "Testing 1 features"
06.02.2018 23:06:48 - "Executing Test Suite: /home/tomcat/.etf/projects/ets-repository/data-encoding/inspire-gml/ets-inspire-gml-bsxets.xml"
06.02.2018 23:06:48 - "Statistics table: 0 ms"
06.02.2018 23:06:48 - "Test Suite 'Conformance class: INSPIRE GML encoding' started"
06.02.2018 23:06:48 - "Test Case 'Basic tests' started"
06.02.2018 23:06:48 - "Test Assertion 'gml.a.1: Errors loading the XML documents': PASSED - 0 ms"
06.02.2018 23:06:48 - "Test Assertion 'gml.a.2: Document root element': PASSED - 0 ms"
06.02.2018 23:06:48 - "Test Assertion 'gml.a.3: Character encoding': NOT_APPLICABLE"
06.02.2018 23:06:48 - "Test Case 'Basic tests' finished: PASSED"
06.02.2018 23:06:48 - "Test Suite 'Conformance class: INSPIRE GML encoding' finished: PASSED"
06.02.2018 23:06:49 - Releasing resources
06.02.2018 23:06:49 - TestRunTask initialized
06.02.2018 23:06:49 - Skipping schema validation because no schema file has been set in the test suite. Data are only checked for well-formedness.
06.02.2018 23:06:49 - Validation ended with 0 error(s)
06.02.2018 23:06:49 - Compiling test script
06.02.2018 23:06:49 - Starting XQuery tests
06.02.2018 23:06:49 - "Testing 1 features"
06.02.2018 23:06:49 - "Indexing features (parsing errors: 0): 0 ms"
06.02.2018 23:06:49 - "Executing Test Suite: /home/tomcat/.etf/projects/ets-repository/data/data-consistency/ets-data-consistency-bsxets.xml"
06.02.2018 23:06:49 - "Statistics table: 1 ms"
06.02.2018 23:06:49 - "Test Suite 'Conformance class: Data consistency, General requirements' started"
06.02.2018 23:06:49 - "Test Case 'Version consistency' started"
06.02.2018 23:06:49 - "Test Assertion 'dc.a.1: Version lifespan plausible': PASSED - 0 ms"
06.02.2018 23:06:49 - "Test Assertion 'dc.a.2: Unique identifier persistency': PASSED_MANUAL"
06.02.2018 23:06:49 - "Test Assertion 'dc.a.3: Spatial object type stable': PASSED_MANUAL"
06.02.2018 23:06:49 - "Test Case 'Version consistency' finished: PASSED_MANUAL"
06.02.2018 23:06:49 - "Test Case 'Temporal consistency' started"
06.02.2018 23:06:49 - "Test Assertion 'dc.b.1: Valid time plausible': PASSED - 0 ms"
06.02.2018 23:06:49 - "Test Case 'Temporal consistency' finished: PASSED"
06.02.2018 23:06:49 - "Test Suite 'Conformance class: Data consistency, General requirements' finished: PASSED_MANUAL"
06.02.2018 23:06:49 - Releasing resources
06.02.2018 23:06:49 - TestRunTask initialized
06.02.2018 23:06:49 - Skipping schema validation because no schema file has been set in the test suite. Data are only checked for well-formedness.
06.02.2018 23:06:49 - Validation ended with 0 error(s)
06.02.2018 23:06:49 - Compiling test script
06.02.2018 23:06:49 - Starting XQuery tests
06.02.2018 23:06:49 - "Testing 1 features"
06.02.2018 23:06:49 - "Indexing features (parsing errors: 0): 1 ms"
06.02.2018 23:06:49 - "Executing Test Suite: /home/tomcat/.etf/projects/ets-repository/data-tn/tn-dc/ets-tn-dc-bsxets.xml"
06.02.2018 23:06:49 - "Statistics table: 0 ms"
06.02.2018 23:06:49 - "Test Suite 'Conformance class: Data consistency, Transport Networks' started"
06.02.2018 23:06:49 - "Test Case 'Spatial consistency' started"
06.02.2018 23:06:49 - "Test Assertion 'tn-dc.a.1: Each Transport Network Link or Node geometry is within a Network Area geometry (Road Transport Networks)': PASSED - 1 ms"
06.02.2018 23:06:49 - "Test Assertion 'tn-dc.a.2: Each Transport Network Link or Node geometry is within a Network Area geometry (Railway Transport Networks)': PASSED - 0 ms"
06.02.2018 23:06:49 - "Test Assertion 'tn-dc.a.3: Each Transport Network Link or Node geometry is within a Network Area geometry (Waterway Transport Networks)': PASSED - 0 ms"
06.02.2018 23:06:49 - "Test Assertion 'tn-dc.a.4: Each Transport Network Link or Node geometry is within a Network Area geometry (Air Transport Networks)': PASSED - 0 ms"
06.02.2018 23:06:49 - "Test Assertion 'tn-dc.a.5: Manual review': PASSED_MANUAL"
06.02.2018 23:06:49 - "Test Case 'Spatial consistency' finished: PASSED_MANUAL"
06.02.2018 23:06:49 - "Test Suite 'Conformance class: Data consistency, Transport Networks' finished: PASSED_MANUAL"
06.02.2018 23:06:49 - Releasing resources
06.02.2018 23:06:49 - TestRunTask initialized
06.02.2018 23:06:49 - Skipping schema validation because no schema file has been set in the test suite. Data are only checked for well-formedness.
06.02.2018 23:06:49 - Validation ended with 0 error(s)
06.02.2018 23:06:49 - Compiling test script
06.02.2018 23:06:49 - Starting XQuery tests
06.02.2018 23:06:49 - "Testing 1 features"
06.02.2018 23:06:49 - "Indexing features (parsing errors: 0): 1 ms"
06.02.2018 23:06:49 - "Executing Test Suite: /home/tomcat/.etf/projects/ets-repository/data/information-accessibility/ets-information-accessibility-bsxets.xml"
06.02.2018 23:06:49 - "Statistics table: 0 ms"
06.02.2018 23:06:49 - "Test Suite 'Conformance class: Information accessibility, General requirements' started"
06.02.2018 23:06:49 - "Test Case 'Coordinate reference systems (CRS)' started"
06.02.2018 23:06:49 - "Test Assertion 'ia.a.1: CRS publicly accessible via HTTP': PASSED - 0 ms"
06.02.2018 23:06:49 - "Test Case 'Coordinate reference systems (CRS)' finished: PASSED"
06.02.2018 23:06:49 - "Test Suite 'Conformance class: Information accessibility, General requirements' finished: PASSED"
06.02.2018 23:06:50 - Releasing resources
06.02.2018 23:06:50 - TestRunTask initialized
06.02.2018 23:06:50 - Skipping schema validation because no schema file has been set in the test suite. Data are only checked for well-formedness.
06.02.2018 23:06:50 - Validation ended with 0 error(s)
06.02.2018 23:06:50 - Compiling test script
06.02.2018 23:06:50 - Starting XQuery tests
06.02.2018 23:06:50 - "Testing 1 features"
06.02.2018 23:06:50 - "Executing Test Suite: /home/tomcat/.etf/projects/ets-repository/data-tn/tn-ia/ets-tn-ia-bsxets.xml"
06.02.2018 23:06:50 - "Statistics table: 0 ms"
06.02.2018 23:06:50 - "Test Suite 'Conformance class: Information accessibility, Transport Networks' started"
06.02.2018 23:06:50 - "Test Case 'Code lists' started"
06.02.2018 23:06:50 - "Test Assertion 'tn-ia.a.1: Code list extensions accessible': PASSED - 0 ms"
06.02.2018 23:06:50 - "Test Case 'Code lists' finished: PASSED"
06.02.2018 23:06:50 - "Test Case 'Feature references' started"
06.02.2018 23:06:50 - "Test Assertion 'tn-ia.b.1: MarkerPost.route': PASSED - 0 ms"
06.02.2018 23:06:50 - "Test Assertion 'tn-ia.b.2: TransportLinkSet.post': PASSED - 0 ms"
06.02.2018 23:06:50 - "Test Case 'Feature references' finished: PASSED"
06.02.2018 23:06:50 - "Test Suite 'Conformance class: Information accessibility, Transport Networks' finished: PASSED"
06.02.2018 23:06:50 - Releasing resources
06.02.2018 23:06:50 - TestRunTask initialized
06.02.2018 23:06:50 - Skipping schema validation because no schema file has been set in the test suite. Data are only checked for well-formedness.
06.02.2018 23:06:50 - Validation ended with 0 error(s)
06.02.2018 23:06:50 - Compiling test script
06.02.2018 23:06:50 - Starting XQuery tests
06.02.2018 23:06:50 - "Testing 1 features"
06.02.2018 23:06:50 - "Indexing features (parsing errors: 0): 0 ms"
06.02.2018 23:06:50 - "Executing Test Suite: /home/tomcat/.etf/projects/ets-repository/data/reference-systems/ets-reference-systems-bsxets.xml"
06.02.2018 23:06:50 - "Statistics table: 1 ms"
06.02.2018 23:06:50 - "Test Suite 'Conformance class: Reference systems, General requirements' started"
06.02.2018 23:06:50 - "Test Case 'Spatial reference systems' started"
06.02.2018 23:06:50 - "Test Assertion 'rs.a.1: Spatial reference systems in feature geometries': PASSED - 0 ms"
06.02.2018 23:06:50 - "Test Assertion 'rs.a.2: Default spatial reference systems in feature collections': PASSED - 0 ms"
06.02.2018 23:06:50 - "Test Case 'Spatial reference systems' finished: PASSED"
06.02.2018 23:06:50 - "Test Case 'Temporal reference systems' started"
06.02.2018 23:06:50 - "Test Assertion 'rs.a.3: Temporal reference systems in features': PASSED - 0 ms"
06.02.2018 23:06:50 - "Test Case 'Temporal reference systems' finished: PASSED"
06.02.2018 23:06:50 - "Test Suite 'Conformance class: Reference systems, General requirements' finished: PASSED"
06.02.2018 23:06:50 - Releasing resources
06.02.2018 23:06:50 - TestRunTask initialized
06.02.2018 23:06:50 - Skipping schema validation because no schema file has been set in the test suite. Data are only checked for well-formedness.
06.02.2018 23:06:50 - Validation ended with 0 error(s)
06.02.2018 23:06:50 - Compiling test script
06.02.2018 23:06:50 - Starting XQuery tests
06.02.2018 23:06:50 - "Testing 1 features"
06.02.2018 23:06:50 - "Executing Test Suite: /home/tomcat/.etf/projects/ets-repository/data-tn/tn-rs/ets-tn-rs-bsxets.xml"
06.02.2018 23:06:50 - "Statistics table: 0 ms"
06.02.2018 23:06:50 - "Test Suite 'Conformance class: Reference systems, Transport Networks' started"
06.02.2018 23:06:50 - "Test Case 'Additional theme-specific rules for reference systems' started"
06.02.2018 23:06:50 - "Test Assertion 'tn-rs.a.1: Test always passes': PASSED - 0 ms"
06.02.2018 23:06:50 - "Test Case 'Additional theme-specific rules for reference systems' finished: PASSED"
06.02.2018 23:06:50 - "Test Suite 'Conformance class: Reference systems, Transport Networks' finished: PASSED"
06.02.2018 23:06:50 - Releasing resources
06.02.2018 23:06:50 - Changed state from INITIALIZED to RUNNING
06.02.2018 23:06:51 - Duration: 52sec
06.02.2018 23:06:51 - TestRun finished
06.02.2018 23:06:51 - Changed state from RUNNING to COMPLETED
