15.11.2017 23:43:07 - Preparing Test Run au:AdministrativeUnit (initiated Wed Nov 15 23:43:07 CET 2017)
15.11.2017 23:43:07 - Resolving Executable Test Suite dependencies
15.11.2017 23:43:07 - Preparing 10 Test Task:
15.11.2017 23:43:07 -  TestTask 1 (aef3af8d-c776-412d-a2c5-f6e05554a4c3)
15.11.2017 23:43:07 -  will perform tests on Test Object 'get.xml' by using Executable Test Suite 'LAZY.545f9e49-009b-4114-9333-7ca26413b5d4'
15.11.2017 23:43:07 -  with parameters: 
15.11.2017 23:43:07 - etf.testcases = *
15.11.2017 23:43:07 -  TestTask 2 (343008da-c569-4e60-8181-c1b96b7d3539)
15.11.2017 23:43:07 -  will perform tests on Test Object 'get.xml' by using Executable Test Suite 'Conformance class: INSPIRE GML application schemas, General requirements (EID: 09820daf-62b2-4fa3-a95f-56a0d2b7c4d8, V: 0.2.3 )'
15.11.2017 23:43:07 -  with parameters: 
15.11.2017 23:43:07 - etf.testcases = *
15.11.2017 23:43:07 -  TestTask 3 (5d68278b-edcb-4728-9360-138db3956ec9)
15.11.2017 23:43:07 -  will perform tests on Test Object 'get.xml' by using Executable Test Suite 'LAZY.47c569bc-677d-4ce3-8411-e2b29189332a'
15.11.2017 23:43:07 -  with parameters: 
15.11.2017 23:43:07 - etf.testcases = *
15.11.2017 23:43:07 -  TestTask 4 (bd8a2822-9cdd-4a07-a22a-2aa0191cbbe7)
15.11.2017 23:43:07 -  will perform tests on Test Object 'get.xml' by using Executable Test Suite 'Conformance class: Application schema, Administrative Units (EID: ddecef4b-89a3-4f9d-9246-a50b588fa5a2, V: 0.2.1 )'
15.11.2017 23:43:07 -  with parameters: 
15.11.2017 23:43:07 - etf.testcases = *
15.11.2017 23:43:07 -  TestTask 5 (c2132bca-8855-4be7-8531-e8df5cc681ec)
15.11.2017 23:43:07 -  will perform tests on Test Object 'get.xml' by using Executable Test Suite 'LAZY.61070ae8-13cb-4303-a340-72c8b877b00a'
15.11.2017 23:43:07 -  with parameters: 
15.11.2017 23:43:07 - etf.testcases = *
15.11.2017 23:43:07 -  TestTask 6 (5d8fd7a0-9872-4213-a41f-7ae9994f7a8e)
15.11.2017 23:43:07 -  will perform tests on Test Object 'get.xml' by using Executable Test Suite 'Conformance class: Data consistency, Administrative Units (EID: acc5931c-4ff0-499f-b916-3cda1603456b, V: 0.2.2 )'
15.11.2017 23:43:07 -  with parameters: 
15.11.2017 23:43:07 - etf.testcases = *
15.11.2017 23:43:07 -  TestTask 7 (a36e5801-cb17-4426-9ca9-3c44b30620e6)
15.11.2017 23:43:07 -  will perform tests on Test Object 'get.xml' by using Executable Test Suite 'LAZY.499937ea-0590-42d2-bd7a-1cafff35ecdb'
15.11.2017 23:43:07 -  with parameters: 
15.11.2017 23:43:07 - etf.testcases = *
15.11.2017 23:43:07 -  TestTask 8 (ef5575f8-6a4c-4ee6-a680-46ee54258082)
15.11.2017 23:43:07 -  will perform tests on Test Object 'get.xml' by using Executable Test Suite 'Conformance class: Information accessibility, Administrative Units (EID: ee28b75e-5c80-4370-838d-ab1b18e30b13, V: 0.2.1 )'
15.11.2017 23:43:07 -  with parameters: 
15.11.2017 23:43:07 - etf.testcases = *
15.11.2017 23:43:07 -  TestTask 9 (93a17c94-20ec-4635-9564-54540d188557)
15.11.2017 23:43:07 -  will perform tests on Test Object 'get.xml' by using Executable Test Suite 'LAZY.63f586f0-080c-493b-8ca2-9919427440cc'
15.11.2017 23:43:07 -  with parameters: 
15.11.2017 23:43:07 - etf.testcases = *
15.11.2017 23:43:07 -  TestTask 10 (35225bb0-926c-419c-ae3a-5c2e97e19235)
15.11.2017 23:43:07 -  will perform tests on Test Object 'get.xml' by using Executable Test Suite 'Conformance class: Reference systems, Administrative Units (EID: cafb75f8-5deb-4cca-89df-d3189322e97f, V: 0.2.0 )'
15.11.2017 23:43:07 -  with parameters: 
15.11.2017 23:43:07 - etf.testcases = *
15.11.2017 23:43:07 - Test Tasks prepared and ready to be executed. Waiting for the scheduler to start.
15.11.2017 23:43:07 - Setting state to CREATED
15.11.2017 23:43:07 - Changed state from CREATED to INITIALIZING
15.11.2017 23:43:07 - Starting TestRun.ed148016-4597-4d52-a6eb-ff3b72ab78a3 at 2017-11-15T23:43:09+01:00
15.11.2017 23:43:09 - Changed state from INITIALIZING to INITIALIZED
15.11.2017 23:43:09 - TestRunTask initialized
15.11.2017 23:43:09 - Creating new tests databases to speed up tests.
15.11.2017 23:43:09 - Skipping schema validation because no schema file has been set in the test suite. Data are only checked for well-formedness.
15.11.2017 23:43:09 - Optimizing last database etf-tdb-7e1ae98d-835d-485b-9585-887dc91aef7f-0 
15.11.2017 23:43:09 - Import completed
15.11.2017 23:43:10 - Validation ended with 0 error(s)
15.11.2017 23:43:10 - Compiling test script
15.11.2017 23:43:10 - Starting XQuery tests
15.11.2017 23:43:10 - "Testing 1 features"
15.11.2017 23:43:10 - "Executing Test Suite: /home/tomcat/.etf/projects/ets-repository/data-encoding/inspire-gml/ets-inspire-gml-bsxets.xml"
15.11.2017 23:43:10 - "Statistics table: 0 ms"
15.11.2017 23:43:10 - "Test Suite 'Conformance class: INSPIRE GML encoding' started"
15.11.2017 23:43:10 - "Test Case 'Basic tests' started"
15.11.2017 23:43:10 - "Test Assertion 'gml.a.1: Errors loading the XML documents': PASSED - 0 ms"
15.11.2017 23:43:10 - "Test Assertion 'gml.a.2: Document root element': PASSED - 0 ms"
15.11.2017 23:43:10 - "Test Assertion 'gml.a.3: Character encoding': NOT_APPLICABLE"
15.11.2017 23:43:10 - "Test Case 'Basic tests' finished: PASSED"
15.11.2017 23:43:10 - "Test Suite 'Conformance class: INSPIRE GML encoding' finished: PASSED"
15.11.2017 23:43:10 - Releasing resources
15.11.2017 23:43:10 - TestRunTask initialized
15.11.2017 23:43:10 - Recreating new tests databases as the Test Object has changed!
15.11.2017 23:43:10 - Skipping schema validation because no schema file has been set in the test suite. Data are only checked for well-formedness.
15.11.2017 23:43:10 - Optimizing last database etf-tdb-7e1ae98d-835d-485b-9585-887dc91aef7f-0 
15.11.2017 23:43:10 - Import completed
15.11.2017 23:43:10 - Validation ended with 0 error(s)
15.11.2017 23:43:10 - Compiling test script
15.11.2017 23:43:10 - Starting XQuery tests
15.11.2017 23:43:10 - "Testing 1 features"
15.11.2017 23:43:10 - "Indexing features (parsing errors: 0): 144 ms"
15.11.2017 23:43:10 - "Executing Test Suite: /home/tomcat/.etf/projects/ets-repository/data/schemas/ets-schemas-bsxets.xml"
15.11.2017 23:43:10 - "Statistics table: 0 ms"
15.11.2017 23:43:10 - "Test Suite 'Conformance class: INSPIRE GML application schemas, General requirements' started"
15.11.2017 23:43:10 - "Test Case 'Schema' started"
15.11.2017 23:43:10 - "Test Assertion 'gmlas.a.1: Mapping of source data to INSPIRE': PASSED_MANUAL"
15.11.2017 23:43:10 - "Test Assertion 'gmlas.a.2: Modelling of additional spatial object types': PASSED_MANUAL"
15.11.2017 23:43:10 - "Test Case 'Schema' finished: PASSED_MANUAL"
15.11.2017 23:43:10 - "Test Case 'Schema validation' started"
15.11.2017 23:43:10 - "Test Assertion 'gmlas.b.1: xsi:schemaLocation attribute': PASSED - 0 ms"
15.11.2017 23:43:10 - "Validating get.xml"
15.11.2017 23:43:21 - "Duration: 10179 ms. Errors: 0."
15.11.2017 23:43:21 - "Test Assertion 'gmlas.b.2: validate XML documents': PASSED - 10180 ms"
15.11.2017 23:43:21 - "Test Case 'Schema validation' finished: PASSED"
15.11.2017 23:43:21 - "Test Case 'GML model' started"
15.11.2017 23:43:21 - "Test Assertion 'gmlas.c.1: Consistency with the GML model': PASSED - 0 ms"
15.11.2017 23:43:21 - "Test Assertion 'gmlas.c.2: nilReason attributes require xsi:nil=true': PASSED - 0 ms"
15.11.2017 23:43:21 - "Test Assertion 'gmlas.c.3: nilReason values': PASSED - 0 ms"
15.11.2017 23:43:21 - "Test Case 'GML model' finished: PASSED"
15.11.2017 23:43:21 - "Test Case 'Simple features' started"
15.11.2017 23:43:21 - "Test Assertion 'gmlas.d.1: No spatial topology objects': PASSED - 0 ms"
15.11.2017 23:43:21 - "Test Assertion 'gmlas.d.2: No non-linear interpolation': PASSED - 1 ms"
15.11.2017 23:43:21 - "Test Assertion 'gmlas.d.3: Surface geometry elements': PASSED - 0 ms"
15.11.2017 23:43:21 - "Test Assertion 'gmlas.d.4: No non-planar interpolation': PASSED - 0 ms"
15.11.2017 23:43:21 - "Test Assertion 'gmlas.d.5: Geometry elements': PASSED - 1 ms"
15.11.2017 23:43:21 - "Test Assertion 'gmlas.d.6: Point coordinates in gml:pos': PASSED - 0 ms"
15.11.2017 23:43:21 - "Test Assertion 'gmlas.d.7: Curve/Surface coordinates in gml:posList': PASSED - 0 ms"
15.11.2017 23:43:21 - "Test Assertion 'gmlas.d.8: No array property elements': PASSED - 0 ms"
15.11.2017 23:43:21 - "Test Assertion 'gmlas.d.9: 1, 2 or 3 coordinate dimensions': PASSED - 0 ms"
15.11.2017 23:43:21 - "Test Assertion 'gmlas.d.10: Validate geometries (1)': PASSED - 262 ms"
15.11.2017 23:43:21 - "Test Assertion 'gmlas.d.11: Validate geometries (2)': PASSED - 0 ms"
15.11.2017 23:43:21 - "Test Case 'Simple features' finished: PASSED"
15.11.2017 23:43:21 - "Test Case 'Code list values in basic data types' started"
15.11.2017 23:43:21 - "Test Assertion 'gmlas.e.1: GrammaticalNumber attributes': PASSED - 44 ms"
15.11.2017 23:43:21 - "Test Assertion 'gmlas.e.2: GrammaticalGender attributes': PASSED - 5 ms"
15.11.2017 23:43:21 - "Test Assertion 'gmlas.e.3: NameStatus attributes': PASSED - 5 ms"
15.11.2017 23:43:21 - "Test Assertion 'gmlas.e.4: Nativeness attributes': PASSED - 4 ms"
15.11.2017 23:43:21 - "Test Case 'Code list values in basic data types' finished: PASSED"
15.11.2017 23:43:21 - "Test Case 'Constraints' started"
15.11.2017 23:43:21 - "Test Assertion 'gmlas.f.1: At least one of the two attributes pronunciationSoundLink and pronunciationIPA shall not be void': PASSED - 0 ms"
15.11.2017 23:43:21 - "Test Case 'Constraints' finished: PASSED"
15.11.2017 23:43:21 - "Test Suite 'Conformance class: INSPIRE GML application schemas, General requirements' finished: PASSED_MANUAL"
15.11.2017 23:43:22 - Releasing resources
15.11.2017 23:43:22 - TestRunTask initialized
15.11.2017 23:43:22 - Skipping schema validation because no schema file has been set in the test suite. Data are only checked for well-formedness.
15.11.2017 23:43:22 - Validation ended with 0 error(s)
15.11.2017 23:43:22 - Compiling test script
15.11.2017 23:43:22 - Starting XQuery tests
15.11.2017 23:43:22 - "Testing 1 features"
15.11.2017 23:43:22 - "Executing Test Suite: /home/tomcat/.etf/projects/ets-repository/data-au/au-gml/ets-au-gml-bsxets.xml"
15.11.2017 23:43:22 - "Statistics table: 1 ms"
15.11.2017 23:43:22 - "Test Suite 'Conformance class: GML application schemas, Administrative Units' started"
15.11.2017 23:43:22 - "Test Case 'Basic test' started"
15.11.2017 23:43:22 - "Test Assertion 'au-gml.a.1: Administrative Unit feature in dataset': PASSED - 0 ms"
15.11.2017 23:43:22 - "Test Case 'Basic test' finished: PASSED"
15.11.2017 23:43:22 - "Test Suite 'Conformance class: GML application schemas, Administrative Units' finished: PASSED"
15.11.2017 23:43:22 - Releasing resources
15.11.2017 23:43:22 - TestRunTask initialized
15.11.2017 23:43:22 - Skipping schema validation because no schema file has been set in the test suite. Data are only checked for well-formedness.
15.11.2017 23:43:22 - Validation ended with 0 error(s)
15.11.2017 23:43:22 - Compiling test script
15.11.2017 23:43:22 - Starting XQuery tests
15.11.2017 23:43:22 - "Testing 1 features"
15.11.2017 23:43:22 - "Executing Test Suite: /home/tomcat/.etf/projects/ets-repository/data-au/au-as/ets-au-as-bsxets.xml"
15.11.2017 23:43:22 - "Statistics table: 0 ms"
15.11.2017 23:43:22 - "Test Suite 'Conformance class: Application schema, Administrative Units' started"
15.11.2017 23:43:22 - "Test Case 'Code list values' started"
15.11.2017 23:43:22 - "Test Assertion 'au-as.a.1: nationalLevel attributes': PASSED - 27 ms"
15.11.2017 23:43:22 - "Test Case 'Code list values' finished: PASSED"
15.11.2017 23:43:22 - "Test Case 'Constraints' started"
15.11.2017 23:43:22 - "Test Assertion 'au-as.b.1: No unit at highest level can associate units at a higher level': PASSED - 0 ms"
15.11.2017 23:43:22 - "Test Assertion 'au-as.b.2: No unit at lowest level can associate units at lower level': PASSED - 0 ms"
15.11.2017 23:43:22 - "Test Assertion 'au-as.b.3: Association role condominium applies only for administrative units which nationalLevel=1st order': PASSED - 0 ms"
15.11.2017 23:43:22 - "Test Case 'Constraints' finished: PASSED"
15.11.2017 23:43:22 - "Test Suite 'Conformance class: Application schema, Administrative Units' finished: PASSED"
15.11.2017 23:43:23 - Releasing resources
15.11.2017 23:43:23 - TestRunTask initialized
15.11.2017 23:43:23 - Skipping schema validation because no schema file has been set in the test suite. Data are only checked for well-formedness.
15.11.2017 23:43:23 - Validation ended with 0 error(s)
15.11.2017 23:43:23 - Compiling test script
15.11.2017 23:43:23 - Starting XQuery tests
15.11.2017 23:43:23 - "Testing 1 features"
15.11.2017 23:43:23 - "Indexing features (parsing errors: 0): 167 ms"
15.11.2017 23:43:23 - "Executing Test Suite: /home/tomcat/.etf/projects/ets-repository/data/data-consistency/ets-data-consistency-bsxets.xml"
15.11.2017 23:43:23 - "Statistics table: 1 ms"
15.11.2017 23:43:23 - "Test Suite 'Conformance class: Data consistency, General requirements' started"
15.11.2017 23:43:23 - "Test Case 'Version consistency' started"
15.11.2017 23:43:23 - "Test Assertion 'dc.a.1: Version lifespan plausible': PASSED - 0 ms"
15.11.2017 23:43:23 - "Test Assertion 'dc.a.2: Unique identifier persistency': PASSED_MANUAL"
15.11.2017 23:43:23 - "Test Assertion 'dc.a.3: Spatial object type stable': PASSED_MANUAL"
15.11.2017 23:43:23 - "Test Case 'Version consistency' finished: PASSED_MANUAL"
15.11.2017 23:43:23 - "Test Case 'Temporal consistency' started"
15.11.2017 23:43:23 - "Test Assertion 'dc.b.1: Valid time plausible': PASSED - 0 ms"
15.11.2017 23:43:23 - "Test Case 'Temporal consistency' finished: PASSED"
15.11.2017 23:43:23 - "Test Suite 'Conformance class: Data consistency, General requirements' finished: PASSED_MANUAL"
15.11.2017 23:43:23 - Releasing resources
15.11.2017 23:43:23 - TestRunTask initialized
15.11.2017 23:43:23 - Skipping schema validation because no schema file has been set in the test suite. Data are only checked for well-formedness.
15.11.2017 23:43:23 - Validation ended with 0 error(s)
15.11.2017 23:43:23 - Compiling test script
15.11.2017 23:43:23 - Starting XQuery tests
15.11.2017 23:43:23 - "Testing 1 features"
15.11.2017 23:43:23 - "Indexing features (parsing errors: 0): 154 ms"
15.11.2017 23:43:23 - "Executing Test Suite: /home/tomcat/.etf/projects/ets-repository/data-au/au-dc/ets-au-dc-bsxets.xml"
15.11.2017 23:43:23 - "Statistics table: 1 ms"
15.11.2017 23:43:23 - "Test Suite 'Conformance class: Data consistency, Administrative Units' started"
15.11.2017 23:43:23 - "Test Case 'Higher Hierarchy Consistency' started"
15.11.2017 23:43:23 - "Test Assertion 'au-dc.a.1: Each administrative unit refers to exactly one administrative unit at a higher level except those corresponding to the country level unit representing a Member State or being a co-administered unit.': PASSED - 0 ms"
15.11.2017 23:43:23 - "Test Case 'Higher Hierarchy Consistency' finished: PASSED"
15.11.2017 23:43:23 - "Test Case 'Lower Hierarchy Consistency' started"
15.11.2017 23:43:23 - "Test Assertion 'au-dc.b.1: Each administrative unit refers to a lower level administrative unit, except those corresponding to the lowest level of the administrative hierarchy.': PASSED - 0 ms"
15.11.2017 23:43:23 - "Test Assertion 'au-dc.b.2: Each administrative unit refers to lower level administrative units on the next level, except those corresponding to the lowest level of the administrative hierarchy.': PASSED - 1 ms"
15.11.2017 23:43:23 - "Test Case 'Lower Hierarchy Consistency' finished: PASSED"
15.11.2017 23:43:23 - "Test Case 'Co-administered' started"
15.11.2017 23:43:23 - "Test Assertion 'au-dc.c.1: Each administrative unit co-administered by two or more administrative units uses the association role administeredBy, and the units co-administering this unit use the inverse role coAdminister.': PASSED - 1 ms"
15.11.2017 23:43:23 - "Test Case 'Co-administered' finished: PASSED"
15.11.2017 23:43:23 - "Test Case 'Condominium administration' started"
15.11.2017 23:43:23 - "Test Assertion 'au-dc.d.1: Each condominium is only administered by administrative units at country level.': PASSED - 0 ms"
15.11.2017 23:43:23 - "Test Case 'Condominium administration' finished: PASSED"
15.11.2017 23:43:23 - "Test Case 'Area' started"
15.11.2017 23:43:24 - "Test Assertion 'au-dc.e.1: Administrative units having the same level of administrative hierarchy do not conceptually share common areas.': PASSED - 111 ms"
15.11.2017 23:43:24 - "Test Case 'Area' finished: PASSED"
15.11.2017 23:43:24 - "Test Case 'Boundary' started"
15.11.2017 23:43:24 - "Test Assertion 'au-dc.f.1: The geometry of each instance administrative boundary corresponds to an edge in the topological structure formed by the complete boundary graph, including the boundaries of all levels.': PASSED - 0 ms"
15.11.2017 23:43:24 - "Test Case 'Boundary' finished: PASSED"
15.11.2017 23:43:24 - "Test Case 'Condominium spatial extent' started"
15.11.2017 23:43:24 - "Test Assertion 'au-dc.g.1: The spatial extent of a condominium is not part of the geometry representing the spatial extent of an administrative unit.': PASSED - 0 ms"
15.11.2017 23:43:24 - "Test Case 'Condominium spatial extent' finished: PASSED"
15.11.2017 23:43:24 - "Test Suite 'Conformance class: Data consistency, Administrative Units' finished: PASSED"
15.11.2017 23:43:24 - Releasing resources
15.11.2017 23:43:24 - TestRunTask initialized
15.11.2017 23:43:24 - Skipping schema validation because no schema file has been set in the test suite. Data are only checked for well-formedness.
15.11.2017 23:43:24 - Validation ended with 0 error(s)
15.11.2017 23:43:24 - Compiling test script
15.11.2017 23:43:24 - Starting XQuery tests
15.11.2017 23:43:24 - "Testing 1 features"
15.11.2017 23:43:24 - "Indexing features (parsing errors: 0): 159 ms"
15.11.2017 23:43:24 - "Executing Test Suite: /home/tomcat/.etf/projects/ets-repository/data/information-accessibility/ets-information-accessibility-bsxets.xml"
15.11.2017 23:43:24 - "Statistics table: 1 ms"
15.11.2017 23:43:24 - "Test Suite 'Conformance class: Information accessibility, General requirements' started"
15.11.2017 23:43:24 - "Test Case 'Coordinate reference systems (CRS)' started"
15.11.2017 23:43:24 - "Test Assertion 'ia.a.1: CRS publicly accessible via HTTP': FAILED - 1 ms"
15.11.2017 23:43:24 - "Test Case 'Coordinate reference systems (CRS)' finished: FAILED"
15.11.2017 23:43:24 - "Test Suite 'Conformance class: Information accessibility, General requirements' finished: FAILED"
15.11.2017 23:43:25 - Releasing resources
15.11.2017 23:43:25 - TestRunTask initialized
15.11.2017 23:43:25 - Skipping schema validation because no schema file has been set in the test suite. Data are only checked for well-formedness.
15.11.2017 23:43:25 - Validation ended with 0 error(s)
15.11.2017 23:43:25 - Compiling test script
15.11.2017 23:43:25 - Starting XQuery tests
15.11.2017 23:43:25 - "Testing 1 features"
15.11.2017 23:43:25 - "Executing Test Suite: /home/tomcat/.etf/projects/ets-repository/data-au/au-ia/ets-au-ia-bsxets.xml"
15.11.2017 23:43:25 - "Statistics table: 1 ms"
15.11.2017 23:43:25 - "Test Suite 'Conformance class: Information accessibility, Administrative Units' started"
15.11.2017 23:43:25 - "Test Case 'Code lists' started"
15.11.2017 23:43:25 - "Test Assertion 'au-ia.a.1: Code list extensions accessible': PASSED - 0 ms"
15.11.2017 23:43:25 - "Test Case 'Code lists' finished: PASSED"
15.11.2017 23:43:25 - "Test Case 'Feature references' started"
15.11.2017 23:43:25 - "Test Assertion 'au-ia.b.1: AdministrativeUnit.NUTS': PASSED - 1 ms"
15.11.2017 23:43:25 - "Test Assertion 'au-ia.b.2: AdministrativeUnit.Condominium': PASSED - 0 ms"
15.11.2017 23:43:25 - "Checking URL: 'https://test-zbgisws.skgeodesy.sk/inspire_administrative_units_wfs/service.svc/get?SERVICE=WFS&amp;VERSION=2.0.0&amp;REQUEST=GetFeature&amp;STOREDQUERY_ID=urn:ogc:def:query:OGC-WFS::GetFeatureById&amp;id=auAdmUnitS.14673'"
15.11.2017 23:43:55 - "Exception: Timeout exceeded. URL: https://test-zbgisws.skgeodesy.sk/inspire_administrative_units_wfs/service.svc/get?SERVICE=WFS&amp;VERSION=2.0.0&amp;REQUEST=GetFeature&amp;STOREDQUERY_ID=urn:ogc:def:query:OGC-WFS::GetFeatureById&amp;id=auAdmUnitS.14673"
15.11.2017 23:43:55 - "Test Assertion 'au-ia.b.3: AdministrativeUnit.upperLevelUnit': FAILED - 30108 ms"
15.11.2017 23:43:55 - "Checking URL: 'https://test-zbgisws.skgeodesy.sk/inspire_administrative_units_wfs/service.svc/get?SERVICE=WFS&amp;VERSION=2.0.0&amp;REQUEST=GetFeature&amp;STOREDQUERY_ID=urn:ogc:def:query:OGC-WFS::GetFeatureById&amp;id=auAdmUnitS.14678'"
15.11.2017 23:44:25 - "Exception: Timeout exceeded. URL: https://test-zbgisws.skgeodesy.sk/inspire_administrative_units_wfs/service.svc/get?SERVICE=WFS&amp;VERSION=2.0.0&amp;REQUEST=GetFeature&amp;STOREDQUERY_ID=urn:ogc:def:query:OGC-WFS::GetFeatureById&amp;id=auAdmUnitS.14678"
15.11.2017 23:44:25 - "Checking URL: 'https://test-zbgisws.skgeodesy.sk/inspire_administrative_units_wfs/service.svc/get?SERVICE=WFS&amp;VERSION=2.0.0&amp;REQUEST=GetFeature&amp;STOREDQUERY_ID=urn:ogc:def:query:OGC-WFS::GetFeatureById&amp;id=auAdmUnitS.14679'"
15.11.2017 23:44:55 - "Exception: Timeout exceeded. URL: https://test-zbgisws.skgeodesy.sk/inspire_administrative_units_wfs/service.svc/get?SERVICE=WFS&amp;VERSION=2.0.0&amp;REQUEST=GetFeature&amp;STOREDQUERY_ID=urn:ogc:def:query:OGC-WFS::GetFeatureById&amp;id=auAdmUnitS.14679"
15.11.2017 23:44:55 - "Checking URL: 'https://test-zbgisws.skgeodesy.sk/inspire_administrative_units_wfs/service.svc/get?SERVICE=WFS&amp;VERSION=2.0.0&amp;REQUEST=GetFeature&amp;STOREDQUERY_ID=urn:ogc:def:query:OGC-WFS::GetFeatureById&amp;id=auAdmUnitS.14680'"
15.11.2017 23:45:25 - "Exception: Timeout exceeded. URL: https://test-zbgisws.skgeodesy.sk/inspire_administrative_units_wfs/service.svc/get?SERVICE=WFS&amp;VERSION=2.0.0&amp;REQUEST=GetFeature&amp;STOREDQUERY_ID=urn:ogc:def:query:OGC-WFS::GetFeatureById&amp;id=auAdmUnitS.14680"
15.11.2017 23:45:25 - "Checking URL: 'https://test-zbgisws.skgeodesy.sk/inspire_administrative_units_wfs/service.svc/get?SERVICE=WFS&amp;VERSION=2.0.0&amp;REQUEST=GetFeature&amp;STOREDQUERY_ID=urn:ogc:def:query:OGC-WFS::GetFeatureById&amp;id=auAdmUnitS.14681'"
15.11.2017 23:45:55 - "Exception: Timeout exceeded. URL: https://test-zbgisws.skgeodesy.sk/inspire_administrative_units_wfs/service.svc/get?SERVICE=WFS&amp;VERSION=2.0.0&amp;REQUEST=GetFeature&amp;STOREDQUERY_ID=urn:ogc:def:query:OGC-WFS::GetFeatureById&amp;id=auAdmUnitS.14681"
15.11.2017 23:45:55 - "Checking URL: 'https://test-zbgisws.skgeodesy.sk/inspire_administrative_units_wfs/service.svc/get?SERVICE=WFS&amp;VERSION=2.0.0&amp;REQUEST=GetFeature&amp;STOREDQUERY_ID=urn:ogc:def:query:OGC-WFS::GetFeatureById&amp;id=auAdmUnitS.14682'"
15.11.2017 23:46:25 - "Exception: Timeout exceeded. URL: https://test-zbgisws.skgeodesy.sk/inspire_administrative_units_wfs/service.svc/get?SERVICE=WFS&amp;VERSION=2.0.0&amp;REQUEST=GetFeature&amp;STOREDQUERY_ID=urn:ogc:def:query:OGC-WFS::GetFeatureById&amp;id=auAdmUnitS.14682"
15.11.2017 23:46:25 - "Test Assertion 'au-ia.b.4: AdministrativeUnit.lowerLevelUnit': FAILED - 150640 ms"
15.11.2017 23:46:25 - "Test Assertion 'au-ia.b.5: AdministrativeUnit.administeredBy': PASSED - 1 ms"
15.11.2017 23:46:25 - "Test Assertion 'au-ia.b.6: AdministrativeUnit.coAdminister': PASSED - 0 ms"
15.11.2017 23:46:25 - "Checking URL: 'https://test-zbgisws.skgeodesy.sk/inspire_administrative_units_wfs/service.svc/get?SERVICE=WFS&amp;VERSION=2.0.0&amp;REQUEST=GetFeature&amp;STOREDQUERY_ID=urn:ogc:def:query:OGC-WFS::GetFeatureById&amp;id=auAdmBoundaryL.765'"
15.11.2017 23:46:56 - "Exception: Timeout exceeded. URL: https://test-zbgisws.skgeodesy.sk/inspire_administrative_units_wfs/service.svc/get?SERVICE=WFS&amp;VERSION=2.0.0&amp;REQUEST=GetFeature&amp;STOREDQUERY_ID=urn:ogc:def:query:OGC-WFS::GetFeatureById&amp;id=auAdmBoundaryL.765"
15.11.2017 23:46:56 - "Checking URL: 'https://test-zbgisws.skgeodesy.sk/inspire_administrative_units_wfs/service.svc/get?SERVICE=WFS&amp;VERSION=2.0.0&amp;REQUEST=GetFeature&amp;STOREDQUERY_ID=urn:ogc:def:query:OGC-WFS::GetFeatureById&amp;id=auAdmBoundaryL.796'"
15.11.2017 23:47:26 - "Exception: Timeout exceeded. URL: https://test-zbgisws.skgeodesy.sk/inspire_administrative_units_wfs/service.svc/get?SERVICE=WFS&amp;VERSION=2.0.0&amp;REQUEST=GetFeature&amp;STOREDQUERY_ID=urn:ogc:def:query:OGC-WFS::GetFeatureById&amp;id=auAdmBoundaryL.796"
15.11.2017 23:47:26 - "Checking URL: 'https://test-zbgisws.skgeodesy.sk/inspire_administrative_units_wfs/service.svc/get?SERVICE=WFS&amp;VERSION=2.0.0&amp;REQUEST=GetFeature&amp;STOREDQUERY_ID=urn:ogc:def:query:OGC-WFS::GetFeatureById&amp;id=auAdmBoundaryL.843'"
15.11.2017 23:47:56 - "Exception: Timeout exceeded. URL: https://test-zbgisws.skgeodesy.sk/inspire_administrative_units_wfs/service.svc/get?SERVICE=WFS&amp;VERSION=2.0.0&amp;REQUEST=GetFeature&amp;STOREDQUERY_ID=urn:ogc:def:query:OGC-WFS::GetFeatureById&amp;id=auAdmBoundaryL.843"
15.11.2017 23:47:56 - "Checking URL: 'https://test-zbgisws.skgeodesy.sk/inspire_administrative_units_wfs/service.svc/get?SERVICE=WFS&amp;VERSION=2.0.0&amp;REQUEST=GetFeature&amp;STOREDQUERY_ID=urn:ogc:def:query:OGC-WFS::GetFeatureById&amp;id=auAdmBoundaryL.919'"
15.11.2017 23:48:26 - "Exception: Timeout exceeded. URL: https://test-zbgisws.skgeodesy.sk/inspire_administrative_units_wfs/service.svc/get?SERVICE=WFS&amp;VERSION=2.0.0&amp;REQUEST=GetFeature&amp;STOREDQUERY_ID=urn:ogc:def:query:OGC-WFS::GetFeatureById&amp;id=auAdmBoundaryL.919"
15.11.2017 23:48:26 - "Checking URL: 'https://test-zbgisws.skgeodesy.sk/inspire_administrative_units_wfs/service.svc/get?SERVICE=WFS&amp;VERSION=2.0.0&amp;REQUEST=GetFeature&amp;STOREDQUERY_ID=urn:ogc:def:query:OGC-WFS::GetFeatureById&amp;id=auAdmBoundaryL.928'"
15.11.2017 23:48:56 - "Exception: Timeout exceeded. URL: https://test-zbgisws.skgeodesy.sk/inspire_administrative_units_wfs/service.svc/get?SERVICE=WFS&amp;VERSION=2.0.0&amp;REQUEST=GetFeature&amp;STOREDQUERY_ID=urn:ogc:def:query:OGC-WFS::GetFeatureById&amp;id=auAdmBoundaryL.928"
15.11.2017 23:48:56 - "Checking URL: 'https://test-zbgisws.skgeodesy.sk/inspire_administrative_units_wfs/service.svc/get?SERVICE=WFS&amp;VERSION=2.0.0&amp;REQUEST=GetFeature&amp;STOREDQUERY_ID=urn:ogc:def:query:OGC-WFS::GetFeatureById&amp;id=auAdmBoundaryL.1017'"
15.11.2017 23:49:26 - "Exception: Timeout exceeded. URL: https://test-zbgisws.skgeodesy.sk/inspire_administrative_units_wfs/service.svc/get?SERVICE=WFS&amp;VERSION=2.0.0&amp;REQUEST=GetFeature&amp;STOREDQUERY_ID=urn:ogc:def:query:OGC-WFS::GetFeatureById&amp;id=auAdmBoundaryL.1017"
15.11.2017 23:49:26 - "Checking URL: 'https://test-zbgisws.skgeodesy.sk/inspire_administrative_units_wfs/service.svc/get?SERVICE=WFS&amp;VERSION=2.0.0&amp;REQUEST=GetFeature&amp;STOREDQUERY_ID=urn:ogc:def:query:OGC-WFS::GetFeatureById&amp;id=auAdmBoundaryL.1165'"
15.11.2017 23:49:56 - "Exception: Timeout exceeded. URL: https://test-zbgisws.skgeodesy.sk/inspire_administrative_units_wfs/service.svc/get?SERVICE=WFS&amp;VERSION=2.0.0&amp;REQUEST=GetFeature&amp;STOREDQUERY_ID=urn:ogc:def:query:OGC-WFS::GetFeatureById&amp;id=auAdmBoundaryL.1165"
15.11.2017 23:49:56 - "Checking URL: 'https://test-zbgisws.skgeodesy.sk/inspire_administrative_units_wfs/service.svc/get?SERVICE=WFS&amp;VERSION=2.0.0&amp;REQUEST=GetFeature&amp;STOREDQUERY_ID=urn:ogc:def:query:OGC-WFS::GetFeatureById&amp;id=auAdmBoundaryL.1249'"
15.11.2017 23:50:26 - "Exception: Timeout exceeded. URL: https://test-zbgisws.skgeodesy.sk/inspire_administrative_units_wfs/service.svc/get?SERVICE=WFS&amp;VERSION=2.0.0&amp;REQUEST=GetFeature&amp;STOREDQUERY_ID=urn:ogc:def:query:OGC-WFS::GetFeatureById&amp;id=auAdmBoundaryL.1249"
15.11.2017 23:50:26 - "Checking URL: 'https://test-zbgisws.skgeodesy.sk/inspire_administrative_units_wfs/service.svc/get?SERVICE=WFS&amp;VERSION=2.0.0&amp;REQUEST=GetFeature&amp;STOREDQUERY_ID=urn:ogc:def:query:OGC-WFS::GetFeatureById&amp;id=auAdmBoundaryL.1367'"
15.11.2017 23:50:56 - "Exception: Timeout exceeded. URL: https://test-zbgisws.skgeodesy.sk/inspire_administrative_units_wfs/service.svc/get?SERVICE=WFS&amp;VERSION=2.0.0&amp;REQUEST=GetFeature&amp;STOREDQUERY_ID=urn:ogc:def:query:OGC-WFS::GetFeatureById&amp;id=auAdmBoundaryL.1367"
15.11.2017 23:50:56 - "Checking URL: 'https://test-zbgisws.skgeodesy.sk/inspire_administrative_units_wfs/service.svc/get?SERVICE=WFS&amp;VERSION=2.0.0&amp;REQUEST=GetFeature&amp;STOREDQUERY_ID=urn:ogc:def:query:OGC-WFS::GetFeatureById&amp;id=auAdmBoundaryL.1404'"
15.11.2017 23:51:27 - "Exception: Timeout exceeded. URL: https://test-zbgisws.skgeodesy.sk/inspire_administrative_units_wfs/service.svc/get?SERVICE=WFS&amp;VERSION=2.0.0&amp;REQUEST=GetFeature&amp;STOREDQUERY_ID=urn:ogc:def:query:OGC-WFS::GetFeatureById&amp;id=auAdmBoundaryL.1404"
15.11.2017 23:51:27 - "Checking URL: 'https://test-zbgisws.skgeodesy.sk/inspire_administrative_units_wfs/service.svc/get?SERVICE=WFS&amp;VERSION=2.0.0&amp;REQUEST=GetFeature&amp;STOREDQUERY_ID=urn:ogc:def:query:OGC-WFS::GetFeatureById&amp;id=auAdmBoundaryL.1490'"
15.11.2017 23:51:57 - "Exception: Timeout exceeded. URL: https://test-zbgisws.skgeodesy.sk/inspire_administrative_units_wfs/service.svc/get?SERVICE=WFS&amp;VERSION=2.0.0&amp;REQUEST=GetFeature&amp;STOREDQUERY_ID=urn:ogc:def:query:OGC-WFS::GetFeatureById&amp;id=auAdmBoundaryL.1490"
15.11.2017 23:51:57 - "Checking URL: 'https://test-zbgisws.skgeodesy.sk/inspire_administrative_units_wfs/service.svc/get?SERVICE=WFS&amp;VERSION=2.0.0&amp;REQUEST=GetFeature&amp;STOREDQUERY_ID=urn:ogc:def:query:OGC-WFS::GetFeatureById&amp;id=auAdmBoundaryL.1510'"
15.11.2017 23:52:27 - "Exception: Timeout exceeded. URL: https://test-zbgisws.skgeodesy.sk/inspire_administrative_units_wfs/service.svc/get?SERVICE=WFS&amp;VERSION=2.0.0&amp;REQUEST=GetFeature&amp;STOREDQUERY_ID=urn:ogc:def:query:OGC-WFS::GetFeatureById&amp;id=auAdmBoundaryL.1510"
15.11.2017 23:52:27 - "Checking URL: 'https://test-zbgisws.skgeodesy.sk/inspire_administrative_units_wfs/service.svc/get?SERVICE=WFS&amp;VERSION=2.0.0&amp;REQUEST=GetFeature&amp;STOREDQUERY_ID=urn:ogc:def:query:OGC-WFS::GetFeatureById&amp;id=auAdmBoundaryL.1584'"
15.11.2017 23:52:57 - "Exception: Timeout exceeded. URL: https://test-zbgisws.skgeodesy.sk/inspire_administrative_units_wfs/service.svc/get?SERVICE=WFS&amp;VERSION=2.0.0&amp;REQUEST=GetFeature&amp;STOREDQUERY_ID=urn:ogc:def:query:OGC-WFS::GetFeatureById&amp;id=auAdmBoundaryL.1584"
15.11.2017 23:52:57 - "Checking URL: 'https://test-zbgisws.skgeodesy.sk/inspire_administrative_units_wfs/service.svc/get?SERVICE=WFS&amp;VERSION=2.0.0&amp;REQUEST=GetFeature&amp;STOREDQUERY_ID=urn:ogc:def:query:OGC-WFS::GetFeatureById&amp;id=auAdmBoundaryL.1694'"
15.11.2017 23:53:27 - "Exception: Timeout exceeded. URL: https://test-zbgisws.skgeodesy.sk/inspire_administrative_units_wfs/service.svc/get?SERVICE=WFS&amp;VERSION=2.0.0&amp;REQUEST=GetFeature&amp;STOREDQUERY_ID=urn:ogc:def:query:OGC-WFS::GetFeatureById&amp;id=auAdmBoundaryL.1694"
15.11.2017 23:53:27 - "Checking URL: 'https://test-zbgisws.skgeodesy.sk/inspire_administrative_units_wfs/service.svc/get?SERVICE=WFS&amp;VERSION=2.0.0&amp;REQUEST=GetFeature&amp;STOREDQUERY_ID=urn:ogc:def:query:OGC-WFS::GetFeatureById&amp;id=auAdmBoundaryL.1747'"
15.11.2017 23:53:57 - "Exception: Timeout exceeded. URL: https://test-zbgisws.skgeodesy.sk/inspire_administrative_units_wfs/service.svc/get?SERVICE=WFS&amp;VERSION=2.0.0&amp;REQUEST=GetFeature&amp;STOREDQUERY_ID=urn:ogc:def:query:OGC-WFS::GetFeatureById&amp;id=auAdmBoundaryL.1747"
15.11.2017 23:53:57 - "Checking URL: 'https://test-zbgisws.skgeodesy.sk/inspire_administrative_units_wfs/service.svc/get?SERVICE=WFS&amp;VERSION=2.0.0&amp;REQUEST=GetFeature&amp;STOREDQUERY_ID=urn:ogc:def:query:OGC-WFS::GetFeatureById&amp;id=auAdmBoundaryL.1784'"
15.11.2017 23:54:27 - "Exception: Timeout exceeded. URL: https://test-zbgisws.skgeodesy.sk/inspire_administrative_units_wfs/service.svc/get?SERVICE=WFS&amp;VERSION=2.0.0&amp;REQUEST=GetFeature&amp;STOREDQUERY_ID=urn:ogc:def:query:OGC-WFS::GetFeatureById&amp;id=auAdmBoundaryL.1784"
15.11.2017 23:54:27 - "Checking URL: 'https://test-zbgisws.skgeodesy.sk/inspire_administrative_units_wfs/service.svc/get?SERVICE=WFS&amp;VERSION=2.0.0&amp;REQUEST=GetFeature&amp;STOREDQUERY_ID=urn:ogc:def:query:OGC-WFS::GetFeatureById&amp;id=auAdmBoundaryL.1788'"
15.11.2017 23:54:57 - "Exception: Timeout exceeded. URL: https://test-zbgisws.skgeodesy.sk/inspire_administrative_units_wfs/service.svc/get?SERVICE=WFS&amp;VERSION=2.0.0&amp;REQUEST=GetFeature&amp;STOREDQUERY_ID=urn:ogc:def:query:OGC-WFS::GetFeatureById&amp;id=auAdmBoundaryL.1788"
15.11.2017 23:54:57 - "Checking URL: 'https://test-zbgisws.skgeodesy.sk/inspire_administrative_units_wfs/service.svc/get?SERVICE=WFS&amp;VERSION=2.0.0&amp;REQUEST=GetFeature&amp;STOREDQUERY_ID=urn:ogc:def:query:OGC-WFS::GetFeatureById&amp;id=auAdmBoundaryL.1800'"
15.11.2017 23:55:27 - "Exception: Timeout exceeded. URL: https://test-zbgisws.skgeodesy.sk/inspire_administrative_units_wfs/service.svc/get?SERVICE=WFS&amp;VERSION=2.0.0&amp;REQUEST=GetFeature&amp;STOREDQUERY_ID=urn:ogc:def:query:OGC-WFS::GetFeatureById&amp;id=auAdmBoundaryL.1800"
15.11.2017 23:55:27 - "Checking URL: 'https://test-zbgisws.skgeodesy.sk/inspire_administrative_units_wfs/service.svc/get?SERVICE=WFS&amp;VERSION=2.0.0&amp;REQUEST=GetFeature&amp;STOREDQUERY_ID=urn:ogc:def:query:OGC-WFS::GetFeatureById&amp;id=auAdmBoundaryL.1847'"
15.11.2017 23:55:58 - "Exception: Timeout exceeded. URL: https://test-zbgisws.skgeodesy.sk/inspire_administrative_units_wfs/service.svc/get?SERVICE=WFS&amp;VERSION=2.0.0&amp;REQUEST=GetFeature&amp;STOREDQUERY_ID=urn:ogc:def:query:OGC-WFS::GetFeatureById&amp;id=auAdmBoundaryL.1847"
15.11.2017 23:55:58 - "Checking URL: 'https://test-zbgisws.skgeodesy.sk/inspire_administrative_units_wfs/service.svc/get?SERVICE=WFS&amp;VERSION=2.0.0&amp;REQUEST=GetFeature&amp;STOREDQUERY_ID=urn:ogc:def:query:OGC-WFS::GetFeatureById&amp;id=auAdmBoundaryL.1859'"
15.11.2017 23:56:28 - "Exception: Timeout exceeded. URL: https://test-zbgisws.skgeodesy.sk/inspire_administrative_units_wfs/service.svc/get?SERVICE=WFS&amp;VERSION=2.0.0&amp;REQUEST=GetFeature&amp;STOREDQUERY_ID=urn:ogc:def:query:OGC-WFS::GetFeatureById&amp;id=auAdmBoundaryL.1859"
15.11.2017 23:56:28 - "Checking URL: 'https://test-zbgisws.skgeodesy.sk/inspire_administrative_units_wfs/service.svc/get?SERVICE=WFS&amp;VERSION=2.0.0&amp;REQUEST=GetFeature&amp;STOREDQUERY_ID=urn:ogc:def:query:OGC-WFS::GetFeatureById&amp;id=auAdmBoundaryL.1862'"
15.11.2017 23:56:58 - "Exception: Timeout exceeded. URL: https://test-zbgisws.skgeodesy.sk/inspire_administrative_units_wfs/service.svc/get?SERVICE=WFS&amp;VERSION=2.0.0&amp;REQUEST=GetFeature&amp;STOREDQUERY_ID=urn:ogc:def:query:OGC-WFS::GetFeatureById&amp;id=auAdmBoundaryL.1862"
15.11.2017 23:56:58 - "Checking URL: 'https://test-zbgisws.skgeodesy.sk/inspire_administrative_units_wfs/service.svc/get?SERVICE=WFS&amp;VERSION=2.0.0&amp;REQUEST=GetFeature&amp;STOREDQUERY_ID=urn:ogc:def:query:OGC-WFS::GetFeatureById&amp;id=auAdmBoundaryL.1864'"
15.11.2017 23:57:28 - "Exception: Timeout exceeded. URL: https://test-zbgisws.skgeodesy.sk/inspire_administrative_units_wfs/service.svc/get?SERVICE=WFS&amp;VERSION=2.0.0&amp;REQUEST=GetFeature&amp;STOREDQUERY_ID=urn:ogc:def:query:OGC-WFS::GetFeatureById&amp;id=auAdmBoundaryL.1864"
15.11.2017 23:57:28 - "Checking URL: 'https://test-zbgisws.skgeodesy.sk/inspire_administrative_units_wfs/service.svc/get?SERVICE=WFS&amp;VERSION=2.0.0&amp;REQUEST=GetFeature&amp;STOREDQUERY_ID=urn:ogc:def:query:OGC-WFS::GetFeatureById&amp;id=auAdmBoundaryL.1866'"
15.11.2017 23:57:58 - "Exception: Timeout exceeded. URL: https://test-zbgisws.skgeodesy.sk/inspire_administrative_units_wfs/service.svc/get?SERVICE=WFS&amp;VERSION=2.0.0&amp;REQUEST=GetFeature&amp;STOREDQUERY_ID=urn:ogc:def:query:OGC-WFS::GetFeatureById&amp;id=auAdmBoundaryL.1866"
15.11.2017 23:57:58 - "Checking URL: 'https://test-zbgisws.skgeodesy.sk/inspire_administrative_units_wfs/service.svc/get?SERVICE=WFS&amp;VERSION=2.0.0&amp;REQUEST=GetFeature&amp;STOREDQUERY_ID=urn:ogc:def:query:OGC-WFS::GetFeatureById&amp;id=auAdmBoundaryL.1886'"
15.11.2017 23:58:28 - "Exception: Timeout exceeded. URL: https://test-zbgisws.skgeodesy.sk/inspire_administrative_units_wfs/service.svc/get?SERVICE=WFS&amp;VERSION=2.0.0&amp;REQUEST=GetFeature&amp;STOREDQUERY_ID=urn:ogc:def:query:OGC-WFS::GetFeatureById&amp;id=auAdmBoundaryL.1886"
15.11.2017 23:58:28 - "Checking URL: 'https://test-zbgisws.skgeodesy.sk/inspire_administrative_units_wfs/service.svc/get?SERVICE=WFS&amp;VERSION=2.0.0&amp;REQUEST=GetFeature&amp;STOREDQUERY_ID=urn:ogc:def:query:OGC-WFS::GetFeatureById&amp;id=auAdmBoundaryL.1890'"
15.11.2017 23:58:58 - "Exception: Timeout exceeded. URL: https://test-zbgisws.skgeodesy.sk/inspire_administrative_units_wfs/service.svc/get?SERVICE=WFS&amp;VERSION=2.0.0&amp;REQUEST=GetFeature&amp;STOREDQUERY_ID=urn:ogc:def:query:OGC-WFS::GetFeatureById&amp;id=auAdmBoundaryL.1890"
15.11.2017 23:58:58 - "Checking URL: 'https://test-zbgisws.skgeodesy.sk/inspire_administrative_units_wfs/service.svc/get?SERVICE=WFS&amp;VERSION=2.0.0&amp;REQUEST=GetFeature&amp;STOREDQUERY_ID=urn:ogc:def:query:OGC-WFS::GetFeatureById&amp;id=auAdmBoundaryL.1907'"
15.11.2017 23:59:29 - "Exception: Timeout exceeded. URL: https://test-zbgisws.skgeodesy.sk/inspire_administrative_units_wfs/service.svc/get?SERVICE=WFS&amp;VERSION=2.0.0&amp;REQUEST=GetFeature&amp;STOREDQUERY_ID=urn:ogc:def:query:OGC-WFS::GetFeatureById&amp;id=auAdmBoundaryL.1907"
15.11.2017 23:59:29 - "Checking URL: 'https://test-zbgisws.skgeodesy.sk/inspire_administrative_units_wfs/service.svc/get?SERVICE=WFS&amp;VERSION=2.0.0&amp;REQUEST=GetFeature&amp;STOREDQUERY_ID=urn:ogc:def:query:OGC-WFS::GetFeatureById&amp;id=auAdmBoundaryL.1908'"
15.11.2017 23:59:59 - "Exception: Timeout exceeded. URL: https://test-zbgisws.skgeodesy.sk/inspire_administrative_units_wfs/service.svc/get?SERVICE=WFS&amp;VERSION=2.0.0&amp;REQUEST=GetFeature&amp;STOREDQUERY_ID=urn:ogc:def:query:OGC-WFS::GetFeatureById&amp;id=auAdmBoundaryL.1908"
15.11.2017 23:59:59 - "Checking URL: 'https://test-zbgisws.skgeodesy.sk/inspire_administrative_units_wfs/service.svc/get?SERVICE=WFS&amp;VERSION=2.0.0&amp;REQUEST=GetFeature&amp;STOREDQUERY_ID=urn:ogc:def:query:OGC-WFS::GetFeatureById&amp;id=auAdmBoundaryL.1909'"
16.11.2017 00:00:29 - "Exception: Timeout exceeded. URL: https://test-zbgisws.skgeodesy.sk/inspire_administrative_units_wfs/service.svc/get?SERVICE=WFS&amp;VERSION=2.0.0&amp;REQUEST=GetFeature&amp;STOREDQUERY_ID=urn:ogc:def:query:OGC-WFS::GetFeatureById&amp;id=auAdmBoundaryL.1909"
16.11.2017 00:00:29 - "Checking URL: 'https://test-zbgisws.skgeodesy.sk/inspire_administrative_units_wfs/service.svc/get?SERVICE=WFS&amp;VERSION=2.0.0&amp;REQUEST=GetFeature&amp;STOREDQUERY_ID=urn:ogc:def:query:OGC-WFS::GetFeatureById&amp;id=auAdmBoundaryL.1927'"
16.11.2017 00:00:59 - "Exception: Timeout exceeded. URL: https://test-zbgisws.skgeodesy.sk/inspire_administrative_units_wfs/service.svc/get?SERVICE=WFS&amp;VERSION=2.0.0&amp;REQUEST=GetFeature&amp;STOREDQUERY_ID=urn:ogc:def:query:OGC-WFS::GetFeatureById&amp;id=auAdmBoundaryL.1927"
16.11.2017 00:00:59 - "Checking URL: 'https://test-zbgisws.skgeodesy.sk/inspire_administrative_units_wfs/service.svc/get?SERVICE=WFS&amp;VERSION=2.0.0&amp;REQUEST=GetFeature&amp;STOREDQUERY_ID=urn:ogc:def:query:OGC-WFS::GetFeatureById&amp;id=auAdmBoundaryL.1935'"
16.11.2017 00:01:29 - "Exception: Timeout exceeded. URL: https://test-zbgisws.skgeodesy.sk/inspire_administrative_units_wfs/service.svc/get?SERVICE=WFS&amp;VERSION=2.0.0&amp;REQUEST=GetFeature&amp;STOREDQUERY_ID=urn:ogc:def:query:OGC-WFS::GetFeatureById&amp;id=auAdmBoundaryL.1935"
16.11.2017 00:01:29 - "Checking URL: 'https://test-zbgisws.skgeodesy.sk/inspire_administrative_units_wfs/service.svc/get?SERVICE=WFS&amp;VERSION=2.0.0&amp;REQUEST=GetFeature&amp;STOREDQUERY_ID=urn:ogc:def:query:OGC-WFS::GetFeatureById&amp;id=auAdmBoundaryL.1941'"
16.11.2017 00:01:59 - "Exception: Timeout exceeded. URL: https://test-zbgisws.skgeodesy.sk/inspire_administrative_units_wfs/service.svc/get?SERVICE=WFS&amp;VERSION=2.0.0&amp;REQUEST=GetFeature&amp;STOREDQUERY_ID=urn:ogc:def:query:OGC-WFS::GetFeatureById&amp;id=auAdmBoundaryL.1941"
16.11.2017 00:01:59 - "Checking URL: 'https://test-zbgisws.skgeodesy.sk/inspire_administrative_units_wfs/service.svc/get?SERVICE=WFS&amp;VERSION=2.0.0&amp;REQUEST=GetFeature&amp;STOREDQUERY_ID=urn:ogc:def:query:OGC-WFS::GetFeatureById&amp;id=auAdmBoundaryL.1949'"
16.11.2017 00:02:29 - "Exception: Timeout exceeded. URL: https://test-zbgisws.skgeodesy.sk/inspire_administrative_units_wfs/service.svc/get?SERVICE=WFS&amp;VERSION=2.0.0&amp;REQUEST=GetFeature&amp;STOREDQUERY_ID=urn:ogc:def:query:OGC-WFS::GetFeatureById&amp;id=auAdmBoundaryL.1949"
16.11.2017 00:02:29 - "Checking URL: 'https://test-zbgisws.skgeodesy.sk/inspire_administrative_units_wfs/service.svc/get?SERVICE=WFS&amp;VERSION=2.0.0&amp;REQUEST=GetFeature&amp;STOREDQUERY_ID=urn:ogc:def:query:OGC-WFS::GetFeatureById&amp;id=auAdmBoundaryL.1957'"
16.11.2017 00:02:59 - "Exception: Timeout exceeded. URL: https://test-zbgisws.skgeodesy.sk/inspire_administrative_units_wfs/service.svc/get?SERVICE=WFS&amp;VERSION=2.0.0&amp;REQUEST=GetFeature&amp;STOREDQUERY_ID=urn:ogc:def:query:OGC-WFS::GetFeatureById&amp;id=auAdmBoundaryL.1957"
16.11.2017 00:02:59 - "Checking URL: 'https://test-zbgisws.skgeodesy.sk/inspire_administrative_units_wfs/service.svc/get?SERVICE=WFS&amp;VERSION=2.0.0&amp;REQUEST=GetFeature&amp;STOREDQUERY_ID=urn:ogc:def:query:OGC-WFS::GetFeatureById&amp;id=auAdmBoundaryL.1958'"
16.11.2017 00:03:30 - "Exception: Timeout exceeded. URL: https://test-zbgisws.skgeodesy.sk/inspire_administrative_units_wfs/service.svc/get?SERVICE=WFS&amp;VERSION=2.0.0&amp;REQUEST=GetFeature&amp;STOREDQUERY_ID=urn:ogc:def:query:OGC-WFS::GetFeatureById&amp;id=auAdmBoundaryL.1958"
16.11.2017 00:03:30 - "Checking URL: 'https://test-zbgisws.skgeodesy.sk/inspire_administrative_units_wfs/service.svc/get?SERVICE=WFS&amp;VERSION=2.0.0&amp;REQUEST=GetFeature&amp;STOREDQUERY_ID=urn:ogc:def:query:OGC-WFS::GetFeatureById&amp;id=auAdmBoundaryL.1982'"
16.11.2017 00:04:00 - "Exception: Timeout exceeded. URL: https://test-zbgisws.skgeodesy.sk/inspire_administrative_units_wfs/service.svc/get?SERVICE=WFS&amp;VERSION=2.0.0&amp;REQUEST=GetFeature&amp;STOREDQUERY_ID=urn:ogc:def:query:OGC-WFS::GetFeatureById&amp;id=auAdmBoundaryL.1982"
16.11.2017 00:04:00 - "Checking URL: 'https://test-zbgisws.skgeodesy.sk/inspire_administrative_units_wfs/service.svc/get?SERVICE=WFS&amp;VERSION=2.0.0&amp;REQUEST=GetFeature&amp;STOREDQUERY_ID=urn:ogc:def:query:OGC-WFS::GetFeatureById&amp;id=auAdmBoundaryL.1983'"
16.11.2017 00:04:30 - "Exception: Timeout exceeded. URL: https://test-zbgisws.skgeodesy.sk/inspire_administrative_units_wfs/service.svc/get?SERVICE=WFS&amp;VERSION=2.0.0&amp;REQUEST=GetFeature&amp;STOREDQUERY_ID=urn:ogc:def:query:OGC-WFS::GetFeatureById&amp;id=auAdmBoundaryL.1983"
16.11.2017 00:04:30 - "Checking URL: 'https://test-zbgisws.skgeodesy.sk/inspire_administrative_units_wfs/service.svc/get?SERVICE=WFS&amp;VERSION=2.0.0&amp;REQUEST=GetFeature&amp;STOREDQUERY_ID=urn:ogc:def:query:OGC-WFS::GetFeatureById&amp;id=auAdmBoundaryL.2035'"
16.11.2017 00:05:00 - "Exception: Timeout exceeded. URL: https://test-zbgisws.skgeodesy.sk/inspire_administrative_units_wfs/service.svc/get?SERVICE=WFS&amp;VERSION=2.0.0&amp;REQUEST=GetFeature&amp;STOREDQUERY_ID=urn:ogc:def:query:OGC-WFS::GetFeatureById&amp;id=auAdmBoundaryL.2035"
16.11.2017 00:05:00 - "Checking URL: 'https://test-zbgisws.skgeodesy.sk/inspire_administrative_units_wfs/service.svc/get?SERVICE=WFS&amp;VERSION=2.0.0&amp;REQUEST=GetFeature&amp;STOREDQUERY_ID=urn:ogc:def:query:OGC-WFS::GetFeatureById&amp;id=auAdmBoundaryL.2052'"
16.11.2017 00:05:30 - "Exception: Timeout exceeded. URL: https://test-zbgisws.skgeodesy.sk/inspire_administrative_units_wfs/service.svc/get?SERVICE=WFS&amp;VERSION=2.0.0&amp;REQUEST=GetFeature&amp;STOREDQUERY_ID=urn:ogc:def:query:OGC-WFS::GetFeatureById&amp;id=auAdmBoundaryL.2052"
16.11.2017 00:05:30 - "Checking URL: 'https://test-zbgisws.skgeodesy.sk/inspire_administrative_units_wfs/service.svc/get?SERVICE=WFS&amp;VERSION=2.0.0&amp;REQUEST=GetFeature&amp;STOREDQUERY_ID=urn:ogc:def:query:OGC-WFS::GetFeatureById&amp;id=auAdmBoundaryL.2117'"
16.11.2017 00:06:00 - "Exception: Timeout exceeded. URL: https://test-zbgisws.skgeodesy.sk/inspire_administrative_units_wfs/service.svc/get?SERVICE=WFS&amp;VERSION=2.0.0&amp;REQUEST=GetFeature&amp;STOREDQUERY_ID=urn:ogc:def:query:OGC-WFS::GetFeatureById&amp;id=auAdmBoundaryL.2117"
16.11.2017 00:06:00 - "Checking URL: 'https://test-zbgisws.skgeodesy.sk/inspire_administrative_units_wfs/service.svc/get?SERVICE=WFS&amp;VERSION=2.0.0&amp;REQUEST=GetFeature&amp;STOREDQUERY_ID=urn:ogc:def:query:OGC-WFS::GetFeatureById&amp;id=auAdmBoundaryL.2124'"
16.11.2017 00:06:30 - "Exception: Timeout exceeded. URL: https://test-zbgisws.skgeodesy.sk/inspire_administrative_units_wfs/service.svc/get?SERVICE=WFS&amp;VERSION=2.0.0&amp;REQUEST=GetFeature&amp;STOREDQUERY_ID=urn:ogc:def:query:OGC-WFS::GetFeatureById&amp;id=auAdmBoundaryL.2124"
16.11.2017 00:06:30 - "Checking URL: 'https://test-zbgisws.skgeodesy.sk/inspire_administrative_units_wfs/service.svc/get?SERVICE=WFS&amp;VERSION=2.0.0&amp;REQUEST=GetFeature&amp;STOREDQUERY_ID=urn:ogc:def:query:OGC-WFS::GetFeatureById&amp;id=auAdmBoundaryL.2199'"
16.11.2017 00:07:01 - "Exception: Timeout exceeded. URL: https://test-zbgisws.skgeodesy.sk/inspire_administrative_units_wfs/service.svc/get?SERVICE=WFS&amp;VERSION=2.0.0&amp;REQUEST=GetFeature&amp;STOREDQUERY_ID=urn:ogc:def:query:OGC-WFS::GetFeatureById&amp;id=auAdmBoundaryL.2199"
16.11.2017 00:07:01 - "Checking URL: 'https://test-zbgisws.skgeodesy.sk/inspire_administrative_units_wfs/service.svc/get?SERVICE=WFS&amp;VERSION=2.0.0&amp;REQUEST=GetFeature&amp;STOREDQUERY_ID=urn:ogc:def:query:OGC-WFS::GetFeatureById&amp;id=auAdmBoundaryL.2377'"
16.11.2017 00:07:31 - "Exception: Timeout exceeded. URL: https://test-zbgisws.skgeodesy.sk/inspire_administrative_units_wfs/service.svc/get?SERVICE=WFS&amp;VERSION=2.0.0&amp;REQUEST=GetFeature&amp;STOREDQUERY_ID=urn:ogc:def:query:OGC-WFS::GetFeatureById&amp;id=auAdmBoundaryL.2377"
16.11.2017 00:07:31 - "Checking URL: 'https://test-zbgisws.skgeodesy.sk/inspire_administrative_units_wfs/service.svc/get?SERVICE=WFS&amp;VERSION=2.0.0&amp;REQUEST=GetFeature&amp;STOREDQUERY_ID=urn:ogc:def:query:OGC-WFS::GetFeatureById&amp;id=auAdmBoundaryL.2562'"
16.11.2017 00:08:01 - "Exception: Timeout exceeded. URL: https://test-zbgisws.skgeodesy.sk/inspire_administrative_units_wfs/service.svc/get?SERVICE=WFS&amp;VERSION=2.0.0&amp;REQUEST=GetFeature&amp;STOREDQUERY_ID=urn:ogc:def:query:OGC-WFS::GetFeatureById&amp;id=auAdmBoundaryL.2562"
16.11.2017 00:08:01 - "Checking URL: 'https://test-zbgisws.skgeodesy.sk/inspire_administrative_units_wfs/service.svc/get?SERVICE=WFS&amp;VERSION=2.0.0&amp;REQUEST=GetFeature&amp;STOREDQUERY_ID=urn:ogc:def:query:OGC-WFS::GetFeatureById&amp;id=auAdmBoundaryL.2637'"
16.11.2017 00:08:31 - "Exception: Timeout exceeded. URL: https://test-zbgisws.skgeodesy.sk/inspire_administrative_units_wfs/service.svc/get?SERVICE=WFS&amp;VERSION=2.0.0&amp;REQUEST=GetFeature&amp;STOREDQUERY_ID=urn:ogc:def:query:OGC-WFS::GetFeatureById&amp;id=auAdmBoundaryL.2637"
16.11.2017 00:08:31 - "Checking URL: 'https://test-zbgisws.skgeodesy.sk/inspire_administrative_units_wfs/service.svc/get?SERVICE=WFS&amp;VERSION=2.0.0&amp;REQUEST=GetFeature&amp;STOREDQUERY_ID=urn:ogc:def:query:OGC-WFS::GetFeatureById&amp;id=auAdmBoundaryL.2710'"
16.11.2017 00:09:01 - "Exception: Timeout exceeded. URL: https://test-zbgisws.skgeodesy.sk/inspire_administrative_units_wfs/service.svc/get?SERVICE=WFS&amp;VERSION=2.0.0&amp;REQUEST=GetFeature&amp;STOREDQUERY_ID=urn:ogc:def:query:OGC-WFS::GetFeatureById&amp;id=auAdmBoundaryL.2710"
16.11.2017 00:09:01 - "Checking URL: 'https://test-zbgisws.skgeodesy.sk/inspire_administrative_units_wfs/service.svc/get?SERVICE=WFS&amp;VERSION=2.0.0&amp;REQUEST=GetFeature&amp;STOREDQUERY_ID=urn:ogc:def:query:OGC-WFS::GetFeatureById&amp;id=auAdmBoundaryL.2760'"
16.11.2017 00:09:31 - "Exception: Timeout exceeded. URL: https://test-zbgisws.skgeodesy.sk/inspire_administrative_units_wfs/service.svc/get?SERVICE=WFS&amp;VERSION=2.0.0&amp;REQUEST=GetFeature&amp;STOREDQUERY_ID=urn:ogc:def:query:OGC-WFS::GetFeatureById&amp;id=auAdmBoundaryL.2760"
16.11.2017 00:09:31 - "Checking URL: 'https://test-zbgisws.skgeodesy.sk/inspire_administrative_units_wfs/service.svc/get?SERVICE=WFS&amp;VERSION=2.0.0&amp;REQUEST=GetFeature&amp;STOREDQUERY_ID=urn:ogc:def:query:OGC-WFS::GetFeatureById&amp;id=auAdmBoundaryL.2819'"
16.11.2017 00:10:02 - "Exception: Timeout exceeded. URL: https://test-zbgisws.skgeodesy.sk/inspire_administrative_units_wfs/service.svc/get?SERVICE=WFS&amp;VERSION=2.0.0&amp;REQUEST=GetFeature&amp;STOREDQUERY_ID=urn:ogc:def:query:OGC-WFS::GetFeatureById&amp;id=auAdmBoundaryL.2819"
16.11.2017 00:10:02 - "Checking URL: 'https://test-zbgisws.skgeodesy.sk/inspire_administrative_units_wfs/service.svc/get?SERVICE=WFS&amp;VERSION=2.0.0&amp;REQUEST=GetFeature&amp;STOREDQUERY_ID=urn:ogc:def:query:OGC-WFS::GetFeatureById&amp;id=auAdmBoundaryL.2888'"
16.11.2017 00:10:32 - "Exception: Timeout exceeded. URL: https://test-zbgisws.skgeodesy.sk/inspire_administrative_units_wfs/service.svc/get?SERVICE=WFS&amp;VERSION=2.0.0&amp;REQUEST=GetFeature&amp;STOREDQUERY_ID=urn:ogc:def:query:OGC-WFS::GetFeatureById&amp;id=auAdmBoundaryL.2888"
16.11.2017 00:10:32 - "Checking URL: 'https://test-zbgisws.skgeodesy.sk/inspire_administrative_units_wfs/service.svc/get?SERVICE=WFS&amp;VERSION=2.0.0&amp;REQUEST=GetFeature&amp;STOREDQUERY_ID=urn:ogc:def:query:OGC-WFS::GetFeatureById&amp;id=auAdmBoundaryL.2896'"
16.11.2017 00:11:02 - "Exception: Timeout exceeded. URL: https://test-zbgisws.skgeodesy.sk/inspire_administrative_units_wfs/service.svc/get?SERVICE=WFS&amp;VERSION=2.0.0&amp;REQUEST=GetFeature&amp;STOREDQUERY_ID=urn:ogc:def:query:OGC-WFS::GetFeatureById&amp;id=auAdmBoundaryL.2896"
16.11.2017 00:11:02 - "Checking URL: 'https://test-zbgisws.skgeodesy.sk/inspire_administrative_units_wfs/service.svc/get?SERVICE=WFS&amp;VERSION=2.0.0&amp;REQUEST=GetFeature&amp;STOREDQUERY_ID=urn:ogc:def:query:OGC-WFS::GetFeatureById&amp;id=auAdmBoundaryL.3015'"
16.11.2017 00:11:32 - "Exception: Timeout exceeded. URL: https://test-zbgisws.skgeodesy.sk/inspire_administrative_units_wfs/service.svc/get?SERVICE=WFS&amp;VERSION=2.0.0&amp;REQUEST=GetFeature&amp;STOREDQUERY_ID=urn:ogc:def:query:OGC-WFS::GetFeatureById&amp;id=auAdmBoundaryL.3015"
16.11.2017 00:11:32 - "Checking URL: 'https://test-zbgisws.skgeodesy.sk/inspire_administrative_units_wfs/service.svc/get?SERVICE=WFS&amp;VERSION=2.0.0&amp;REQUEST=GetFeature&amp;STOREDQUERY_ID=urn:ogc:def:query:OGC-WFS::GetFeatureById&amp;id=auAdmBoundaryL.3054'"
16.11.2017 00:12:02 - "Exception: Timeout exceeded. URL: https://test-zbgisws.skgeodesy.sk/inspire_administrative_units_wfs/service.svc/get?SERVICE=WFS&amp;VERSION=2.0.0&amp;REQUEST=GetFeature&amp;STOREDQUERY_ID=urn:ogc:def:query:OGC-WFS::GetFeatureById&amp;id=auAdmBoundaryL.3054"
16.11.2017 00:12:02 - "Checking URL: 'https://test-zbgisws.skgeodesy.sk/inspire_administrative_units_wfs/service.svc/get?SERVICE=WFS&amp;VERSION=2.0.0&amp;REQUEST=GetFeature&amp;STOREDQUERY_ID=urn:ogc:def:query:OGC-WFS::GetFeatureById&amp;id=auAdmBoundaryL.3074'"
16.11.2017 00:12:32 - "Exception: Timeout exceeded. URL: https://test-zbgisws.skgeodesy.sk/inspire_administrative_units_wfs/service.svc/get?SERVICE=WFS&amp;VERSION=2.0.0&amp;REQUEST=GetFeature&amp;STOREDQUERY_ID=urn:ogc:def:query:OGC-WFS::GetFeatureById&amp;id=auAdmBoundaryL.3074"
16.11.2017 00:12:32 - "Checking URL: 'https://test-zbgisws.skgeodesy.sk/inspire_administrative_units_wfs/service.svc/get?SERVICE=WFS&amp;VERSION=2.0.0&amp;REQUEST=GetFeature&amp;STOREDQUERY_ID=urn:ogc:def:query:OGC-WFS::GetFeatureById&amp;id=auAdmBoundaryL.3075'"
16.11.2017 00:13:02 - "Exception: Timeout exceeded. URL: https://test-zbgisws.skgeodesy.sk/inspire_administrative_units_wfs/service.svc/get?SERVICE=WFS&amp;VERSION=2.0.0&amp;REQUEST=GetFeature&amp;STOREDQUERY_ID=urn:ogc:def:query:OGC-WFS::GetFeatureById&amp;id=auAdmBoundaryL.3075"
16.11.2017 00:13:02 - "Checking URL: 'https://test-zbgisws.skgeodesy.sk/inspire_administrative_units_wfs/service.svc/get?SERVICE=WFS&amp;VERSION=2.0.0&amp;REQUEST=GetFeature&amp;STOREDQUERY_ID=urn:ogc:def:query:OGC-WFS::GetFeatureById&amp;id=auAdmBoundaryL.3077'"
16.11.2017 00:13:33 - "Exception: Timeout exceeded. URL: https://test-zbgisws.skgeodesy.sk/inspire_administrative_units_wfs/service.svc/get?SERVICE=WFS&amp;VERSION=2.0.0&amp;REQUEST=GetFeature&amp;STOREDQUERY_ID=urn:ogc:def:query:OGC-WFS::GetFeatureById&amp;id=auAdmBoundaryL.3077"
16.11.2017 00:13:33 - "Checking URL: 'https://test-zbgisws.skgeodesy.sk/inspire_administrative_units_wfs/service.svc/get?SERVICE=WFS&amp;VERSION=2.0.0&amp;REQUEST=GetFeature&amp;STOREDQUERY_ID=urn:ogc:def:query:OGC-WFS::GetFeatureById&amp;id=auAdmBoundaryL.3102'"
16.11.2017 00:14:03 - "Exception: Timeout exceeded. URL: https://test-zbgisws.skgeodesy.sk/inspire_administrative_units_wfs/service.svc/get?SERVICE=WFS&amp;VERSION=2.0.0&amp;REQUEST=GetFeature&amp;STOREDQUERY_ID=urn:ogc:def:query:OGC-WFS::GetFeatureById&amp;id=auAdmBoundaryL.3102"
16.11.2017 00:14:03 - "Checking URL: 'https://test-zbgisws.skgeodesy.sk/inspire_administrative_units_wfs/service.svc/get?SERVICE=WFS&amp;VERSION=2.0.0&amp;REQUEST=GetFeature&amp;STOREDQUERY_ID=urn:ogc:def:query:OGC-WFS::GetFeatureById&amp;id=auAdmBoundaryL.3205'"
16.11.2017 00:14:33 - "Exception: Timeout exceeded. URL: https://test-zbgisws.skgeodesy.sk/inspire_administrative_units_wfs/service.svc/get?SERVICE=WFS&amp;VERSION=2.0.0&amp;REQUEST=GetFeature&amp;STOREDQUERY_ID=urn:ogc:def:query:OGC-WFS::GetFeatureById&amp;id=auAdmBoundaryL.3205"
16.11.2017 00:14:33 - "Checking URL: 'https://test-zbgisws.skgeodesy.sk/inspire_administrative_units_wfs/service.svc/get?SERVICE=WFS&amp;VERSION=2.0.0&amp;REQUEST=GetFeature&amp;STOREDQUERY_ID=urn:ogc:def:query:OGC-WFS::GetFeatureById&amp;id=auAdmBoundaryL.3299'"
16.11.2017 00:15:03 - "Exception: Timeout exceeded. URL: https://test-zbgisws.skgeodesy.sk/inspire_administrative_units_wfs/service.svc/get?SERVICE=WFS&amp;VERSION=2.0.0&amp;REQUEST=GetFeature&amp;STOREDQUERY_ID=urn:ogc:def:query:OGC-WFS::GetFeatureById&amp;id=auAdmBoundaryL.3299"
16.11.2017 00:15:03 - "Checking URL: 'https://test-zbgisws.skgeodesy.sk/inspire_administrative_units_wfs/service.svc/get?SERVICE=WFS&amp;VERSION=2.0.0&amp;REQUEST=GetFeature&amp;STOREDQUERY_ID=urn:ogc:def:query:OGC-WFS::GetFeatureById&amp;id=auAdmBoundaryL.3351'"
16.11.2017 00:15:33 - "Exception: Timeout exceeded. URL: https://test-zbgisws.skgeodesy.sk/inspire_administrative_units_wfs/service.svc/get?SERVICE=WFS&amp;VERSION=2.0.0&amp;REQUEST=GetFeature&amp;STOREDQUERY_ID=urn:ogc:def:query:OGC-WFS::GetFeatureById&amp;id=auAdmBoundaryL.3351"
16.11.2017 00:15:33 - "Checking URL: 'https://test-zbgisws.skgeodesy.sk/inspire_administrative_units_wfs/service.svc/get?SERVICE=WFS&amp;VERSION=2.0.0&amp;REQUEST=GetFeature&amp;STOREDQUERY_ID=urn:ogc:def:query:OGC-WFS::GetFeatureById&amp;id=auAdmBoundaryL.3607'"
16.11.2017 00:16:03 - "Exception: Timeout exceeded. URL: https://test-zbgisws.skgeodesy.sk/inspire_administrative_units_wfs/service.svc/get?SERVICE=WFS&amp;VERSION=2.0.0&amp;REQUEST=GetFeature&amp;STOREDQUERY_ID=urn:ogc:def:query:OGC-WFS::GetFeatureById&amp;id=auAdmBoundaryL.3607"
16.11.2017 00:16:03 - "Checking URL: 'https://test-zbgisws.skgeodesy.sk/inspire_administrative_units_wfs/service.svc/get?SERVICE=WFS&amp;VERSION=2.0.0&amp;REQUEST=GetFeature&amp;STOREDQUERY_ID=urn:ogc:def:query:OGC-WFS::GetFeatureById&amp;id=auAdmBoundaryL.3671'"
16.11.2017 00:16:33 - "Exception: Timeout exceeded. URL: https://test-zbgisws.skgeodesy.sk/inspire_administrative_units_wfs/service.svc/get?SERVICE=WFS&amp;VERSION=2.0.0&amp;REQUEST=GetFeature&amp;STOREDQUERY_ID=urn:ogc:def:query:OGC-WFS::GetFeatureById&amp;id=auAdmBoundaryL.3671"
16.11.2017 00:16:33 - "Checking URL: 'https://test-zbgisws.skgeodesy.sk/inspire_administrative_units_wfs/service.svc/get?SERVICE=WFS&amp;VERSION=2.0.0&amp;REQUEST=GetFeature&amp;STOREDQUERY_ID=urn:ogc:def:query:OGC-WFS::GetFeatureById&amp;id=auAdmBoundaryL.3849'"
16.11.2017 00:17:04 - "Exception: Timeout exceeded. URL: https://test-zbgisws.skgeodesy.sk/inspire_administrative_units_wfs/service.svc/get?SERVICE=WFS&amp;VERSION=2.0.0&amp;REQUEST=GetFeature&amp;STOREDQUERY_ID=urn:ogc:def:query:OGC-WFS::GetFeatureById&amp;id=auAdmBoundaryL.3849"
16.11.2017 00:17:04 - "Checking URL: 'https://test-zbgisws.skgeodesy.sk/inspire_administrative_units_wfs/service.svc/get?SERVICE=WFS&amp;VERSION=2.0.0&amp;REQUEST=GetFeature&amp;STOREDQUERY_ID=urn:ogc:def:query:OGC-WFS::GetFeatureById&amp;id=auAdmBoundaryL.3851'"
16.11.2017 00:17:34 - "Exception: Timeout exceeded. URL: https://test-zbgisws.skgeodesy.sk/inspire_administrative_units_wfs/service.svc/get?SERVICE=WFS&amp;VERSION=2.0.0&amp;REQUEST=GetFeature&amp;STOREDQUERY_ID=urn:ogc:def:query:OGC-WFS::GetFeatureById&amp;id=auAdmBoundaryL.3851"
16.11.2017 00:17:34 - "Checking URL: 'https://test-zbgisws.skgeodesy.sk/inspire_administrative_units_wfs/service.svc/get?SERVICE=WFS&amp;VERSION=2.0.0&amp;REQUEST=GetFeature&amp;STOREDQUERY_ID=urn:ogc:def:query:OGC-WFS::GetFeatureById&amp;id=auAdmBoundaryL.3854'"
16.11.2017 00:18:04 - "Exception: Timeout exceeded. URL: https://test-zbgisws.skgeodesy.sk/inspire_administrative_units_wfs/service.svc/get?SERVICE=WFS&amp;VERSION=2.0.0&amp;REQUEST=GetFeature&amp;STOREDQUERY_ID=urn:ogc:def:query:OGC-WFS::GetFeatureById&amp;id=auAdmBoundaryL.3854"
16.11.2017 00:18:04 - "Checking URL: 'https://test-zbgisws.skgeodesy.sk/inspire_administrative_units_wfs/service.svc/get?SERVICE=WFS&amp;VERSION=2.0.0&amp;REQUEST=GetFeature&amp;STOREDQUERY_ID=urn:ogc:def:query:OGC-WFS::GetFeatureById&amp;id=auAdmBoundaryL.4245'"
16.11.2017 00:18:34 - "Exception: Timeout exceeded. URL: https://test-zbgisws.skgeodesy.sk/inspire_administrative_units_wfs/service.svc/get?SERVICE=WFS&amp;VERSION=2.0.0&amp;REQUEST=GetFeature&amp;STOREDQUERY_ID=urn:ogc:def:query:OGC-WFS::GetFeatureById&amp;id=auAdmBoundaryL.4245"
16.11.2017 00:18:34 - "Checking URL: 'https://test-zbgisws.skgeodesy.sk/inspire_administrative_units_wfs/service.svc/get?SERVICE=WFS&amp;VERSION=2.0.0&amp;REQUEST=GetFeature&amp;STOREDQUERY_ID=urn:ogc:def:query:OGC-WFS::GetFeatureById&amp;id=auAdmBoundaryL.4320'"
16.11.2017 00:19:04 - "Exception: Timeout exceeded. URL: https://test-zbgisws.skgeodesy.sk/inspire_administrative_units_wfs/service.svc/get?SERVICE=WFS&amp;VERSION=2.0.0&amp;REQUEST=GetFeature&amp;STOREDQUERY_ID=urn:ogc:def:query:OGC-WFS::GetFeatureById&amp;id=auAdmBoundaryL.4320"
16.11.2017 00:19:04 - "Checking URL: 'https://test-zbgisws.skgeodesy.sk/inspire_administrative_units_wfs/service.svc/get?SERVICE=WFS&amp;VERSION=2.0.0&amp;REQUEST=GetFeature&amp;STOREDQUERY_ID=urn:ogc:def:query:OGC-WFS::GetFeatureById&amp;id=auAdmBoundaryL.4328'"
16.11.2017 00:19:34 - "Exception: Timeout exceeded. URL: https://test-zbgisws.skgeodesy.sk/inspire_administrative_units_wfs/service.svc/get?SERVICE=WFS&amp;VERSION=2.0.0&amp;REQUEST=GetFeature&amp;STOREDQUERY_ID=urn:ogc:def:query:OGC-WFS::GetFeatureById&amp;id=auAdmBoundaryL.4328"
16.11.2017 00:19:34 - "Checking URL: 'https://test-zbgisws.skgeodesy.sk/inspire_administrative_units_wfs/service.svc/get?SERVICE=WFS&amp;VERSION=2.0.0&amp;REQUEST=GetFeature&amp;STOREDQUERY_ID=urn:ogc:def:query:OGC-WFS::GetFeatureById&amp;id=auAdmBoundaryL.4391'"
16.11.2017 00:20:04 - "Exception: Timeout exceeded. URL: https://test-zbgisws.skgeodesy.sk/inspire_administrative_units_wfs/service.svc/get?SERVICE=WFS&amp;VERSION=2.0.0&amp;REQUEST=GetFeature&amp;STOREDQUERY_ID=urn:ogc:def:query:OGC-WFS::GetFeatureById&amp;id=auAdmBoundaryL.4391"
16.11.2017 00:20:04 - "Checking URL: 'https://test-zbgisws.skgeodesy.sk/inspire_administrative_units_wfs/service.svc/get?SERVICE=WFS&amp;VERSION=2.0.0&amp;REQUEST=GetFeature&amp;STOREDQUERY_ID=urn:ogc:def:query:OGC-WFS::GetFeatureById&amp;id=auAdmBoundaryL.4394'"
16.11.2017 00:20:34 - "Exception: Timeout exceeded. URL: https://test-zbgisws.skgeodesy.sk/inspire_administrative_units_wfs/service.svc/get?SERVICE=WFS&amp;VERSION=2.0.0&amp;REQUEST=GetFeature&amp;STOREDQUERY_ID=urn:ogc:def:query:OGC-WFS::GetFeatureById&amp;id=auAdmBoundaryL.4394"
16.11.2017 00:20:34 - "Checking URL: 'https://test-zbgisws.skgeodesy.sk/inspire_administrative_units_wfs/service.svc/get?SERVICE=WFS&amp;VERSION=2.0.0&amp;REQUEST=GetFeature&amp;STOREDQUERY_ID=urn:ogc:def:query:OGC-WFS::GetFeatureById&amp;id=auAdmBoundaryL.4459'"
16.11.2017 00:21:05 - "Exception: Timeout exceeded. URL: https://test-zbgisws.skgeodesy.sk/inspire_administrative_units_wfs/service.svc/get?SERVICE=WFS&amp;VERSION=2.0.0&amp;REQUEST=GetFeature&amp;STOREDQUERY_ID=urn:ogc:def:query:OGC-WFS::GetFeatureById&amp;id=auAdmBoundaryL.4459"
16.11.2017 00:21:05 - "Checking URL: 'https://test-zbgisws.skgeodesy.sk/inspire_administrative_units_wfs/service.svc/get?SERVICE=WFS&amp;VERSION=2.0.0&amp;REQUEST=GetFeature&amp;STOREDQUERY_ID=urn:ogc:def:query:OGC-WFS::GetFeatureById&amp;id=auAdmBoundaryL.4460'"
16.11.2017 00:21:35 - "Exception: Timeout exceeded. URL: https://test-zbgisws.skgeodesy.sk/inspire_administrative_units_wfs/service.svc/get?SERVICE=WFS&amp;VERSION=2.0.0&amp;REQUEST=GetFeature&amp;STOREDQUERY_ID=urn:ogc:def:query:OGC-WFS::GetFeatureById&amp;id=auAdmBoundaryL.4460"
16.11.2017 00:21:35 - "Checking URL: 'https://test-zbgisws.skgeodesy.sk/inspire_administrative_units_wfs/service.svc/get?SERVICE=WFS&amp;VERSION=2.0.0&amp;REQUEST=GetFeature&amp;STOREDQUERY_ID=urn:ogc:def:query:OGC-WFS::GetFeatureById&amp;id=auAdmBoundaryL.4531'"
16.11.2017 00:22:05 - "Exception: Timeout exceeded. URL: https://test-zbgisws.skgeodesy.sk/inspire_administrative_units_wfs/service.svc/get?SERVICE=WFS&amp;VERSION=2.0.0&amp;REQUEST=GetFeature&amp;STOREDQUERY_ID=urn:ogc:def:query:OGC-WFS::GetFeatureById&amp;id=auAdmBoundaryL.4531"
16.11.2017 00:22:05 - "Checking URL: 'https://test-zbgisws.skgeodesy.sk/inspire_administrative_units_wfs/service.svc/get?SERVICE=WFS&amp;VERSION=2.0.0&amp;REQUEST=GetFeature&amp;STOREDQUERY_ID=urn:ogc:def:query:OGC-WFS::GetFeatureById&amp;id=auAdmBoundaryL.4555'"
16.11.2017 00:22:35 - "Exception: Timeout exceeded. URL: https://test-zbgisws.skgeodesy.sk/inspire_administrative_units_wfs/service.svc/get?SERVICE=WFS&amp;VERSION=2.0.0&amp;REQUEST=GetFeature&amp;STOREDQUERY_ID=urn:ogc:def:query:OGC-WFS::GetFeatureById&amp;id=auAdmBoundaryL.4555"
16.11.2017 00:22:35 - "Checking URL: 'https://test-zbgisws.skgeodesy.sk/inspire_administrative_units_wfs/service.svc/get?SERVICE=WFS&amp;VERSION=2.0.0&amp;REQUEST=GetFeature&amp;STOREDQUERY_ID=urn:ogc:def:query:OGC-WFS::GetFeatureById&amp;id=auAdmBoundaryL.4653'"
16.11.2017 00:23:05 - "Exception: Timeout exceeded. URL: https://test-zbgisws.skgeodesy.sk/inspire_administrative_units_wfs/service.svc/get?SERVICE=WFS&amp;VERSION=2.0.0&amp;REQUEST=GetFeature&amp;STOREDQUERY_ID=urn:ogc:def:query:OGC-WFS::GetFeatureById&amp;id=auAdmBoundaryL.4653"
16.11.2017 00:23:05 - "Checking URL: 'https://test-zbgisws.skgeodesy.sk/inspire_administrative_units_wfs/service.svc/get?SERVICE=WFS&amp;VERSION=2.0.0&amp;REQUEST=GetFeature&amp;STOREDQUERY_ID=urn:ogc:def:query:OGC-WFS::GetFeatureById&amp;id=auAdmBoundaryL.4681'"
16.11.2017 00:23:35 - "Exception: Timeout exceeded. URL: https://test-zbgisws.skgeodesy.sk/inspire_administrative_units_wfs/service.svc/get?SERVICE=WFS&amp;VERSION=2.0.0&amp;REQUEST=GetFeature&amp;STOREDQUERY_ID=urn:ogc:def:query:OGC-WFS::GetFeatureById&amp;id=auAdmBoundaryL.4681"
16.11.2017 00:23:35 - "Checking URL: 'https://test-zbgisws.skgeodesy.sk/inspire_administrative_units_wfs/service.svc/get?SERVICE=WFS&amp;VERSION=2.0.0&amp;REQUEST=GetFeature&amp;STOREDQUERY_ID=urn:ogc:def:query:OGC-WFS::GetFeatureById&amp;id=auAdmBoundaryL.4708'"
16.11.2017 00:24:06 - "Exception: Timeout exceeded. URL: https://test-zbgisws.skgeodesy.sk/inspire_administrative_units_wfs/service.svc/get?SERVICE=WFS&amp;VERSION=2.0.0&amp;REQUEST=GetFeature&amp;STOREDQUERY_ID=urn:ogc:def:query:OGC-WFS::GetFeatureById&amp;id=auAdmBoundaryL.4708"
16.11.2017 00:24:06 - "Checking URL: 'https://test-zbgisws.skgeodesy.sk/inspire_administrative_units_wfs/service.svc/get?SERVICE=WFS&amp;VERSION=2.0.0&amp;REQUEST=GetFeature&amp;STOREDQUERY_ID=urn:ogc:def:query:OGC-WFS::GetFeatureById&amp;id=auAdmBoundaryL.4822'"
16.11.2017 00:24:36 - "Exception: Timeout exceeded. URL: https://test-zbgisws.skgeodesy.sk/inspire_administrative_units_wfs/service.svc/get?SERVICE=WFS&amp;VERSION=2.0.0&amp;REQUEST=GetFeature&amp;STOREDQUERY_ID=urn:ogc:def:query:OGC-WFS::GetFeatureById&amp;id=auAdmBoundaryL.4822"
16.11.2017 00:24:36 - "Checking URL: 'https://test-zbgisws.skgeodesy.sk/inspire_administrative_units_wfs/service.svc/get?SERVICE=WFS&amp;VERSION=2.0.0&amp;REQUEST=GetFeature&amp;STOREDQUERY_ID=urn:ogc:def:query:OGC-WFS::GetFeatureById&amp;id=auAdmBoundaryL.4845'"
16.11.2017 00:25:06 - "Exception: Timeout exceeded. URL: https://test-zbgisws.skgeodesy.sk/inspire_administrative_units_wfs/service.svc/get?SERVICE=WFS&amp;VERSION=2.0.0&amp;REQUEST=GetFeature&amp;STOREDQUERY_ID=urn:ogc:def:query:OGC-WFS::GetFeatureById&amp;id=auAdmBoundaryL.4845"
16.11.2017 00:25:06 - "Checking URL: 'https://test-zbgisws.skgeodesy.sk/inspire_administrative_units_wfs/service.svc/get?SERVICE=WFS&amp;VERSION=2.0.0&amp;REQUEST=GetFeature&amp;STOREDQUERY_ID=urn:ogc:def:query:OGC-WFS::GetFeatureById&amp;id=auAdmBoundaryL.4876'"
16.11.2017 00:25:36 - "Exception: Timeout exceeded. URL: https://test-zbgisws.skgeodesy.sk/inspire_administrative_units_wfs/service.svc/get?SERVICE=WFS&amp;VERSION=2.0.0&amp;REQUEST=GetFeature&amp;STOREDQUERY_ID=urn:ogc:def:query:OGC-WFS::GetFeatureById&amp;id=auAdmBoundaryL.4876"
16.11.2017 00:25:36 - "Checking URL: 'https://test-zbgisws.skgeodesy.sk/inspire_administrative_units_wfs/service.svc/get?SERVICE=WFS&amp;VERSION=2.0.0&amp;REQUEST=GetFeature&amp;STOREDQUERY_ID=urn:ogc:def:query:OGC-WFS::GetFeatureById&amp;id=auAdmBoundaryL.4886'"
16.11.2017 00:26:06 - "Exception: Timeout exceeded. URL: https://test-zbgisws.skgeodesy.sk/inspire_administrative_units_wfs/service.svc/get?SERVICE=WFS&amp;VERSION=2.0.0&amp;REQUEST=GetFeature&amp;STOREDQUERY_ID=urn:ogc:def:query:OGC-WFS::GetFeatureById&amp;id=auAdmBoundaryL.4886"
16.11.2017 00:26:06 - "Checking URL: 'https://test-zbgisws.skgeodesy.sk/inspire_administrative_units_wfs/service.svc/get?SERVICE=WFS&amp;VERSION=2.0.0&amp;REQUEST=GetFeature&amp;STOREDQUERY_ID=urn:ogc:def:query:OGC-WFS::GetFeatureById&amp;id=auAdmBoundaryL.4895'"
16.11.2017 00:26:36 - "Exception: Timeout exceeded. URL: https://test-zbgisws.skgeodesy.sk/inspire_administrative_units_wfs/service.svc/get?SERVICE=WFS&amp;VERSION=2.0.0&amp;REQUEST=GetFeature&amp;STOREDQUERY_ID=urn:ogc:def:query:OGC-WFS::GetFeatureById&amp;id=auAdmBoundaryL.4895"
16.11.2017 00:26:36 - "Checking URL: 'https://test-zbgisws.skgeodesy.sk/inspire_administrative_units_wfs/service.svc/get?SERVICE=WFS&amp;VERSION=2.0.0&amp;REQUEST=GetFeature&amp;STOREDQUERY_ID=urn:ogc:def:query:OGC-WFS::GetFeatureById&amp;id=auAdmBoundaryL.4981'"
16.11.2017 00:27:06 - "Exception: Timeout exceeded. URL: https://test-zbgisws.skgeodesy.sk/inspire_administrative_units_wfs/service.svc/get?SERVICE=WFS&amp;VERSION=2.0.0&amp;REQUEST=GetFeature&amp;STOREDQUERY_ID=urn:ogc:def:query:OGC-WFS::GetFeatureById&amp;id=auAdmBoundaryL.4981"
16.11.2017 00:27:06 - "Checking URL: 'https://test-zbgisws.skgeodesy.sk/inspire_administrative_units_wfs/service.svc/get?SERVICE=WFS&amp;VERSION=2.0.0&amp;REQUEST=GetFeature&amp;STOREDQUERY_ID=urn:ogc:def:query:OGC-WFS::GetFeatureById&amp;id=auAdmBoundaryL.4982'"
16.11.2017 00:27:37 - "Exception: Timeout exceeded. URL: https://test-zbgisws.skgeodesy.sk/inspire_administrative_units_wfs/service.svc/get?SERVICE=WFS&amp;VERSION=2.0.0&amp;REQUEST=GetFeature&amp;STOREDQUERY_ID=urn:ogc:def:query:OGC-WFS::GetFeatureById&amp;id=auAdmBoundaryL.4982"
16.11.2017 00:27:37 - "Checking URL: 'https://test-zbgisws.skgeodesy.sk/inspire_administrative_units_wfs/service.svc/get?SERVICE=WFS&amp;VERSION=2.0.0&amp;REQUEST=GetFeature&amp;STOREDQUERY_ID=urn:ogc:def:query:OGC-WFS::GetFeatureById&amp;id=auAdmBoundaryL.5018'"
16.11.2017 00:28:07 - "Exception: Timeout exceeded. URL: https://test-zbgisws.skgeodesy.sk/inspire_administrative_units_wfs/service.svc/get?SERVICE=WFS&amp;VERSION=2.0.0&amp;REQUEST=GetFeature&amp;STOREDQUERY_ID=urn:ogc:def:query:OGC-WFS::GetFeatureById&amp;id=auAdmBoundaryL.5018"
16.11.2017 00:28:07 - "Checking URL: 'https://test-zbgisws.skgeodesy.sk/inspire_administrative_units_wfs/service.svc/get?SERVICE=WFS&amp;VERSION=2.0.0&amp;REQUEST=GetFeature&amp;STOREDQUERY_ID=urn:ogc:def:query:OGC-WFS::GetFeatureById&amp;id=auAdmBoundaryL.5170'"
16.11.2017 00:28:37 - "Exception: Timeout exceeded. URL: https://test-zbgisws.skgeodesy.sk/inspire_administrative_units_wfs/service.svc/get?SERVICE=WFS&amp;VERSION=2.0.0&amp;REQUEST=GetFeature&amp;STOREDQUERY_ID=urn:ogc:def:query:OGC-WFS::GetFeatureById&amp;id=auAdmBoundaryL.5170"
16.11.2017 00:28:37 - "Checking URL: 'https://test-zbgisws.skgeodesy.sk/inspire_administrative_units_wfs/service.svc/get?SERVICE=WFS&amp;VERSION=2.0.0&amp;REQUEST=GetFeature&amp;STOREDQUERY_ID=urn:ogc:def:query:OGC-WFS::GetFeatureById&amp;id=auAdmBoundaryL.5304'"
16.11.2017 00:29:07 - "Exception: Timeout exceeded. URL: https://test-zbgisws.skgeodesy.sk/inspire_administrative_units_wfs/service.svc/get?SERVICE=WFS&amp;VERSION=2.0.0&amp;REQUEST=GetFeature&amp;STOREDQUERY_ID=urn:ogc:def:query:OGC-WFS::GetFeatureById&amp;id=auAdmBoundaryL.5304"
16.11.2017 00:29:07 - "Checking URL: 'https://test-zbgisws.skgeodesy.sk/inspire_administrative_units_wfs/service.svc/get?SERVICE=WFS&amp;VERSION=2.0.0&amp;REQUEST=GetFeature&amp;STOREDQUERY_ID=urn:ogc:def:query:OGC-WFS::GetFeatureById&amp;id=auAdmBoundaryL.5388'"
16.11.2017 00:29:37 - "Exception: Timeout exceeded. URL: https://test-zbgisws.skgeodesy.sk/inspire_administrative_units_wfs/service.svc/get?SERVICE=WFS&amp;VERSION=2.0.0&amp;REQUEST=GetFeature&amp;STOREDQUERY_ID=urn:ogc:def:query:OGC-WFS::GetFeatureById&amp;id=auAdmBoundaryL.5388"
16.11.2017 00:29:37 - "Checking URL: 'https://test-zbgisws.skgeodesy.sk/inspire_administrative_units_wfs/service.svc/get?SERVICE=WFS&amp;VERSION=2.0.0&amp;REQUEST=GetFeature&amp;STOREDQUERY_ID=urn:ogc:def:query:OGC-WFS::GetFeatureById&amp;id=auAdmBoundaryL.5503'"
16.11.2017 00:30:07 - "Exception: Timeout exceeded. URL: https://test-zbgisws.skgeodesy.sk/inspire_administrative_units_wfs/service.svc/get?SERVICE=WFS&amp;VERSION=2.0.0&amp;REQUEST=GetFeature&amp;STOREDQUERY_ID=urn:ogc:def:query:OGC-WFS::GetFeatureById&amp;id=auAdmBoundaryL.5503"
16.11.2017 00:30:07 - "Checking URL: 'https://test-zbgisws.skgeodesy.sk/inspire_administrative_units_wfs/service.svc/get?SERVICE=WFS&amp;VERSION=2.0.0&amp;REQUEST=GetFeature&amp;STOREDQUERY_ID=urn:ogc:def:query:OGC-WFS::GetFeatureById&amp;id=auAdmBoundaryL.6294'"
16.11.2017 00:30:37 - "Exception: Timeout exceeded. URL: https://test-zbgisws.skgeodesy.sk/inspire_administrative_units_wfs/service.svc/get?SERVICE=WFS&amp;VERSION=2.0.0&amp;REQUEST=GetFeature&amp;STOREDQUERY_ID=urn:ogc:def:query:OGC-WFS::GetFeatureById&amp;id=auAdmBoundaryL.6294"
16.11.2017 00:30:37 - "Checking URL: 'https://test-zbgisws.skgeodesy.sk/inspire_administrative_units_wfs/service.svc/get?SERVICE=WFS&amp;VERSION=2.0.0&amp;REQUEST=GetFeature&amp;STOREDQUERY_ID=urn:ogc:def:query:OGC-WFS::GetFeatureById&amp;id=auAdmBoundaryL.6477'"
16.11.2017 00:31:08 - "Exception: Timeout exceeded. URL: https://test-zbgisws.skgeodesy.sk/inspire_administrative_units_wfs/service.svc/get?SERVICE=WFS&amp;VERSION=2.0.0&amp;REQUEST=GetFeature&amp;STOREDQUERY_ID=urn:ogc:def:query:OGC-WFS::GetFeatureById&amp;id=auAdmBoundaryL.6477"
16.11.2017 00:31:08 - "Checking URL: 'https://test-zbgisws.skgeodesy.sk/inspire_administrative_units_wfs/service.svc/get?SERVICE=WFS&amp;VERSION=2.0.0&amp;REQUEST=GetFeature&amp;STOREDQUERY_ID=urn:ogc:def:query:OGC-WFS::GetFeatureById&amp;id=auAdmBoundaryL.6594'"
16.11.2017 00:31:38 - "Exception: Timeout exceeded. URL: https://test-zbgisws.skgeodesy.sk/inspire_administrative_units_wfs/service.svc/get?SERVICE=WFS&amp;VERSION=2.0.0&amp;REQUEST=GetFeature&amp;STOREDQUERY_ID=urn:ogc:def:query:OGC-WFS::GetFeatureById&amp;id=auAdmBoundaryL.6594"
16.11.2017 00:31:38 - "Checking URL: 'https://test-zbgisws.skgeodesy.sk/inspire_administrative_units_wfs/service.svc/get?SERVICE=WFS&amp;VERSION=2.0.0&amp;REQUEST=GetFeature&amp;STOREDQUERY_ID=urn:ogc:def:query:OGC-WFS::GetFeatureById&amp;id=auAdmBoundaryL.6634'"
16.11.2017 00:32:08 - "Exception: Timeout exceeded. URL: https://test-zbgisws.skgeodesy.sk/inspire_administrative_units_wfs/service.svc/get?SERVICE=WFS&amp;VERSION=2.0.0&amp;REQUEST=GetFeature&amp;STOREDQUERY_ID=urn:ogc:def:query:OGC-WFS::GetFeatureById&amp;id=auAdmBoundaryL.6634"
16.11.2017 00:32:08 - "Checking URL: 'https://test-zbgisws.skgeodesy.sk/inspire_administrative_units_wfs/service.svc/get?SERVICE=WFS&amp;VERSION=2.0.0&amp;REQUEST=GetFeature&amp;STOREDQUERY_ID=urn:ogc:def:query:OGC-WFS::GetFeatureById&amp;id=auAdmBoundaryL.10884'"
16.11.2017 00:32:38 - "Exception: Timeout exceeded. URL: https://test-zbgisws.skgeodesy.sk/inspire_administrative_units_wfs/service.svc/get?SERVICE=WFS&amp;VERSION=2.0.0&amp;REQUEST=GetFeature&amp;STOREDQUERY_ID=urn:ogc:def:query:OGC-WFS::GetFeatureById&amp;id=auAdmBoundaryL.10884"
16.11.2017 00:32:38 - "Checking URL: 'https://test-zbgisws.skgeodesy.sk/inspire_administrative_units_wfs/service.svc/get?SERVICE=WFS&amp;VERSION=2.0.0&amp;REQUEST=GetFeature&amp;STOREDQUERY_ID=urn:ogc:def:query:OGC-WFS::GetFeatureById&amp;id=auAdmBoundaryL.10922'"
16.11.2017 00:33:08 - "Exception: Timeout exceeded. URL: https://test-zbgisws.skgeodesy.sk/inspire_administrative_units_wfs/service.svc/get?SERVICE=WFS&amp;VERSION=2.0.0&amp;REQUEST=GetFeature&amp;STOREDQUERY_ID=urn:ogc:def:query:OGC-WFS::GetFeatureById&amp;id=auAdmBoundaryL.10922"
16.11.2017 00:33:08 - "Checking URL: 'https://test-zbgisws.skgeodesy.sk/inspire_administrative_units_wfs/service.svc/get?SERVICE=WFS&amp;VERSION=2.0.0&amp;REQUEST=GetFeature&amp;STOREDQUERY_ID=urn:ogc:def:query:OGC-WFS::GetFeatureById&amp;id=auAdmBoundaryL.10999'"
16.11.2017 00:33:38 - "Exception: Timeout exceeded. URL: https://test-zbgisws.skgeodesy.sk/inspire_administrative_units_wfs/service.svc/get?SERVICE=WFS&amp;VERSION=2.0.0&amp;REQUEST=GetFeature&amp;STOREDQUERY_ID=urn:ogc:def:query:OGC-WFS::GetFeatureById&amp;id=auAdmBoundaryL.10999"
16.11.2017 00:33:38 - "Checking URL: 'https://test-zbgisws.skgeodesy.sk/inspire_administrative_units_wfs/service.svc/get?SERVICE=WFS&amp;VERSION=2.0.0&amp;REQUEST=GetFeature&amp;STOREDQUERY_ID=urn:ogc:def:query:OGC-WFS::GetFeatureById&amp;id=auAdmBoundaryL.11075'"
16.11.2017 00:34:08 - "Exception: Timeout exceeded. URL: https://test-zbgisws.skgeodesy.sk/inspire_administrative_units_wfs/service.svc/get?SERVICE=WFS&amp;VERSION=2.0.0&amp;REQUEST=GetFeature&amp;STOREDQUERY_ID=urn:ogc:def:query:OGC-WFS::GetFeatureById&amp;id=auAdmBoundaryL.11075"
16.11.2017 00:34:08 - "Checking URL: 'https://test-zbgisws.skgeodesy.sk/inspire_administrative_units_wfs/service.svc/get?SERVICE=WFS&amp;VERSION=2.0.0&amp;REQUEST=GetFeature&amp;STOREDQUERY_ID=urn:ogc:def:query:OGC-WFS::GetFeatureById&amp;id=auAdmBoundaryL.11119'"
16.11.2017 00:34:38 - "Exception: Timeout exceeded. URL: https://test-zbgisws.skgeodesy.sk/inspire_administrative_units_wfs/service.svc/get?SERVICE=WFS&amp;VERSION=2.0.0&amp;REQUEST=GetFeature&amp;STOREDQUERY_ID=urn:ogc:def:query:OGC-WFS::GetFeatureById&amp;id=auAdmBoundaryL.11119"
16.11.2017 00:34:38 - "Test Assertion 'au-ia.b.7: AdministrativeUnit.boundary': FAILED - 2893054 ms"
16.11.2017 00:34:38 - "Test Assertion 'au-ia.b.8: AdministrativeBoundary.admUnit and Condominium.admUnit': PASSED - 0 ms"
16.11.2017 00:34:38 - "Test Assertion 'au-ia.b.9: MaritimeZone.boundary': PASSED - 0 ms"
16.11.2017 00:34:38 - "Test Assertion 'au-ia.b.10: MaritimeZone.seaArea': PASSED - 1 ms"
16.11.2017 00:34:38 - "Test Assertion 'au-ia.b.11: MaritimeZone.baseline': PASSED - 0 ms"
16.11.2017 00:34:38 - "Test Case 'Feature references' finished: FAILED"
16.11.2017 00:34:38 - "Test Suite 'Conformance class: Information accessibility, Administrative Units' finished: FAILED"
16.11.2017 00:34:39 - Releasing resources
16.11.2017 00:34:39 - TestRunTask initialized
16.11.2017 00:34:39 - Skipping schema validation because no schema file has been set in the test suite. Data are only checked for well-formedness.
16.11.2017 00:34:39 - Validation ended with 0 error(s)
16.11.2017 00:34:39 - Compiling test script
16.11.2017 00:34:39 - Starting XQuery tests
16.11.2017 00:34:39 - "Testing 1 features"
16.11.2017 00:34:40 - "Indexing features (parsing errors: 0): 148 ms"
16.11.2017 00:34:40 - "Executing Test Suite: /home/tomcat/.etf/projects/ets-repository/data/reference-systems/ets-reference-systems-bsxets.xml"
16.11.2017 00:34:40 - "Statistics table: 0 ms"
16.11.2017 00:34:40 - "Test Suite 'Conformance class: Reference systems, General requirements' started"
16.11.2017 00:34:40 - "Test Case 'Spatial reference systems' started"
16.11.2017 00:34:40 - "Test Assertion 'rs.a.1: Spatial reference systems in feature geometries': FAILED - 0 ms"
16.11.2017 00:34:40 - "Test Assertion 'rs.a.2: Default spatial reference systems in feature collections': PASSED - 0 ms"
16.11.2017 00:34:40 - "Test Case 'Spatial reference systems' finished: FAILED"
16.11.2017 00:34:40 - "Test Case 'Temporal reference systems' started"
16.11.2017 00:34:40 - "Test Assertion 'rs.a.3: Temporal reference systems in features': PASSED - 0 ms"
16.11.2017 00:34:40 - "Test Case 'Temporal reference systems' finished: PASSED"
16.11.2017 00:34:40 - "Test Suite 'Conformance class: Reference systems, General requirements' finished: FAILED"
16.11.2017 00:34:40 - Releasing resources
16.11.2017 00:34:40 - TestRunTask initialized
16.11.2017 00:34:40 - Skipping schema validation because no schema file has been set in the test suite. Data are only checked for well-formedness.
16.11.2017 00:34:40 - Validation ended with 0 error(s)
16.11.2017 00:34:40 - Compiling test script
16.11.2017 00:34:40 - Starting XQuery tests
16.11.2017 00:34:40 - "Testing 1 features"
16.11.2017 00:34:40 - "Executing Test Suite: /home/tomcat/.etf/projects/ets-repository/data-au/au-rs/ets-au-rs-bsxets.xml"
16.11.2017 00:34:40 - "Statistics table: 0 ms"
16.11.2017 00:34:40 - "Test Suite 'Conformance class: Reference systems, Administrative Units' started"
16.11.2017 00:34:40 - "Test Case 'Additional theme-specific rules for reference systems' started"
16.11.2017 00:34:40 - "Test Assertion 'au-rs.a.1: Test always passes': PASSED - 0 ms"
16.11.2017 00:34:40 - "Test Case 'Additional theme-specific rules for reference systems' finished: PASSED"
16.11.2017 00:34:40 - "Test Suite 'Conformance class: Reference systems, Administrative Units' finished: PASSED"
16.11.2017 00:34:41 - Releasing resources
16.11.2017 00:34:41 - Changed state from INITIALIZED to RUNNING
16.11.2017 00:34:41 - Duration: 51min
16.11.2017 00:34:41 - TestRun finished
16.11.2017 00:34:41 - Changed state from RUNNING to COMPLETED
