12.12.2017 02:02:14 - Preparing Test Run downloadService_17316219_Geodetick&yacute; a kartografick&yacute; &uacute;stav Bratislava(GK&Uacute;)_INSPIRE Download Service - Geographical Names (initiated Tue Dec 12 02:02:14 CET 2017)
12.12.2017 02:02:14 - Resolving Executable Test Suite dependencies
12.12.2017 02:02:14 - Preparing 2 Test Task:
12.12.2017 02:02:14 -  TestTask 1 (53d6658f-2594-4a33-8e6f-dac7d3f5616f)
12.12.2017 02:02:14 -  will perform tests on Test Object 'INSPIRE Download Service - Geographical Names' by using Executable Test Suite 'WFS 2.0 (OGC 09-025r2/ISO 19142) Conformance Test Suite (EID: 95a1b6fc-2b55-3d43-9502-3b8b605bda10, V: 1.26.0 )'
12.12.2017 02:02:14 -  with parameters: 
12.12.2017 02:02:14 - etf.testcases = *
12.12.2017 02:02:14 -  TestTask 2 (06adfb5a-23e0-4b8c-8d75-21240779e997)
12.12.2017 02:02:14 -  will perform tests on Test Object 'INSPIRE Download Service - Geographical Names' by using Executable Test Suite 'Conformance Class: Download Service - Direct WFS (EID: ed2d3501-d700-4ff9-b9bf-070dece8ddbd, V: 1.0.2 )'
12.12.2017 02:02:14 -  with parameters: 
12.12.2017 02:02:14 - etf.testcases = *
12.12.2017 02:02:14 - Test Tasks prepared and ready to be executed. Waiting for the scheduler to start.
12.12.2017 02:02:14 - Setting state to CREATED
12.12.2017 02:02:14 - Changed state from CREATED to INITIALIZING
12.12.2017 02:02:14 - Starting TestRun.2ff8109b-b375-46ca-a1fc-75a6110fbb47 at 2017-12-12T02:02:16+01:00
12.12.2017 02:02:16 - Changed state from INITIALIZING to INITIALIZED
12.12.2017 02:02:16 - TestRunTask initialized
12.12.2017 02:02:16 - Invoking TEAM Engine remotely. This may take a while. Progress messages are not supported.
12.12.2017 02:02:16 - Timeout is set to: 20min
12.12.2017 02:21:11 - Results received.
12.12.2017 02:21:12 - Internal ETS model updated.
12.12.2017 02:21:12 - Transforming results.
12.12.2017 02:21:12 - 68 of 6819 assertions passed
12.12.2017 02:21:12 - Releasing resources
12.12.2017 02:21:12 - Project Properties: 
12.12.2017 02:21:12 - etf.testcases - * 
12.12.2017 02:21:12 - serviceEndpoint - https://zbgisws.skgeodesy.sk/inspire_geographical_names_wfs/service.svc/get?ACCEPTVERSIONS=2.0.0&request=GetCapabilities&service=WFS&VERSION=2.0.0 
12.12.2017 02:21:12 - username -  
12.12.2017 02:21:12 - authUser -  
12.12.2017 02:21:12 - authMethod - basic 
12.12.2017 02:21:12 - TestRunTask initialized
12.12.2017 02:21:16 ERROR org.xml.sax.SAXException: Fatal error: org.xml.sax.SAXParseException; lineNumber: 267; columnNumber: 103; cvc-elt.4.2: Cannot resolve 'inspire_common:citationInspireInteroperabilityRegulation_eng' to a type definition for element 'Specification'. Response did not validate against schema 'http://www.opengis.net/wfs/2.0 https://zbgisws.skgeodesy.sk/rest/directories/arcgisforinspire/schema/ogc/wfs/2.0/wfs.xsd http://inspire.ec.europa.eu/schemas/inspire_dls/1.0 https://zbgisws.skgeodesy.sk/rest/directories/arcgisforinspire/schema/networkservices/inspire_fds/1.0/inspire_dls.xsd'.
12.12.2017 02:21:20 ERROR Service returned an exception: Operation request contains an invalid parameter value.
12.12.2017 02:21:20 ERROR Assertion failed with error 'TR.unexpectedException'
12.12.2017 02:21:20 ERROR Assertion failed with error 'TR.initializationAndBasicChecksFailed'
12.12.2017 02:21:21 ERROR Assertion failed with error 'TR.initializationAndBasicChecksFailed'
12.12.2017 02:21:21 ERROR Assertion failed with error 'TR.initializationAndBasicChecksFailed'
12.12.2017 02:21:21 - Releasing resources
12.12.2017 02:21:21 - Changed state from INITIALIZED to RUNNING
12.12.2017 02:21:21 - Duration: 19min
12.12.2017 02:21:21 - TestRun finished
12.12.2017 02:21:21 - Changed state from RUNNING to COMPLETED
