06.02.2018 23:05:51 - Preparing Test Run interoperability_17316219_Geodetick&yacute;akartografick&yacute;&uacute;stavBratislava_tn-ra:RailwayLink (initiated Tue Feb 06 23:05:51 CET 2018)
06.02.2018 23:05:51 - Resolving Executable Test Suite dependencies
06.02.2018 23:05:51 - Preparing 11 Test Task:
06.02.2018 23:05:51 -  TestTask 1 (34e06af2-2a09-4130-809d-2e9238d2acc8)
06.02.2018 23:05:51 -  will perform tests on Test Object 'get.xml' by using Executable Test Suite 'Conformance class: INSPIRE GML application schemas, General requirements (EID: 09820daf-62b2-4fa3-a95f-56a0d2b7c4d8, V: 0.2.4 )'
06.02.2018 23:05:51 -  with parameters: 
06.02.2018 23:05:51 - etf.testcases = *
06.02.2018 23:05:51 -  TestTask 2 (668c1612-6e63-4aa7-921b-9e2c40339890)
06.02.2018 23:05:51 -  will perform tests on Test Object 'get.xml' by using Executable Test Suite 'Conformance class: GML application schemas, Transport Networks (EID: 9af1c865-1cf0-43ff-9250-069df01b0948, V: 0.2.1 )'
06.02.2018 23:05:51 -  with parameters: 
06.02.2018 23:05:51 - etf.testcases = *
06.02.2018 23:05:51 -  TestTask 3 (b3ad05b3-56e3-4633-8b13-e06eb9adae0f)
06.02.2018 23:05:51 -  will perform tests on Test Object 'get.xml' by using Executable Test Suite 'LAZY.4441cbde-371f-4899-90b3-145f4fd08ebc'
06.02.2018 23:05:51 -  with parameters: 
06.02.2018 23:05:51 - etf.testcases = *
06.02.2018 23:05:51 -  TestTask 4 (1f30c444-c3b7-4e8b-bb6e-d42186f6d3be)
06.02.2018 23:05:51 -  will perform tests on Test Object 'get.xml' by using Executable Test Suite 'Conformance class: Application schema, Rail Transport Networks (EID: e2610a9f-6432-489d-8238-92b1193e7a3d, V: 0.2.1 )'
06.02.2018 23:05:51 -  with parameters: 
06.02.2018 23:05:51 - etf.testcases = *
06.02.2018 23:05:51 -  TestTask 5 (8baccc4f-8f04-4386-b335-42e7c5c7297b)
06.02.2018 23:05:51 -  will perform tests on Test Object 'get.xml' by using Executable Test Suite 'LAZY.545f9e49-009b-4114-9333-7ca26413b5d4'
06.02.2018 23:05:51 -  with parameters: 
06.02.2018 23:05:51 - etf.testcases = *
06.02.2018 23:05:51 -  TestTask 6 (f8028e58-76f5-4ba9-9467-7cccd326cd9e)
06.02.2018 23:05:51 -  will perform tests on Test Object 'get.xml' by using Executable Test Suite 'LAZY.61070ae8-13cb-4303-a340-72c8b877b00a'
06.02.2018 23:05:51 -  with parameters: 
06.02.2018 23:05:51 - etf.testcases = *
06.02.2018 23:05:51 -  TestTask 7 (105ba838-bc99-48b7-9b0e-79cdd0e86640)
06.02.2018 23:05:51 -  will perform tests on Test Object 'get.xml' by using Executable Test Suite 'Conformance class: Data consistency, Transport Networks (EID: 733af9a0-312b-4f71-9aa2-977cd2134d23, V: 0.2.2 )'
06.02.2018 23:05:51 -  with parameters: 
06.02.2018 23:05:51 - etf.testcases = *
06.02.2018 23:05:51 -  TestTask 8 (b2fa0f74-d5b6-4e8e-a677-9c680143ba63)
06.02.2018 23:05:51 -  will perform tests on Test Object 'get.xml' by using Executable Test Suite 'LAZY.499937ea-0590-42d2-bd7a-1cafff35ecdb'
06.02.2018 23:05:51 -  with parameters: 
06.02.2018 23:05:51 - etf.testcases = *
06.02.2018 23:05:51 -  TestTask 9 (b6643007-1763-43c5-8d00-58f83c5f2401)
06.02.2018 23:05:51 -  will perform tests on Test Object 'get.xml' by using Executable Test Suite 'Conformance class: Information accessibility, Transport Networks (EID: df5db9a4-b15f-4193-a6ff-6e9951af46f5, V: 0.2.2 )'
06.02.2018 23:05:51 -  with parameters: 
06.02.2018 23:05:51 - etf.testcases = *
06.02.2018 23:05:51 -  TestTask 10 (d8429c0e-29d1-4a44-b1a2-e35cdc14cc5a)
06.02.2018 23:05:51 -  will perform tests on Test Object 'get.xml' by using Executable Test Suite 'LAZY.63f586f0-080c-493b-8ca2-9919427440cc'
06.02.2018 23:05:51 -  with parameters: 
06.02.2018 23:05:51 - etf.testcases = *
06.02.2018 23:05:51 -  TestTask 11 (3e619324-c4a9-46c3-9b0e-0fa8651d2346)
06.02.2018 23:05:51 -  will perform tests on Test Object 'get.xml' by using Executable Test Suite 'Conformance class: Reference systems, Transport Networks (EID: 9d35024d-9dd7-43a9-afff-d5aea5f51595, V: 0.2.0 )'
06.02.2018 23:05:51 -  with parameters: 
06.02.2018 23:05:51 - etf.testcases = *
06.02.2018 23:05:51 - Test Tasks prepared and ready to be executed. Waiting for the scheduler to start.
06.02.2018 23:05:51 - Setting state to CREATED
06.02.2018 23:05:51 - Changed state from CREATED to INITIALIZING
06.02.2018 23:05:51 - Starting TestRun.793962b3-6eb4-4c28-90ad-a339a1891e95 at 2018-02-06T23:05:52+01:00
06.02.2018 23:05:52 - Changed state from INITIALIZING to INITIALIZED
06.02.2018 23:05:52 - TestRunTask initialized
06.02.2018 23:05:52 - Creating new tests databases to speed up tests.
06.02.2018 23:05:52 - Skipping schema validation because no schema file has been set in the test suite. Data are only checked for well-formedness.
06.02.2018 23:05:52 - Optimizing last database etf-tdb-7d7bfe81-fe0f-4eae-9259-0dd65f3283c5-0 
06.02.2018 23:05:52 - Import completed
06.02.2018 23:05:54 - Validation ended with 0 error(s)
06.02.2018 23:05:54 - Compiling test script
06.02.2018 23:05:54 - Starting XQuery tests
06.02.2018 23:05:55 - "Testing 1 features"
06.02.2018 23:05:55 - "Indexing features (parsing errors: 0): 41 ms"
06.02.2018 23:05:55 - "Executing Test Suite: /home/tomcat/.etf/projects/ets-repository/data/schemas/ets-schemas-bsxets.xml"
06.02.2018 23:05:55 - "Statistics table: 0 ms"
06.02.2018 23:05:55 - "Test Suite 'Conformance class: INSPIRE GML application schemas, General requirements' started"
06.02.2018 23:05:55 - "Test Case 'Schema' started"
06.02.2018 23:05:55 - "Test Assertion 'gmlas.a.1: Mapping of source data to INSPIRE': PASSED_MANUAL"
06.02.2018 23:05:55 - "Test Assertion 'gmlas.a.2: Modelling of additional spatial object types': PASSED_MANUAL"
06.02.2018 23:05:55 - "Test Case 'Schema' finished: PASSED_MANUAL"
06.02.2018 23:05:55 - "Test Case 'Schema validation' started"
06.02.2018 23:05:55 - "Test Assertion 'gmlas.b.1: xsi:schemaLocation attribute': PASSED - 0 ms"
06.02.2018 23:05:55 - "Validating get.xml"
06.02.2018 23:06:03 - "Duration: 8403 ms. Errors: 0."
06.02.2018 23:06:03 - "Test Assertion 'gmlas.b.2: validate XML documents': PASSED - 8403 ms"
06.02.2018 23:06:03 - "Test Case 'Schema validation' finished: PASSED"
06.02.2018 23:06:03 - "Test Case 'GML model' started"
06.02.2018 23:06:03 - "Test Assertion 'gmlas.c.1: Consistency with the GML model': PASSED - 0 ms"
06.02.2018 23:06:03 - "Test Assertion 'gmlas.c.2: nilReason attributes require xsi:nil=true': PASSED - 0 ms"
06.02.2018 23:06:03 - "Test Assertion 'gmlas.c.3: nilReason values': PASSED - 0 ms"
06.02.2018 23:06:03 - "Test Case 'GML model' finished: PASSED"
06.02.2018 23:06:03 - "Test Case 'Simple features' started"
06.02.2018 23:06:03 - "Test Assertion 'gmlas.d.1: No spatial topology objects': PASSED - 0 ms"
06.02.2018 23:06:03 - "Test Assertion 'gmlas.d.2: No non-linear interpolation': PASSED - 0 ms"
06.02.2018 23:06:03 - "Test Assertion 'gmlas.d.3: Surface geometry elements': PASSED - 0 ms"
06.02.2018 23:06:03 - "Test Assertion 'gmlas.d.4: No non-planar interpolation': PASSED - 0 ms"
06.02.2018 23:06:03 - "Test Assertion 'gmlas.d.5: Geometry elements': PASSED - 0 ms"
06.02.2018 23:06:03 - "Test Assertion 'gmlas.d.6: Point coordinates in gml:pos': PASSED - 0 ms"
06.02.2018 23:06:03 - "Test Assertion 'gmlas.d.7: Curve/Surface coordinates in gml:posList': PASSED - 0 ms"
06.02.2018 23:06:03 - "Test Assertion 'gmlas.d.8: No array property elements': PASSED - 0 ms"
06.02.2018 23:06:03 - "Test Assertion 'gmlas.d.9: 1, 2 or 3 coordinate dimensions': PASSED - 0 ms"
06.02.2018 23:06:03 - "Test Assertion 'gmlas.d.10: Validate geometries (1)': PASSED - 48 ms"
06.02.2018 23:06:03 - "Test Assertion 'gmlas.d.11: Validate geometries (2)': PASSED - 0 ms"
06.02.2018 23:06:03 - "Test Case 'Simple features' finished: PASSED"
06.02.2018 23:06:03 - "Test Case 'Code list values in basic data types' started"
06.02.2018 23:06:03 - "Test Assertion 'gmlas.e.1: GrammaticalNumber attributes': PASSED - 18 ms"
06.02.2018 23:06:03 - "Test Assertion 'gmlas.e.2: GrammaticalGender attributes': PASSED - 9 ms"
06.02.2018 23:06:03 - "Test Assertion 'gmlas.e.3: NameStatus attributes': PASSED - 5 ms"
06.02.2018 23:06:03 - "Test Assertion 'gmlas.e.4: Nativeness attributes': PASSED - 6 ms"
06.02.2018 23:06:03 - "Test Case 'Code list values in basic data types' finished: PASSED"
06.02.2018 23:06:03 - "Test Case 'Constraints' started"
06.02.2018 23:06:03 - "Test Assertion 'gmlas.f.1: At least one of the two attributes pronunciationSoundLink and pronunciationIPA shall not be void': PASSED - 0 ms"
06.02.2018 23:06:03 - "Test Case 'Constraints' finished: PASSED"
06.02.2018 23:06:03 - "Test Suite 'Conformance class: INSPIRE GML application schemas, General requirements' finished: PASSED_MANUAL"
06.02.2018 23:06:04 - Releasing resources
06.02.2018 23:06:04 - TestRunTask initialized
06.02.2018 23:06:04 - Recreating new tests databases as the Test Object has changed!
06.02.2018 23:06:04 - Skipping schema validation because no schema file has been set in the test suite. Data are only checked for well-formedness.
06.02.2018 23:06:04 - Optimizing last database etf-tdb-7d7bfe81-fe0f-4eae-9259-0dd65f3283c5-0 
06.02.2018 23:06:04 - Import completed
06.02.2018 23:06:04 - Validation ended with 0 error(s)
06.02.2018 23:06:04 - Compiling test script
06.02.2018 23:06:04 - Starting XQuery tests
06.02.2018 23:06:04 - "Testing 1 features"
06.02.2018 23:06:04 - "Indexing features (parsing errors: 0): 46 ms"
06.02.2018 23:06:04 - "Executing Test Suite: /home/tomcat/.etf/projects/ets-repository/data-tn/tn-gml/ets-tn-gml-bsxets.xml"
06.02.2018 23:06:04 - "Statistics table: 0 ms"
06.02.2018 23:06:04 - "Test Suite 'Conformance class: GML application schemas, Transport Networks' started"
06.02.2018 23:06:04 - "Test Case 'Basic test' started"
06.02.2018 23:06:04 - "Test Assertion 'tn-gml.a.1: Transport Network feature in dataset': PASSED - 1 ms"
06.02.2018 23:06:04 - "Test Case 'Basic test' finished: PASSED"
06.02.2018 23:06:04 - "Test Suite 'Conformance class: GML application schemas, Transport Networks' finished: PASSED"
06.02.2018 23:06:04 - Releasing resources
06.02.2018 23:06:04 - TestRunTask initialized
06.02.2018 23:06:04 - Skipping schema validation because no schema file has been set in the test suite. Data are only checked for well-formedness.
06.02.2018 23:06:04 - Validation ended with 0 error(s)
06.02.2018 23:06:04 - Compiling test script
06.02.2018 23:06:04 - Starting XQuery tests
06.02.2018 23:06:04 - "Testing 1 features"
06.02.2018 23:06:04 - "Indexing features (parsing errors: 0): 53 ms"
06.02.2018 23:06:04 - "Executing Test Suite: /home/tomcat/.etf/projects/ets-repository/data-tn/tn-as/ets-tn-as-bsxets.xml"
06.02.2018 23:06:04 - "Statistics table: 0 ms"
06.02.2018 23:06:04 - "Test Suite 'Conformance class: Application schema, Transport Networks Common' started"
06.02.2018 23:06:04 - "Test Case 'Code list values' started"
06.02.2018 23:06:04 - "Test Assertion 'tn-as.a.1: AccessRestrictionValue attributes': PASSED - 4 ms"
06.02.2018 23:06:04 - "Test Assertion 'tn-as.a.2: RestrictionTypeValue attributes': PASSED - 4 ms"
06.02.2018 23:06:04 - "Test Case 'Code list values' finished: PASSED"
06.02.2018 23:06:04 - "Test Case 'Constraints' started"
06.02.2018 23:06:04 - "Test Assertion 'tn-as.b.1: TrafficFlowDirection can only be associated with a spatial object of the type Link or LinkSequence.': PASSED - 0 ms"
06.02.2018 23:06:04 - "Test Assertion 'tn-as.b.2: All transport areas have an external object identifier.': PASSED - 0 ms"
06.02.2018 23:06:04 - "Test Assertion 'tn-as.b.3: All transport links have an external object identifier.': PASSED - 0 ms"
06.02.2018 23:06:04 - "Test Assertion 'tn-as.b.4: All transport link sequences have an external object identifier.': PASSED - 0 ms"
06.02.2018 23:06:04 - "Test Assertion 'tn-as.b.5: All transport link sets have an external object identifier.': PASSED - 0 ms"
06.02.2018 23:06:04 - "Test Assertion 'tn-as.b.6: All transport nodes have an external object identifier.': PASSED - 0 ms"
06.02.2018 23:06:04 - "Test Assertion 'tn-as.b.7: All transport points have an external object identifier.': PASSED - 0 ms"
06.02.2018 23:06:04 - "Test Assertion 'tn-as.b.8: All transport properties have an external object identifier.': PASSED - 0 ms"
06.02.2018 23:06:04 - "Test Assertion 'tn-as.b.9: A transport link sequence must be composed of transport links that all belong to the same transport network.': PASSED - 1 ms"
06.02.2018 23:06:04 - "Test Assertion 'tn-as.b.10: A transport link set must be composed of transport links and or transport link sequences that all belong to the same transport network.': PASSED - 0 ms"
06.02.2018 23:06:04 - "Test Case 'Constraints' finished: PASSED"
06.02.2018 23:06:04 - "Test Case 'Geometry' started"
06.02.2018 23:06:04 - "Test Assertion 'tn-as.c.1: No free transport nodes': PASSED - 0 ms"
06.02.2018 23:06:04 - "Test Assertion 'tn-as.c.2: Intersections only at crossings': PASSED_MANUAL"
06.02.2018 23:06:04 - "Test Case 'Geometry' finished: PASSED_MANUAL"
06.02.2018 23:06:04 - "Test Case 'Network connectivity' started"
06.02.2018 23:06:04 - "Test Assertion 'tn-as.d.1: Connectivity at crossings': PASSED_MANUAL"
06.02.2018 23:06:04 - "Test Assertion 'tn-as.d.2: Unconnected nodes': PASSED_MANUAL"
06.02.2018 23:06:04 - "Test Assertion 'tn-as.d.3: Connectivity tolerance': PASSED_MANUAL"
06.02.2018 23:06:04 - "Test Case 'Network connectivity' finished: PASSED_MANUAL"
06.02.2018 23:06:04 - "Test Case 'Object References' started"
06.02.2018 23:06:04 - "Test Assertion 'tn-as.e.1: Linear references': PASSED_MANUAL"
06.02.2018 23:06:04 - "Test Assertion 'tn-as.e.2: Inter-modal connections': PASSED - 0 ms"
06.02.2018 23:06:04 - "Test Case 'Object References' finished: PASSED_MANUAL"
06.02.2018 23:06:04 - "Test Suite 'Conformance class: Application schema, Transport Networks Common' finished: PASSED_MANUAL"
06.02.2018 23:06:05 - Releasing resources
06.02.2018 23:06:05 - TestRunTask initialized
06.02.2018 23:06:05 - Skipping schema validation because no schema file has been set in the test suite. Data are only checked for well-formedness.
06.02.2018 23:06:05 - Validation ended with 0 error(s)
06.02.2018 23:06:05 - Compiling test script
06.02.2018 23:06:05 - Starting XQuery tests
06.02.2018 23:06:05 - "Testing 1 features"
06.02.2018 23:06:05 - "Executing Test Suite: /home/tomcat/.etf/projects/ets-repository/data-tn/tn-ra-as/ets-tn-ra-as-bsxets.xml"
06.02.2018 23:06:05 - "Statistics table: 1 ms"
06.02.2018 23:06:05 - "Test Suite 'Conformance class: Application schema, Rail Transport Networks' started"
06.02.2018 23:06:05 - "Test Case 'Code list values' started"
06.02.2018 23:06:05 - "Test Assertion 'tn-ra-as.a.1: FormOfRailwayNodeValue attributes': PASSED - 5 ms"
06.02.2018 23:06:05 - "Test Assertion 'tn-ra-as.a.2: RailwayTypeValue attributes': PASSED - 7 ms"
06.02.2018 23:06:05 - "Test Assertion 'tn-ra-as.a.3: RailwayUseValue attributes': PASSED - 3 ms"
06.02.2018 23:06:05 - "Test Case 'Code list values' finished: PASSED"
06.02.2018 23:06:05 - "Test Case 'Constraints' started"
06.02.2018 23:06:05 - "Test Assertion 'tn-ra-as.b.1: DesignSpeed can only be associated with a spatial object that is part of a railway transport network.': PASSED - 0 ms"
06.02.2018 23:06:05 - "Test Assertion 'tn-ra-as.b.2: NominalTrackGauge can only be associated with a spatial object that is part of a railway transport network.': PASSED - 0 ms"
06.02.2018 23:06:05 - "Test Assertion 'tn-ra-as.b.3: NumberOfTracks can only be associated with a spatial object that is part of a railway transport network.': PASSED - 1 ms"
06.02.2018 23:06:05 - "Test Assertion 'tn-ra-as.b.4: RailwayElectrification can only be associated with a spatial object that is part of a railway transport network.': PASSED - 0 ms"
06.02.2018 23:06:05 - "Test Assertion 'tn-ra-as.b.5: RailwayStationCode can only be associated with a spatial object that is part of a railway transport network.': PASSED - 0 ms"
06.02.2018 23:06:05 - "Test Assertion 'tn-ra-as.b.6: RailwayType can only be associated with a spatial object that is part of a railway transport network.': PASSED - 0 ms"
06.02.2018 23:06:05 - "Test Assertion 'tn-ra-as.b.7: RailwayUse can only be associated with a spatial object that is part of a railway transport network.': PASSED - 0 ms"
06.02.2018 23:06:05 - "Test Assertion 'tn-ra-as.b.8: For a railway station node, the value for the ""formOfNode"" attribute shall always be ""RailwayStop"".': PASSED - 0 ms"
06.02.2018 23:06:05 - "Test Assertion 'tn-ra-as.b.9: For a railway yard node, the value for the ""formOfNode"" attribute shall always be ""RailwayStop"".': PASSED - 0 ms"
06.02.2018 23:06:05 - "Test Case 'Constraints' finished: PASSED"
06.02.2018 23:06:05 - "Test Case 'Link centrelines' started"
06.02.2018 23:06:05 - "Test Assertion 'tn-ro-as.a.1: Link centrelines test': PASSED_MANUAL"
06.02.2018 23:06:05 - "Test Case 'Link centrelines' finished: PASSED_MANUAL"
06.02.2018 23:06:05 - "Test Suite 'Conformance class: Application schema, Rail Transport Networks' finished: PASSED_MANUAL"
06.02.2018 23:06:05 - Releasing resources
06.02.2018 23:06:05 - TestRunTask initialized
06.02.2018 23:06:05 - Skipping schema validation because no schema file has been set in the test suite. Data are only checked for well-formedness.
06.02.2018 23:06:05 - Validation ended with 0 error(s)
06.02.2018 23:06:05 - Compiling test script
06.02.2018 23:06:05 - Starting XQuery tests
06.02.2018 23:06:05 - "Testing 1 features"
06.02.2018 23:06:05 - "Executing Test Suite: /home/tomcat/.etf/projects/ets-repository/data-encoding/inspire-gml/ets-inspire-gml-bsxets.xml"
06.02.2018 23:06:05 - "Statistics table: 1 ms"
06.02.2018 23:06:05 - "Test Suite 'Conformance class: INSPIRE GML encoding' started"
06.02.2018 23:06:05 - "Test Case 'Basic tests' started"
06.02.2018 23:06:05 - "Test Assertion 'gml.a.1: Errors loading the XML documents': PASSED - 0 ms"
06.02.2018 23:06:05 - "Test Assertion 'gml.a.2: Document root element': PASSED - 0 ms"
06.02.2018 23:06:05 - "Test Assertion 'gml.a.3: Character encoding': NOT_APPLICABLE"
06.02.2018 23:06:05 - "Test Case 'Basic tests' finished: PASSED"
06.02.2018 23:06:05 - "Test Suite 'Conformance class: INSPIRE GML encoding' finished: PASSED"
06.02.2018 23:06:05 - Releasing resources
06.02.2018 23:06:05 - TestRunTask initialized
06.02.2018 23:06:05 - Skipping schema validation because no schema file has been set in the test suite. Data are only checked for well-formedness.
06.02.2018 23:06:05 - Validation ended with 0 error(s)
06.02.2018 23:06:05 - Compiling test script
06.02.2018 23:06:05 - Starting XQuery tests
06.02.2018 23:06:05 - "Testing 1 features"
06.02.2018 23:06:05 - "Indexing features (parsing errors: 0): 46 ms"
06.02.2018 23:06:05 - "Executing Test Suite: /home/tomcat/.etf/projects/ets-repository/data/data-consistency/ets-data-consistency-bsxets.xml"
06.02.2018 23:06:05 - "Statistics table: 0 ms"
06.02.2018 23:06:05 - "Test Suite 'Conformance class: Data consistency, General requirements' started"
06.02.2018 23:06:05 - "Test Case 'Version consistency' started"
06.02.2018 23:06:05 - "Test Assertion 'dc.a.1: Version lifespan plausible': PASSED - 1 ms"
06.02.2018 23:06:05 - "Test Assertion 'dc.a.2: Unique identifier persistency': PASSED_MANUAL"
06.02.2018 23:06:05 - "Test Assertion 'dc.a.3: Spatial object type stable': PASSED_MANUAL"
06.02.2018 23:06:05 - "Test Case 'Version consistency' finished: PASSED_MANUAL"
06.02.2018 23:06:05 - "Test Case 'Temporal consistency' started"
06.02.2018 23:06:05 - "Test Assertion 'dc.b.1: Valid time plausible': PASSED - 0 ms"
06.02.2018 23:06:05 - "Test Case 'Temporal consistency' finished: PASSED"
06.02.2018 23:06:05 - "Test Suite 'Conformance class: Data consistency, General requirements' finished: PASSED_MANUAL"
06.02.2018 23:06:06 - Releasing resources
06.02.2018 23:06:06 - TestRunTask initialized
06.02.2018 23:06:06 - Skipping schema validation because no schema file has been set in the test suite. Data are only checked for well-formedness.
06.02.2018 23:06:06 - Validation ended with 0 error(s)
06.02.2018 23:06:06 - Compiling test script
06.02.2018 23:06:06 - Starting XQuery tests
06.02.2018 23:06:06 - "Testing 1 features"
06.02.2018 23:06:06 - "Indexing features (parsing errors: 0): 49 ms"
06.02.2018 23:06:06 - "Executing Test Suite: /home/tomcat/.etf/projects/ets-repository/data-tn/tn-dc/ets-tn-dc-bsxets.xml"
06.02.2018 23:06:06 - "Statistics table: 0 ms"
06.02.2018 23:06:06 - "Test Suite 'Conformance class: Data consistency, Transport Networks' started"
06.02.2018 23:06:06 - "Test Case 'Spatial consistency' started"
06.02.2018 23:06:06 - "Test Assertion 'tn-dc.a.1: Each Transport Network Link or Node geometry is within a Network Area geometry (Road Transport Networks)': PASSED - 0 ms"
06.02.2018 23:06:06 - "Test Assertion 'tn-dc.a.2: Each Transport Network Link or Node geometry is within a Network Area geometry (Railway Transport Networks)': PASSED - 0 ms"
06.02.2018 23:06:06 - "Test Assertion 'tn-dc.a.3: Each Transport Network Link or Node geometry is within a Network Area geometry (Waterway Transport Networks)': PASSED - 0 ms"
06.02.2018 23:06:06 - "Test Assertion 'tn-dc.a.4: Each Transport Network Link or Node geometry is within a Network Area geometry (Air Transport Networks)': PASSED - 0 ms"
06.02.2018 23:06:06 - "Test Assertion 'tn-dc.a.5: Manual review': PASSED_MANUAL"
06.02.2018 23:06:06 - "Test Case 'Spatial consistency' finished: PASSED_MANUAL"
06.02.2018 23:06:06 - "Test Suite 'Conformance class: Data consistency, Transport Networks' finished: PASSED_MANUAL"
06.02.2018 23:06:06 - Releasing resources
06.02.2018 23:06:06 - TestRunTask initialized
06.02.2018 23:06:06 - Skipping schema validation because no schema file has been set in the test suite. Data are only checked for well-formedness.
06.02.2018 23:06:06 - Validation ended with 0 error(s)
06.02.2018 23:06:06 - Compiling test script
06.02.2018 23:06:06 - Starting XQuery tests
06.02.2018 23:06:06 - "Testing 1 features"
06.02.2018 23:06:06 - "Indexing features (parsing errors: 0): 40 ms"
06.02.2018 23:06:06 - "Executing Test Suite: /home/tomcat/.etf/projects/ets-repository/data/information-accessibility/ets-information-accessibility-bsxets.xml"
06.02.2018 23:06:06 - "Statistics table: 1 ms"
06.02.2018 23:06:06 - "Test Suite 'Conformance class: Information accessibility, General requirements' started"
06.02.2018 23:06:06 - "Test Case 'Coordinate reference systems (CRS)' started"
06.02.2018 23:06:06 - "Test Assertion 'ia.a.1: CRS publicly accessible via HTTP': FAILED - 1 ms"
06.02.2018 23:06:06 - "Test Case 'Coordinate reference systems (CRS)' finished: FAILED"
06.02.2018 23:06:06 - "Test Suite 'Conformance class: Information accessibility, General requirements' finished: FAILED"
06.02.2018 23:06:07 - Releasing resources
06.02.2018 23:06:07 - TestRunTask initialized
06.02.2018 23:06:07 - Skipping schema validation because no schema file has been set in the test suite. Data are only checked for well-formedness.
06.02.2018 23:06:07 - Validation ended with 0 error(s)
06.02.2018 23:06:07 - Compiling test script
06.02.2018 23:06:07 - Starting XQuery tests
06.02.2018 23:06:07 - "Testing 1 features"
06.02.2018 23:06:07 - "Executing Test Suite: /home/tomcat/.etf/projects/ets-repository/data-tn/tn-ia/ets-tn-ia-bsxets.xml"
06.02.2018 23:06:07 - "Statistics table: 7 ms"
06.02.2018 23:06:07 - "Test Suite 'Conformance class: Information accessibility, Transport Networks' started"
06.02.2018 23:06:07 - "Test Case 'Code lists' started"
06.02.2018 23:06:07 - "Test Assertion 'tn-ia.a.1: Code list extensions accessible': PASSED - 0 ms"
06.02.2018 23:06:07 - "Test Case 'Code lists' finished: PASSED"
06.02.2018 23:06:07 - "Test Case 'Feature references' started"
06.02.2018 23:06:07 - "Test Assertion 'tn-ia.b.1: MarkerPost.route': PASSED - 1 ms"
06.02.2018 23:06:07 - "Test Assertion 'tn-ia.b.2: TransportLinkSet.post': PASSED - 0 ms"
06.02.2018 23:06:07 - "Test Case 'Feature references' finished: PASSED"
06.02.2018 23:06:07 - "Test Suite 'Conformance class: Information accessibility, Transport Networks' finished: PASSED"
06.02.2018 23:06:07 - Releasing resources
06.02.2018 23:06:07 - TestRunTask initialized
06.02.2018 23:06:07 - Skipping schema validation because no schema file has been set in the test suite. Data are only checked for well-formedness.
06.02.2018 23:06:07 - Validation ended with 0 error(s)
06.02.2018 23:06:07 - Compiling test script
06.02.2018 23:06:07 - Starting XQuery tests
06.02.2018 23:06:07 - "Testing 1 features"
06.02.2018 23:06:07 - "Indexing features (parsing errors: 0): 40 ms"
06.02.2018 23:06:07 - "Executing Test Suite: /home/tomcat/.etf/projects/ets-repository/data/reference-systems/ets-reference-systems-bsxets.xml"
06.02.2018 23:06:07 - "Statistics table: 0 ms"
06.02.2018 23:06:07 - "Test Suite 'Conformance class: Reference systems, General requirements' started"
06.02.2018 23:06:07 - "Test Case 'Spatial reference systems' started"
06.02.2018 23:06:07 - "Test Assertion 'rs.a.1: Spatial reference systems in feature geometries': FAILED - 0 ms"
06.02.2018 23:06:07 - "Test Assertion 'rs.a.2: Default spatial reference systems in feature collections': PASSED - 0 ms"
06.02.2018 23:06:07 - "Test Case 'Spatial reference systems' finished: FAILED"
06.02.2018 23:06:07 - "Test Case 'Temporal reference systems' started"
06.02.2018 23:06:07 - "Test Assertion 'rs.a.3: Temporal reference systems in features': PASSED - 0 ms"
06.02.2018 23:06:07 - "Test Case 'Temporal reference systems' finished: PASSED"
06.02.2018 23:06:07 - "Test Suite 'Conformance class: Reference systems, General requirements' finished: FAILED"
06.02.2018 23:06:08 - Releasing resources
06.02.2018 23:06:08 - TestRunTask initialized
06.02.2018 23:06:08 - Skipping schema validation because no schema file has been set in the test suite. Data are only checked for well-formedness.
06.02.2018 23:06:08 - Validation ended with 0 error(s)
06.02.2018 23:06:08 - Compiling test script
06.02.2018 23:06:08 - Starting XQuery tests
06.02.2018 23:06:08 - "Testing 1 features"
06.02.2018 23:06:08 - "Executing Test Suite: /home/tomcat/.etf/projects/ets-repository/data-tn/tn-rs/ets-tn-rs-bsxets.xml"
06.02.2018 23:06:08 - "Statistics table: 1 ms"
06.02.2018 23:06:08 - "Test Suite 'Conformance class: Reference systems, Transport Networks' started"
06.02.2018 23:06:08 - "Test Case 'Additional theme-specific rules for reference systems' started"
06.02.2018 23:06:08 - "Test Assertion 'tn-rs.a.1: Test always passes': PASSED - 0 ms"
06.02.2018 23:06:08 - "Test Case 'Additional theme-specific rules for reference systems' finished: PASSED"
06.02.2018 23:06:08 - "Test Suite 'Conformance class: Reference systems, Transport Networks' finished: PASSED"
06.02.2018 23:06:08 - Releasing resources
06.02.2018 23:06:08 - Changed state from INITIALIZED to RUNNING
06.02.2018 23:06:08 - Duration: 17sec
06.02.2018 23:06:08 - TestRun finished
06.02.2018 23:06:08 - Changed state from RUNNING to COMPLETED
