19.12.2017 23:24:31 - Preparing Test Run downloadService_17316219_Geodetick&yacute; a kartografick&yacute; &uacute;stav Bratislava(GK&Uacute;)_INSPIRE Download Service - Geographical Names (initiated Tue Dec 19 23:24:31 CET 2017)
19.12.2017 23:24:31 - Resolving Executable Test Suite dependencies
19.12.2017 23:24:31 - Preparing 2 Test Task:
19.12.2017 23:24:31 -  TestTask 1 (6e126da4-6231-4366-805e-773234bfd3e0)
19.12.2017 23:24:31 -  will perform tests on Test Object 'INSPIRE Download Service - Geographical Names' by using Executable Test Suite 'WFS 2.0 (OGC 09-025r2/ISO 19142) Conformance Test Suite (EID: 95a1b6fc-2b55-3d43-9502-3b8b605bda10, V: 1.26.0 )'
19.12.2017 23:24:31 -  with parameters: 
19.12.2017 23:24:31 - etf.testcases = *
19.12.2017 23:24:31 -  TestTask 2 (6fd91932-59ea-4b3e-95b9-0827800286b6)
19.12.2017 23:24:31 -  will perform tests on Test Object 'INSPIRE Download Service - Geographical Names' by using Executable Test Suite 'Conformance Class: Download Service - Direct WFS (EID: ed2d3501-d700-4ff9-b9bf-070dece8ddbd, V: 1.0.2 )'
19.12.2017 23:24:31 -  with parameters: 
19.12.2017 23:24:31 - etf.testcases = *
19.12.2017 23:24:31 - Test Tasks prepared and ready to be executed. Waiting for the scheduler to start.
19.12.2017 23:24:31 - Setting state to CREATED
19.12.2017 23:24:31 - Changed state from CREATED to INITIALIZING
19.12.2017 23:24:31 - Starting TestRun.e2778112-6638-4f16-ad34-09dce1ecc0b4 at 2017-12-19T23:24:33+01:00
19.12.2017 23:24:33 - Changed state from INITIALIZING to INITIALIZED
19.12.2017 23:24:33 - TestRunTask initialized
19.12.2017 23:24:33 - Invoking TEAM Engine remotely. This may take a while. Progress messages are not supported.
19.12.2017 23:24:33 - Timeout is set to: 20min
19.12.2017 23:41:21 - Results received.
19.12.2017 23:41:22 - Internal ETS model updated.
19.12.2017 23:41:22 - Transforming results.
19.12.2017 23:41:22 - 69 of 6918 assertions passed
19.12.2017 23:41:23 - Releasing resources
19.12.2017 23:41:23 - Project Properties: 
19.12.2017 23:41:23 - etf.testcases - * 
19.12.2017 23:41:23 - serviceEndpoint - https://zbgisws.skgeodesy.sk/inspire_geographical_names_wfs/service.svc/get?ACCEPTVERSIONS=2.0.0&request=GetCapabilities&service=WFS&VERSION=2.0.0 
19.12.2017 23:41:23 - username -  
19.12.2017 23:41:23 - authUser -  
19.12.2017 23:41:23 - authMethod - basic 
19.12.2017 23:41:23 - TestRunTask initialized
19.12.2017 23:41:33 ERROR Service returned an exception: Operation request contains an invalid parameter value.
19.12.2017 23:41:33 ERROR Assertion failed with error 'TR.unexpectedException'
19.12.2017 23:41:34 ERROR Assertion failed with error 'TR.initializationAndBasicChecksFailed'
19.12.2017 23:41:34 ERROR Assertion failed with error 'TR.initializationAndBasicChecksFailed'
19.12.2017 23:41:34 ERROR Assertion failed with error 'TR.initializationAndBasicChecksFailed'
19.12.2017 23:41:34 - Releasing resources
19.12.2017 23:41:34 - Changed state from INITIALIZED to RUNNING
19.12.2017 23:41:34 - Duration: 17min
19.12.2017 23:41:34 - TestRun finished
19.12.2017 23:41:34 - Changed state from RUNNING to COMPLETED
