<svg xmlns="http://www.w3.org/2000/svg" width="144" height="18" viewBox="0 0 144 18">
  <text id="中興工程研究大樓" transform="translate(0 16)" fill="rgba(0,0,0,0)" font-size="18" font-family="GenYoGothicTW-M, GenYoGothic TW"><tspan x="0" y="0">中興工程研究大樓</tspan></text>
</svg>
