{
  "type": "FeatureCollection",
  "crs": { "type": "name", "properties": { "name": "EPSG:4326" } },
  "features": [
    {
      "type": "Feature",
      "id": 1,
      "geometry": {
        "type": "Point",
        "coordinates": [19.953669997027532, 50.029820617392389]
      },
      "properties": {
        "objectid": 1,
        "id": 55,
        "wydzial": "Wydział\u0088 Informatyki",
        "koszt": "688455,6",
        "od_daty": "2015",
        "do_daty": "2017",
        "rodzaj": "projekt (zadanie)",
        "lokalizacj": "Fragment ulicy Kamińskiego",
        "rozgłasza": "FreeWifi-Krakow",
        "zarzadca": "T-mobile Polska SA",
        "opis": "Projekt sfinansowany z budżetu obywatelskiego"
      }
    },
    {
      "type": "Feature",
      "id": 2,
      "geometry": {
        "type": "Point",
        "coordinates": [20.006455475760937, 50.0947406237674]
      },
      "properties": {
        "objectid": 2,
        "id": 53,
        "wydzial": "Wydzia\u0088ł Informatyki",
        "koszt": "688455,6",
        "od_daty": "2015",
        "do_daty": "2017",
        "rodzaj": "projekt (zadanie)",
        "lokalizacj": "Rejon Parku",
        "rozgłasza": "FreeWifi-Krakow",
        "zarzadca": "T-mobile Polska SA",
        "opis": "Projekt sfinansowany z budżetu obywatelskiego"
      }
    },
    {
      "type": "Feature",
      "id": 3,
      "geometry": {
        "type": "Point",
        "coordinates": [19.853144517636714, 50.047727042445523]
      },
      "properties": {
        "objectid": 3,
        "id": 52,
        "wydzial": "Wydzia\u0088ł Informatyki",
        "koszt": "688455,6",
        "od_daty": "2015",
        "do_daty": "2017",
        "rodzaj": "projekt (zadanie)",
        "lokalizacj": "Las Wolski",
        "rozgłasza": "FreeWifi-Krakow",
        "zarzadca": "T-mobile Polska SA",
        "opis": "Projekt sfinansowany z budżetu obywatelskiego"
      }
    },
    {
      "type": "Feature",
      "id": 4,
      "geometry": {
        "type": "Point",
        "coordinates": [19.914259995124677, 50.065414746591877]
      },
      "properties": {
        "objectid": 4,
        "id": 51,
        "wydzial": "Wydzia\u0088ł Informatyki",
        "koszt": "688455,6",
        "od_daty": "2015",
        "do_daty": "2017",
        "rodzaj": "projekt (zadanie)",
        "lokalizacj": "Fragment Parku Jordana",
        "rozgłasza": "FreeWifi-Krakow",
        "zarzadca": "T-mobile Polska SA",
        "opis": "Projekt sfinansowany z budżetu obywatelskiego"
      }
    },
    {
      "type": "Feature",
      "id": 5,
      "geometry": {
        "type": "Point",
        "coordinates": [19.965865731213437, 50.086738659597643]
      },
      "properties": {
        "objectid": 5,
        "id": 50,
        "wydzial": "Wydzia\u0088ł Informatyki",
        "koszt": "688455,6",
        "od_daty": "2015",
        "do_daty": "2017",
        "rodzaj": "projekt (zadanie)",
        "lokalizacj": "Park przy ul. Dominikanów",
        "rozgłasza": "FreeWifi-Krakow",
        "zarzadca": "T-mobile Polska SA",
        "opis": "Projekt sfinansowany z budżetu obywatelskiego"
      }
    },
    {
      "type": "Feature",
      "id": 6,
      "geometry": {
        "type": "Point",
        "coordinates": [19.942301653637863, 50.059523939993767]
      },
      "properties": {
        "objectid": 6,
        "id": 49,
        "wydzial": "Wydzia\u0088ł Informatyki",
        "koszt": "688455,6",
        "od_daty": "2015",
        "do_daty": "2017",
        "rodzaj": "projekt (zadanie)",
        "lokalizacj": "Rejon skrzyżowania pod Pocztą Głowna",
        "rozgłasza": "FreeWifi-Krakow",
        "zarzadca": "T-mobile Polska SA",
        "opis": "Projekt sfinansowany z budżetu obywatelskiego"
      }
    },
    {
      "type": "Feature",
      "id": 7,
      "geometry": {
        "type": "Point",
        "coordinates": [19.945053509028455, 50.067214548099628]
      },
      "properties": {
        "objectid": 7,
        "id": 48,
        "wydzial": "Wydział\u0088 Informatyki",
        "koszt": "688455,6",
        "od_daty": "2015",
        "do_daty": "2017",
        "rodzaj": "projekt (zadanie)",
        "lokalizacj": "Skrzyżowanie ulic Pawia i Kurniki",
        "rozgłasza": "FreeWifi-Krakow",
        "zarzadca": "T-mobile Polska SA",
        "opis": "Projekt sfinansowany z budżetu obywatelskiego"
      }
    },
    {
      "type": "Feature",
      "id": 8,
      "geometry": {
        "type": "Point",
        "coordinates": [19.948456143763664, 50.04193541968192]
      },
      "properties": {
        "objectid": 8,
        "id": 47,
        "wydzial": "Wydzia\u0088ł Informatyki",
        "koszt": "688455,6",
        "od_daty": "2015",
        "do_daty": "2017",
        "rodzaj": "projekt (zadanie)",
        "lokalizacj": "Park Bednarskiego",
        "rozgłasza": "FreeWifi-Krakow",
        "zarzadca": "T-mobile Polska SA",
        "opis": "Projekt sfinansowany z budżetu obywatelskiego"
      }
    },
    {
      "type": "Feature",
      "id": 9,
      "geometry": {
        "type": "Point",
        "coordinates": [19.961431491579184, 50.042052261585894]
      },
      "properties": {
        "objectid": 9,
        "id": 46,
        "wydzial": "Wydzia\u0088ł Informatyki",
        "koszt": "688455,6",
        "od_daty": "2015",
        "do_daty": "2017",
        "rodzaj": "projekt (zadanie)",
        "lokalizacj": "Rejon skrzyżowania Wielickiej i Powstancow Wlkpl.",
        "rozgłasza": "FreeWifi-Krakow",
        "zarzadca": "T-mobile Polska SA",
        "opis": "Projekt sfinansowany z budżetu obywatelskiego"
      }
    },
    {
      "type": "Feature",
      "id": 10,
      "geometry": {
        "type": "Point",
        "coordinates": [19.959135934071707, 50.05775445920046]
      },
      "properties": {
        "objectid": 10,
        "id": 45,
        "wydzial": "Wydzia\u0088ł Informatyki",
        "koszt": "688455,6",
        "od_daty": "2015",
        "do_daty": "2017",
        "rodzaj": "projekt (zadanie)",
        "lokalizacj": "Rejon Ronda Grzegórzeckiego",
        "rozgłasza": "FreeWifi-Krakow",
        "zarzadca": "T-mobile Polska SA",
        "opis": "Projekt sfinansowany z budżetu obywatelskiego"
      }
    },
    {
      "type": "Feature",
      "id": 11,
      "geometry": {
        "type": "Point",
        "coordinates": [19.925110943746336, 50.069516841309792]
      },
      "properties": {
        "objectid": 11,
        "id": 44,
        "wydzial": "Wydzia\u0088ł Informatyki",
        "koszt": "688455,6",
        "od_daty": "2015",
        "do_daty": "2017",
        "rodzaj": "projekt (zadanie)",
        "lokalizacj": "Fragment Parku Krakowskiego",
        "rozgłasza": "FreeWifi-Krakow",
        "zarzadca": "T-mobile Polska SA",
        "opis": "Projekt sfinansowany z budżetu obywatelskiego"
      }
    },
    {
      "type": "Feature",
      "id": 12,
      "geometry": {
        "type": "Point",
        "coordinates": [19.926042769494774, 50.012642903692395]
      },
      "properties": {
        "objectid": 12,
        "id": 43,
        "wydzial": "Wydział\u0088 Informatyki",
        "koszt": "688455,6",
        "od_daty": "2015",
        "do_daty": "2017",
        "rodzaj": "projekt (zadanie)",
        "lokalizacj": "Rejon Pętli Borek Fałęcki",
        "rozgłasza": "FreeWifi-Krakow",
        "zarzadca": "T-mobile Polska SA",
        "opis": "Projekt sfinansowany z budżetu obywatelskiego"
      }
    },
    {
      "type": "Feature",
      "id": 13,
      "geometry": {
        "type": "Point",
        "coordinates": [19.901670887386945, 50.07713457305767]
      },
      "properties": {
        "objectid": 13,
        "id": 42,
        "wydzial": "Wydzia\u0088ł Informatyki",
        "koszt": "688455,6",
        "od_daty": "2015",
        "do_daty": "2017",
        "rodzaj": "projekt (zadanie)",
        "lokalizacj": "Rejon Pętli Bronowice Male",
        "rozgłasza": "FreeWifi-Krakow",
        "zarzadca": "T-mobile Polska SA",
        "opis": "Projekt sfinansowany z budżetu obywatelskiego"
      }
    },
    {
      "type": "Feature",
      "id": 14,
      "geometry": {
        "type": "Point",
        "coordinates": [19.950098486008667, 50.066544686004079]
      },
      "properties": {
        "objectid": 14,
        "id": 41,
        "wydzial": "Wydzia\u0088ł Informatyki",
        "koszt": "688455,6",
        "od_daty": "2015",
        "do_daty": "2017",
        "rodzaj": "projekt (zadanie)",
        "lokalizacj": "Park Strzelecki",
        "rozgłasza": "FreeWifi-Krakow",
        "zarzadca": "T-mobile Polska SA",
        "opis": "Projekt sfinansowany z budżetu obywatelskiego"
      }
    },
    {
      "type": "Feature",
      "id": 15,
      "geometry": {
        "type": "Point",
        "coordinates": [19.929393803042345, 50.071973450062025]
      },
      "properties": {
        "objectid": 15,
        "id": 40,
        "wydzial": "Wydział\u0088 Informatyki",
        "koszt": "688455,6",
        "od_daty": "2015",
        "do_daty": "2017",
        "rodzaj": "projekt (zadanie)",
        "lokalizacj": "A. Grottgera",
        "rozgłasza": "FreeWifi-Krakow",
        "zarzadca": "T-mobile Polska SA",
        "opis": "Projekt sfinansowany z budżetu obywatelskiego"
      }
    },
    {
      "type": "Feature",
      "id": 16,
      "geometry": {
        "type": "Point",
        "coordinates": [19.999740551146648, 50.073226190476689]
      },
      "properties": {
        "objectid": 16,
        "id": 39,
        "wydzial": "Wydzia\u0088ł Informatyki",
        "koszt": "688455,6",
        "od_daty": "2015",
        "do_daty": "2017",
        "rodzaj": "projekt (zadanie)",
        "lokalizacj": "Park Lotników od strony Al. Jana Pawła II",
        "rozgłasza": "FreeWifi-Krakow",
        "zarzadca": "T-mobile Polska SA",
        "opis": "Projekt sfinansowany z budżetu obywatelskiego"
      }
    },
    {
      "type": "Feature",
      "id": 17,
      "geometry": {
        "type": "Point",
        "coordinates": [19.99124067527903, 50.068435830667966]
      },
      "properties": {
        "objectid": 17,
        "id": 38,
        "wydzial": "Wydzia\u0088ł Informatyki",
        "koszt": "688455,6",
        "od_daty": "2015",
        "do_daty": "2017",
        "rodzaj": "projekt (zadanie)",
        "lokalizacj": "Park Lotników Polskich w sąsiedztwie Kraków Arena",
        "rozgłasza": "FreeWifi-Krakow",
        "zarzadca": "T-mobile Polska SA",
        "opis": "Projekt sfinansowany z budżetu obywatelskiego"
      }
    },
    {
      "type": "Feature",
      "id": 18,
      "geometry": {
        "type": "Point",
        "coordinates": [20.019101846504974, 50.084967319872611]
      },
      "properties": {
        "objectid": 18,
        "id": 37,
        "wydzial": "Wydział\u0088 Informatyki",
        "koszt": "688455,6",
        "od_daty": "2015",
        "do_daty": "2017",
        "rodzaj": "projekt (zadanie)",
        "lokalizacj": "Rejn Ronda gen.Maczka",
        "rozgłasza": "FreeWifi-Krakow",
        "zarzadca": "T-mobile Polska SA",
        "opis": "Projekt sfinansowany z budżetu obywatelskiego"
      }
    },
    {
      "type": "Feature",
      "id": 19,
      "geometry": {
        "type": "Point",
        "coordinates": [19.901031441064013, 50.060437127313328]
      },
      "properties": {
        "objectid": 19,
        "id": 36,
        "wydzial": "Wydział\u0088 Informatyki",
        "koszt": "688455,6",
        "od_daty": "2015",
        "do_daty": "2017",
        "rodzaj": "projekt (zadanie)",
        "lokalizacj": "Rejon Błoń u zbiegu ulic Piastowskiej",
        "rozgłasza": "FreeWifi-Krakow",
        "zarzadca": "T-mobile Polska SA",
        "opis": "Projekt sfinansowany z budżetu obywatelskiego"
      }
    },
    {
      "type": "Feature",
      "id": 20,
      "geometry": {
        "type": "Point",
        "coordinates": [19.903736481364326, 50.062696998783657]
      },
      "properties": {
        "objectid": 20,
        "id": 35,
        "wydzial": "Wydzia\u0088ł Informatyki",
        "koszt": "688455,6",
        "od_daty": "2015",
        "do_daty": "2017",
        "rodzaj": "projekt (zadanie)",
        "lokalizacj": "okolice Pętli Cichy Kącik",
        "rozgłasza": "FreeWifi-Krakow",
        "zarzadca": "T-mobile Polska SA",
        "opis": "Projekt sfinansowany z budżetu obywatelskiego"
      }
    },
    {
      "type": "Feature",
      "id": 21,
      "geometry": {
        "type": "Point",
        "coordinates": [19.925084944916485, 50.059420062483298]
      },
      "properties": {
        "objectid": 21,
        "id": 34,
        "wydzial": "Wydzia\u0088ł Informatyki",
        "koszt": "688455,6",
        "od_daty": "2015",
        "do_daty": "2017",
        "rodzaj": "projekt (zadanie)",
        "lokalizacj": "Rejon skrzyżowania Alej Krasińskiego, Piłsudskiego, Mickiewicza",
        "rozgłasza": "FreeWifi-Krakow",
        "zarzadca": "T-mobile Polska SA",
        "opis": "Projekt sfinansowany z budżetu obywatelskiego"
      }
    },
    {
      "type": "Feature",
      "id": 22,
      "geometry": {
        "type": "Point",
        "coordinates": [19.93292539685195, 50.054601932901242]
      },
      "properties": {
        "objectid": 22,
        "id": 33,
        "wydzial": "Wydzia\u0088ł Informatyki",
        "koszt": "688455,6",
        "od_daty": "2015",
        "do_daty": "2017",
        "rodzaj": "projekt (zadanie)",
        "lokalizacj": "Bulwar Czerwieński",
        "rozgłasza": "FreeWifi-Krakow",
        "zarzadca": "T-mobile Polska SA",
        "opis": "Projekt sfinansowany z budżetu obywatelskiego"
      }
    },
    {
      "type": "Feature",
      "id": 23,
      "geometry": {
        "type": "Point",
        "coordinates": [19.944840102878004, 50.064815719635916]
      },
      "properties": {
        "objectid": 23,
        "id": 32,
        "wydzial": "Wydzia\u0088ł Informatyki",
        "koszt": "688455,6",
        "od_daty": "2015",
        "do_daty": "2017",
        "rodzaj": "projekt (zadanie)",
        "lokalizacj": "Rejon skrzyżowania ulic Westerplatte, Lubicz, Pawia, Basztowa",
        "rozgłasza": "FreeWifi-Krakow",
        "zarzadca": "T-mobile Polska SA",
        "opis": "Projekt sfinansowany z budżetu obywatelskiego"
      }
    },
    {
      "type": "Feature",
      "id": 24,
      "geometry": {
        "type": "Point",
        "coordinates": [19.938911012934678, 50.066168440090863]
      },
      "properties": {
        "objectid": 24,
        "id": 30,
        "wydzial": "Wydział\u0088 Informatyki",
        "koszt": "688455,6",
        "od_daty": "2015",
        "do_daty": "2017",
        "rodzaj": "projekt (zadanie)",
        "lokalizacj": "Rejon skrzyżowania ulic Sławkowskiej oraz Basztowej",
        "rozgłasza": "FreeWifi-Krakow",
        "zarzadca": "T-mobile Polska SA",
        "opis": "Projekt sfinansowany z budżetu obywatelskiego"
      }
    },
    {
      "type": "Feature",
      "id": 25,
      "geometry": {
        "type": "Point",
        "coordinates": [19.932801237015124, 50.063498553501454]
      },
      "properties": {
        "objectid": 25,
        "id": 29,
        "wydzial": "Wydzia\u0088ł Informatyki",
        "koszt": "688455,6",
        "od_daty": "2015",
        "do_daty": "2017",
        "rodzaj": "projekt (zadanie)",
        "lokalizacj": "Rejon skrzyżowania pod Teatrem Bagatela",
        "rozgłasza": "FreeWifi-Krakow",
        "zarzadca": "T-mobile Polska SA",
        "opis": "Projekt sfinansowany z budżetu obywatelskiego"
      }
    },
    {
      "type": "Feature",
      "id": 26,
      "geometry": {
        "type": "Point",
        "coordinates": [20.034886454258316, 50.070439992041123]
      },
      "properties": {
        "objectid": 26,
        "id": 1,
        "wydzial": " ",
        "koszt": " ",
        "od_daty": "2015",
        "do_daty": "2017",
        "rodzaj": " ",
        "lokalizacj": "Nowohuckie Centrum Kultury",
        "rozgłasza": "UMK Krakow",
        "zarzadca": "AGH ACK CYFRONET",
        "opis": "Projekt finansowany z budżetu Miasta Krakowa"
      }
    },
    {
      "type": "Feature",
      "id": 27,
      "geometry": {
        "type": "Point",
        "coordinates": [20.046555995360393, 50.079041282077121]
      },
      "properties": {
        "objectid": 27,
        "id": 2,
        "wydzial": " ",
        "koszt": " ",
        "od_daty": "2015",
        "do_daty": "2017",
        "rodzaj": " ",
        "lokalizacj": "Zespół Szkół Elektrycznych nr 2",
        "rozgłasza": "UMK Krakow",
        "zarzadca": "AGH ACK CYFRONET",
        "opis": "Projekt finansowany z budżetu Miasta Krakowa"
      }
    },
    {
      "type": "Feature",
      "id": 28,
      "geometry": {
        "type": "Point",
        "coordinates": [20.05135702265655, 50.078196368438718]
      },
      "properties": {
        "objectid": 28,
        "id": 3,
        "wydzial": " ",
        "koszt": " ",
        "od_daty": "2015",
        "do_daty": "2017",
        "rodzaj": " ",
        "lokalizacj": "Dom Wędkarza",
        "rozgłasza": "UMK Krakow",
        "zarzadca": "AGH ACK CYFRONET",
        "opis": "Projekt finansowany z budżetu Miasta Krakowa"
      }
    },
    {
      "type": "Feature",
      "id": 29,
      "geometry": {
        "type": "Point",
        "coordinates": [19.946068946664301, 50.093413694521246]
      },
      "properties": {
        "objectid": 29,
        "id": 4,
        "wydzial": " ",
        "koszt": " ",
        "od_daty": "2015",
        "do_daty": "2017",
        "rodzaj": " ",
        "lokalizacj": "Gimnazjum nr 13",
        "rozgłasza": "UMK Krakow",
        "zarzadca": "AGH ACK CYFRONET",
        "opis": "Projekt finansowany z budżetu Miasta Krakowa"
      }
    },
    {
      "type": "Feature",
      "id": 30,
      "geometry": {
        "type": "Point",
        "coordinates": [20.056403995438288, 50.094403112247107]
      },
      "properties": {
        "objectid": 30,
        "id": 5,
        "wydzial": " ",
        "koszt": " ",
        "od_daty": "2015",
        "do_daty": "2017",
        "rodzaj": " ",
        "lokalizacj": "Nowohucka Biblioteka Publiczna Filia nr 6",
        "rozgłasza": "UMK Krakow",
        "zarzadca": "AGH ACK CYFRONET",
        "opis": "Projekt finansowany z budżetu Miasta Krakowa"
      }
    },
    {
      "type": "Feature",
      "id": 31,
      "geometry": {
        "type": "Point",
        "coordinates": [19.998985188550549, 50.092334596158452]
      },
      "properties": {
        "objectid": 31,
        "id": 6,
        "wydzial": " ",
        "koszt": " ",
        "od_daty": "2015",
        "do_daty": "2017",
        "rodzaj": " ",
        "lokalizacj": "Rada Dzielnicy XV",
        "rozgłasza": "UMK Krakow",
        "zarzadca": "AGH ACK CYFRONET",
        "opis": "Projekt finansowany z budżetu Miasta Krakowa"
      }
    },
    {
      "type": "Feature",
      "id": 32,
      "geometry": {
        "type": "Point",
        "coordinates": [20.018005367868575, 50.089161021454842]
      },
      "properties": {
        "objectid": 32,
        "id": 7,
        "wydzial": " ",
        "koszt": " ",
        "od_daty": "2015",
        "do_daty": "2017",
        "rodzaj": " ",
        "lokalizacj": "Zespół Szkół Ogolnokształcących nr 3",
        "rozgłasza": "UMK Krakow",
        "zarzadca": "AGH ACK CYFRONET",
        "opis": "Projekt finansowany z budżetu Miasta Krakowa"
      }
    },
    {
      "type": "Feature",
      "id": 33,
      "geometry": {
        "type": "Point",
        "coordinates": [20.047322522822043, 50.079127960679628]
      },
      "properties": {
        "objectid": 33,
        "id": 8,
        "wydzial": " ",
        "koszt": " ",
        "od_daty": "2015",
        "do_daty": "2017",
        "rodzaj": " ",
        "lokalizacj": "Centrum Kształcenia Ustawicznego",
        "rozgłasza": "UMK Krakow",
        "zarzadca": "AGH ACK CYFRONET",
        "opis": "Projekt finansowany z budżetu Miasta Krakowa"
      }
    },
    {
      "type": "Feature",
      "id": 34,
      "geometry": {
        "type": "Point",
        "coordinates": [19.977195742551984, 50.02439481486438]
      },
      "properties": {
        "objectid": 34,
        "id": 9,
        "wydzial": " ",
        "koszt": " ",
        "od_daty": "2015",
        "do_daty": "2017",
        "rodzaj": " ",
        "lokalizacj": "Zespół Szkół Elektrycznych nr 1",
        "rozgłasza": "UMK Krakow",
        "zarzadca": "AGH ACK CYFRONET",
        "opis": "Projekt finansowany z budżetu Miasta Krakowa"
      }
    },
    {
      "type": "Feature",
      "id": 35,
      "geometry": {
        "type": "Point",
        "coordinates": [19.949958651159037, 50.044634173622654]
      },
      "properties": {
        "objectid": 35,
        "id": 10,
        "wydzial": " ",
        "koszt": " ",
        "od_daty": "2015",
        "do_daty": "2017",
        "rodzaj": " ",
        "lokalizacj": "Rada Dzielnicy XIII",
        "rozgłasza": "UMK Krakow",
        "zarzadca": "AGH ACK CYFRONET",
        "opis": "Projekt finansowany z budżetu Miasta Krakowa"
      }
    },
    {
      "type": "Feature",
      "id": 36,
      "geometry": {
        "type": "Point",
        "coordinates": [19.980735529447351, 50.018091456696368]
      },
      "properties": {
        "objectid": 36,
        "id": 11,
        "wydzial": " ",
        "koszt": " ",
        "od_daty": "2015",
        "do_daty": "2017",
        "rodzaj": " ",
        "lokalizacj": "Gimnazjum nr 31",
        "rozgłasza": "UMK Krakow",
        "zarzadca": "AGH ACK CYFRONET",
        "opis": "Projekt finansowany z budżetu Miasta Krakowa"
      }
    },
    {
      "type": "Feature",
      "id": 37,
      "geometry": {
        "type": "Point",
        "coordinates": [19.92886974560545, 50.062255191382675]
      },
      "properties": {
        "objectid": 37,
        "id": 12,
        "wydzial": " ",
        "koszt": " ",
        "od_daty": "2015",
        "do_daty": "2017",
        "rodzaj": " ",
        "lokalizacj": "V Liceum Ogolnokształcące",
        "rozgłasza": "UMK Krakow",
        "zarzadca": "AGH ACK CYFRONET",
        "opis": "Projekt finansowany z budżetu Miasta Krakowa"
      }
    },
    {
      "type": "Feature",
      "id": 38,
      "geometry": {
        "type": "Point",
        "coordinates": [19.92487169556124, 50.062346844931049]
      },
      "properties": {
        "objectid": 38,
        "id": 13,
        "wydzial": " ",
        "koszt": " ",
        "od_daty": "2015",
        "do_daty": "2017",
        "rodzaj": " ",
        "lokalizacj": "Centrum Kształcenia Praktycznego",
        "rozgłasza": "UMK Krakow",
        "zarzadca": "AGH ACK CYFRONET",
        "opis": "Projekt finansowany z budżetu Miasta Krakowa"
      }
    },
    {
      "type": "Feature",
      "id": 39,
      "geometry": {
        "type": "Point",
        "coordinates": [19.936841337813899, 50.058658825920844]
      },
      "properties": {
        "objectid": 39,
        "id": 24,
        "wydzial": " ",
        "koszt": " ",
        "od_daty": "2015",
        "do_daty": "2017",
        "rodzaj": " ",
        "lokalizacj": "Plac Wszystkich Świętych 3-4",
        "rozgłasza": "UMK Krakow",
        "zarzadca": "Wydział Informatyki UMK",
        "opis": "Projekt finansowany z budżetu Miasta Krakowa"
      }
    },
    {
      "type": "Feature",
      "id": 40,
      "geometry": {
        "type": "Point",
        "coordinates": [19.937352707962404, 50.05925033234535]
      },
      "properties": {
        "objectid": 40,
        "id": 22,
        "wydzial": " ",
        "koszt": " ",
        "od_daty": "2015",
        "do_daty": "2017",
        "rodzaj": " ",
        "lokalizacj": "Plac Wszystkich Świętych 11",
        "rozgłasza": "UMK Krakow",
        "zarzadca": "Wydział Informatyki UMK",
        "opis": "Projekt finansowany z budżetu Miasta Krakowa"
      }
    },
    {
      "type": "Feature",
      "id": 41,
      "geometry": {
        "type": "Point",
        "coordinates": [19.936319517475351, 50.05995229173044]
      },
      "properties": {
        "objectid": 41,
        "id": 26,
        "wydzial": " ",
        "koszt": " ",
        "od_daty": "2015",
        "do_daty": "2017",
        "rodzaj": " ",
        "lokalizacj": "UMK Bracka 10",
        "rozgłasza": "UMK Krakow",
        "zarzadca": "Wydział Informatyki UMK",
        "opis": "Projekt finansowany z budżetu Miasta Krakowa"
      }
    },
    {
      "type": "Feature",
      "id": 42,
      "geometry": {
        "type": "Point",
        "coordinates": [20.012234800718215, 50.084815428804419]
      },
      "properties": {
        "objectid": 42,
        "id": 18,
        "wydzial": " ",
        "koszt": " ",
        "od_daty": "2015",
        "do_daty": "2017",
        "rodzaj": " ",
        "lokalizacj": "Rada Dzielnicy XIV",
        "rozgłasza": "UMK Krakow",
        "zarzadca": "AGH ACK CYFRONET",
        "opis": "Projekt finansowany z budżetu Miasta Krakowa"
      }
    },
    {
      "type": "Feature",
      "id": 43,
      "geometry": {
        "type": "Point",
        "coordinates": [19.940596247527214, 50.069308226420269]
      },
      "properties": {
        "objectid": 43,
        "id": 15,
        "wydzial": " ",
        "koszt": " ",
        "od_daty": "2015",
        "do_daty": "2017",
        "rodzaj": " ",
        "lokalizacj": "X Liceum Ogolnokształcące",
        "rozgłasza": "UMK Krakow",
        "zarzadca": "AGH ACK CYFRONET",
        "opis": "Projekt finansowany z budżetu Miasta Krakowa"
      }
    },
    {
      "type": "Feature",
      "id": 44,
      "geometry": {
        "type": "Point",
        "coordinates": [20.004994072892917, 50.067052534610632]
      },
      "properties": {
        "objectid": 44,
        "id": 27,
        "wydzial": " ",
        "koszt": " ",
        "od_daty": "2015",
        "do_daty": "2017",
        "rodzaj": " ",
        "lokalizacj": "Ogród Doświadczeń",
        "rozgłasza": "UMK Krakow",
        "zarzadca": "Wiktor Braun Enigma network Solutions",
        "opis": "Projekt finansowany z budżetu Miasta Krakowa"
      }
    },
    {
      "type": "Feature",
      "id": 45,
      "geometry": {
        "type": "Point",
        "coordinates": [19.966071989500612, 50.082781613159405]
      },
      "properties": {
        "objectid": 45,
        "id": 14,
        "wydzial": " ",
        "koszt": " ",
        "od_daty": "2015",
        "do_daty": "2017",
        "rodzaj": " ",
        "lokalizacj": "Zespół Szkół Przemysłu Spożywczego",
        "rozgłasza": "UMK Krakow",
        "zarzadca": "AGH ACK CYFRONET",
        "opis": "Projekt finansowany z budżetu Miasta Krakowa"
      }
    },
    {
      "type": "Feature",
      "id": 46,
      "geometry": {
        "type": "Point",
        "coordinates": [19.9408640672189, 50.092867931269183]
      },
      "properties": {
        "objectid": 46,
        "id": 16,
        "wydzial": " ",
        "koszt": " ",
        "od_daty": "2015",
        "do_daty": "2017",
        "rodzaj": " ",
        "lokalizacj": "Centrum Kultury Dworek Białoprądnicki",
        "rozgłasza": "UMK Krakow",
        "zarzadca": "AGH ACK CYFRONET",
        "opis": "Projekt finansowany z budżetu Miasta Krakowa"
      }
    },
    {
      "type": "Feature",
      "id": 47,
      "geometry": {
        "type": "Point",
        "coordinates": [20.002898245392966, 50.092838529975218]
      },
      "properties": {
        "objectid": 47,
        "id": 17,
        "wydzial": " ",
        "koszt": " ",
        "od_daty": "2015",
        "do_daty": "2017",
        "rodzaj": " ",
        "lokalizacj": "Zespół Szkół Poligraficznych",
        "rozgłasza": "UMK Krakow",
        "zarzadca": "AGH ACK CYFRONET",
        "opis": "Projekt finansowany z budżetu Miasta Krakowa"
      }
    },
    {
      "type": "Feature",
      "id": 48,
      "geometry": {
        "type": "Point",
        "coordinates": [20.006590665872949, 50.083469030077481]
      },
      "properties": {
        "objectid": 48,
        "id": 19,
        "wydzial": " ",
        "koszt": " ",
        "od_daty": "2015",
        "do_daty": "2017",
        "rodzaj": " ",
        "lokalizacj": "Zespół Szkół Ogolnokształcących nr 14",
        "rozgłasza": "UMK Krakow",
        "zarzadca": "AGH ACK CYFRONET",
        "opis": "Projekt finansowany z budżetu Miasta Krakowa"
      }
    },
    {
      "type": "Feature",
      "id": 49,
      "geometry": {
        "type": "Point",
        "coordinates": [20.004807128007297, 50.081817895069321]
      },
      "properties": {
        "objectid": 49,
        "id": 20,
        "wydzial": " ",
        "koszt": " ",
        "od_daty": "2015",
        "do_daty": "2017",
        "rodzaj": " ",
        "lokalizacj": "Nowohucka Biblioteka Puibliczna Filia 10",
        "rozgłasza": "UMK Krakow",
        "zarzadca": "AGH ACK CYFRONET",
        "opis": "Projekt finansowany z budżetu Miasta Krakowa"
      }
    },
    {
      "type": "Feature",
      "id": 50,
      "geometry": {
        "type": "Point",
        "coordinates": [19.937379970664214, 50.061690321117112]
      },
      "properties": {
        "objectid": 50,
        "id": 21,
        "wydzial": " ",
        "koszt": " ",
        "od_daty": "2015",
        "do_daty": "2017",
        "rodzaj": " ",
        "lokalizacj": "Sukiennice",
        "rozgłasza": "UMK Krakow",
        "zarzadca": "AGH ACK CYFRONET",
        "opis": "Projekt finansowany z budżetu Miasta Krakowa"
      }
    },
    {
      "type": "Feature",
      "id": 51,
      "geometry": {
        "type": "Point",
        "coordinates": [20.032225984228937, 50.076965296048556]
      },
      "properties": {
        "objectid": 51,
        "id": 23,
        "wydzial": " ",
        "koszt": " ",
        "od_daty": "2015",
        "do_daty": "2017",
        "rodzaj": " ",
        "lokalizacj": "UMK os.Zgody 2",
        "rozgłasza": "UMK Krakow",
        "zarzadca": "Wydział Informatyki UMK",
        "opis": "Projekt finansowany z budżetu Miasta Krakowa"
      }
    },
    {
      "type": "Feature",
      "id": 52,
      "geometry": {
        "type": "Point",
        "coordinates": [19.961136310796984, 50.062017923610014]
      },
      "properties": {
        "objectid": 52,
        "id": 25,
        "wydzial": " ",
        "koszt": " ",
        "od_daty": "2015",
        "do_daty": "2017",
        "rodzaj": " ",
        "lokalizacj": "UMK Al. Powstania Warszawskiego 10",
        "rozgłasza": "UMK Krakow",
        "zarzadca": "Wydział Informatyki UMK",
        "opis": "Projekt finansowany z budżetu Miasta Krakowa"
      }
    },
    {
      "type": "Feature",
      "id": 53,
      "geometry": {
        "type": "Point",
        "coordinates": [20.007763005271983, 50.085078740781569]
      },
      "properties": {
        "objectid": 53,
        "id": 28,
        "wydzial": " ",
        "koszt": " ",
        "od_daty": "2015",
        "do_daty": "2017",
        "rodzaj": " ",
        "lokalizacj": "Park im. gen. Stanisława Skalskiego",
        "rozgłasza": "UMK Krakow",
        "zarzadca": "Wiktor Braun Enigma network Solutions",
        "opis": "Projekt finansowany z budżetu Miasta Krakowa"
      }
    },
    {
      "type": "Feature",
      "id": 54,
      "geometry": {
        "type": "Point",
        "coordinates": [19.938911012934678, 50.066168440090863]
      },
      "properties": {
        "objectid": 54,
        "id": 31,
        "wydzial": "Wydział\u0088 Informatyki",
        "koszt": "688455,6",
        "od_daty": "2015",
        "do_daty": "2017",
        "rodzaj": "projekt (zadanie)",
        "lokalizacj": "Rejon skrzyżowania ulic Sławkowskiej oraz Basztowej",
        "rozgłasza": "UMK Krakow",
        "zarzadca": "T-mobile Polska SA",
        "opis": "Projekt finansowany z budżetu Miasta Krakowa"
      }
    },
    {
      "type": "Feature",
      "id": 55,
      "geometry": {
        "type": "Point",
        "coordinates": [20.037138832559148, 50.072098575494671]
      },
      "properties": {
        "objectid": 55,
        "id": 59,
        "wydzial": " ",
        "koszt": " ",
        "od_daty": "2015",
        "do_daty": "2017",
        "rodzaj": " ",
        "lokalizacj": "Plac Centralny",
        "rozgłasza": "FreeWifi-Krakow",
        "zarzadca": "T-mobile Polska SA",
        "opis": "Projekt sfinansowany z budżetu obywatelskiego"
      }
    },
    {
      "type": "Feature",
      "id": 56,
      "geometry": {
        "type": "Point",
        "coordinates": [19.8894016169228, 50.018221898632333]
      },
      "properties": {
        "objectid": 56,
        "id": 56,
        "wydzial": " ",
        "koszt": " ",
        "od_daty": "2015",
        "do_daty": "2017",
        "rodzaj": " ",
        "lokalizacj": "Pętla Czerwone Maki",
        "rozgłasza": "FreeWifi-Krakow",
        "zarzadca": "T-mobile Polska SA",
        "opis": "Projekt sfinansowany z budżetu obywatelskiego"
      }
    },
    {
      "type": "Feature",
      "id": 57,
      "geometry": {
        "type": "Point",
        "coordinates": [20.052181373409631, 50.080735262908881]
      },
      "properties": {
        "objectid": 57,
        "id": 57,
        "wydzial": " ",
        "koszt": " ",
        "od_daty": "2015",
        "do_daty": "2017",
        "rodzaj": " ",
        "lokalizacj": "Zalew Nowohucki",
        "rozgłasza": "FreeWifi-Krakow",
        "zarzadca": "T-mobile Polska SA",
        "opis": "Projekt sfinansowany z budżetu obywatelskiego"
      }
    },
    {
      "type": "Feature",
      "id": 58,
      "geometry": {
        "type": "Point",
        "coordinates": [20.001297038786522, 50.040304300724053]
      },
      "properties": {
        "objectid": 58,
        "id": 54,
        "wydzial": " ",
        "koszt": " ",
        "od_daty": "2015",
        "do_daty": "2017",
        "rodzaj": " ",
        "lokalizacj": "Rejon Pętli Mały Płaszow",
        "rozgłasza": "FreeWifi-Krakow",
        "zarzadca": "T-mobile Polska SA",
        "opis": "Projekt sfinansowany z budżetu obywatelskiego"
      }
    },
    {
      "type": "Feature",
      "id": 59,
      "geometry": {
        "type": "Point",
        "coordinates": [20.010426081592268, 50.089836213076005]
      },
      "properties": {
        "objectid": 59,
        "id": 58,
        "wydzial": " ",
        "koszt": " ",
        "od_daty": "2015",
        "do_daty": "2017",
        "rodzaj": " ",
        "lokalizacj": "Planty Bieńczyckie",
        "rozgłasza": "FreeWifi-Krakow",
        "zarzadca": "T-mobile Polska SA",
        "opis": "Projekt sfinansowany z budżetu obywatelskiego"
      }
    },
    {
      "type": "Feature",
      "id": 60,
      "geometry": {
        "type": "Point",
        "coordinates": [20.043629984748176, 50.07447941683818]
      },
      "properties": {
        "objectid": 60,
        "id": 60,
        "wydzial": " ",
        "koszt": " ",
        "od_daty": "2015",
        "do_daty": "2017",
        "rodzaj": " ",
        "lokalizacj": "Park Szwedzki",
        "rozgłasza": "FreeWifi-Krakow",
        "zarzadca": "T-mobile Polska SA",
        "opis": "Projekt sfinansowany z budżetu obywatelskiego"
      }
    },
    {
      "type": "Feature",
      "id": 61,
      "geometry": {
        "type": "Point",
        "coordinates": [19.987325052428584, 50.091542149628893]
      },
      "properties": {
        "objectid": 61,
        "id": 61,
        "wydzial": " ",
        "koszt": " ",
        "od_daty": "2015",
        "do_daty": "2017",
        "rodzaj": " ",
        "lokalizacj": "Smoczy Skwer",
        "rozgłasza": "FreeWifi-Krakow",
        "zarzadca": "T-mobile Polska SA",
        "opis": "Projekt sfinansowany z budżetu obywatelskiego"
      }
    },
    {
      "type": "Feature",
      "id": 62,
      "geometry": {
        "type": "Point",
        "coordinates": [20.027123461792531, 50.084981351716365]
      },
      "properties": {
        "objectid": 62,
        "id": 62,
        "wydzial": " ",
        "koszt": " ",
        "od_daty": "2015",
        "do_daty": "2017",
        "rodzaj": " ",
        "lokalizacj": "Planty Bieńczyckie",
        "rozgłasza": "FreeWifi-Krakow",
        "zarzadca": "T-mobile Polska SA",
        "opis": "Projekt sfinansowany z budżetu obywatelskiego"
      }
    }
  ]
}
