{
  "type": "FeatureCollection",
  "crs": { "type": "name", "properties": { "name": "EPSG:4326" } },
  "features": [
    {
      "type": "Feature",
      "id": 21,
      "geometry": {
        "type": "MultiPoint",
        "coordinates": [[19.957065084015568, 50.055132403810966]]
      },
      "properties": {
        "FID": 21,
        "NAZWA_INST": "Biblioteka",
        "RODZAJ": "Biblioteka",
        "ULICA": "MASARSKA",
        "NR_ADRES": "14",
        "SYMBOL": "1G",
        "KOD": 2,
        "DATA_AKT": 1352937600000,
        "X": 7425318.0099999998,
        "Y": 5547073.4100000001,
        "ID1": 22,
        "GMRotation": 0
      }
    },
    {
      "type": "Feature",
      "id": 30,
      "geometry": {
        "type": "MultiPoint",
        "coordinates": [[19.918852430472146, 50.057138378209565]]
      },
      "properties": {
        "FID": 30,
        "NAZWA_INST": "Biblioteka",
        "RODZAJ": "Biblioteka",
        "ULICA": "FAbATA",
        "NR_ADRES": "2",
        "SYMBOL": "K2",
        "KOD": 2,
        "DATA_AKT": 1352937600000,
        "X": 7422584.9800000004,
        "Y": 5547335.4000000004,
        "ID1": 31,
        "GMRotation": 0
      }
    },
    {
      "type": "Feature",
      "id": 34,
      "geometry": {
        "type": "MultiPoint",
        "coordinates": [[19.967238781759146, 50.058964483523113]]
      },
      "properties": {
        "FID": 34,
        "NAZWA_INST": "Biblioteka",
        "RODZAJ": "Biblioteka",
        "ULICA": "BOBROWSKIEGO",
        "NR_ADRES": "11",
        "SYMBOL": "12",
        "KOD": 2,
        "DATA_AKT": 1352937600000,
        "X": 7426052.4000000004,
        "Y": 5547489.4900000002,
        "ID1": 35,
        "GMRotation": 0
      }
    },
    {
      "type": "Feature",
      "id": 37,
      "geometry": {
        "type": "MultiPoint",
        "coordinates": [[19.92931725423843, 50.062557894195997]]
      },
      "properties": {
        "FID": 37,
        "NAZWA_INST": "Biblioteka",
        "RODZAJ": "Biblioteka",
        "ULICA": "STUDENCKA",
        "NR_ADRES": "19",
        "SYMBOL": "18",
        "KOD": 2,
        "DATA_AKT": 1352937600000,
        "X": 7423342.9299999997,
        "Y": 5547927.3600000003,
        "ID1": 38,
        "GMRotation": 0
      }
    },
    {
      "type": "Feature",
      "id": 49,
      "geometry": {
        "type": "MultiPoint",
        "coordinates": [[19.929428902627432, 50.052138059097189]]
      },
      "properties": {
        "FID": 49,
        "NAZWA_INST": "Biblioteka",
        "RODZAJ": "Biblioteka",
        "ULICA": "POWROoNICZA",
        "NR_ADRES": "2",
        "SYMBOL": "PG",
        "KOD": 2,
        "DATA_AKT": 1352937600000,
        "X": 7423334.3200000003,
        "Y": 5546768.3700000001,
        "ID1": 50,
        "GMRotation": 0
      }
    },
    {
      "type": "Feature",
      "id": 71,
      "geometry": {
        "type": "MultiPoint",
        "coordinates": [[19.953265154064933, 50.05659480158824]]
      },
      "properties": {
        "FID": 71,
        "NAZWA_INST": "Biblioteka",
        "RODZAJ": "Biblioteka",
        "ULICA": "ALEJA DASZYKSKIEGO",
        "NR_ADRES": "22",
        "SYMBOL": "213",
        "KOD": 2,
        "DATA_AKT": 1352937600000,
        "X": 7425048.1900000004,
        "Y": 5547239.8600000003,
        "ID1": 72,
        "GMRotation": 0
      }
    },
    {
      "type": "Feature",
      "id": 95,
      "geometry": {
        "type": "MultiPoint",
        "coordinates": [[19.920423153438577, 50.053984001124782]]
      },
      "properties": {
        "FID": 95,
        "NAZWA_INST": "Biblioteka",
        "RODZAJ": "Biblioteka",
        "ULICA": "KOMOROWSKIEGO",
        "NR_ADRES": "11",
        "SYMBOL": "K3",
        "KOD": 2,
        "DATA_AKT": 1352937600000,
        "X": 7422692.3799999999,
        "Y": 5546982.9500000002,
        "ID1": 96,
        "GMRotation": 0
      }
    },
    {
      "type": "Feature",
      "id": 104,
      "geometry": {
        "type": "MultiPoint",
        "coordinates": [[19.960444608211194, 50.068209564064823]]
      },
      "properties": {
        "FID": 104,
        "NAZWA_INST": "Biblioteka",
        "RODZAJ": "Biblioteka",
        "ULICA": "BRODOWICZA",
        "NR_ADRES": "1",
        "SYMBOL": "117",
        "KOD": 2,
        "DATA_AKT": 1352937600000,
        "X": 7425580.2400000002,
        "Y": 5548524.46,
        "ID1": 105,
        "GMRotation": 0
      }
    },
    {
      "type": "Feature",
      "id": 126,
      "geometry": {
        "type": "MultiPoint",
        "coordinates": [[19.94524954649351, 50.057435034935345]]
      },
      "properties": {
        "FID": 126,
        "NAZWA_INST": "Biblioteka",
        "RODZAJ": "Biblioteka",
        "ULICA": "DIETLA",
        "NR_ADRES": "80/82",
        "SYMBOL": "84",
        "KOD": 2,
        "DATA_AKT": 1352937600000,
        "X": 7424475.5599999996,
        "Y": 5547341.3799999999,
        "ID1": 127,
        "GMRotation": 0
      }
    },
    {
      "type": "Feature",
      "id": 135,
      "geometry": {
        "type": "MultiPoint",
        "coordinates": [[19.976039216128679, 50.058882140999259]]
      },
      "properties": {
        "FID": 135,
        "NAZWA_INST": "Biblioteka",
        "RODZAJ": "Biblioteka",
        "ULICA": "ALEJA POKOJU",
        "NR_ADRES": "33",
        "SYMBOL": "316",
        "KOD": 2,
        "DATA_AKT": 1352937600000,
        "X": 7426682.3899999997,
        "Y": 5547471.6600000001,
        "ID1": 136,
        "GMRotation": 0
      }
    },
    {
      "type": "Feature",
      "id": 150,
      "geometry": {
        "type": "MultiPoint",
        "coordinates": [[19.951178146713612, 50.067943859805375]]
      },
      "properties": {
        "FID": 150,
        "NAZWA_INST": "Kr",
        "RODZAJ": "Biblioteka",
        "ULICA": "ALEKSANDRA LUBOMIRSKIEGO",
        "NR_ADRES": "7A",
        "SYMBOL": "712",
        "KOD": 2,
        "DATA_AKT": 1396310400000,
        "X": 0,
        "Y": 0,
        "ID1": 151,
        "GMRotation": 0
      }
    }
  ]
}
