graph TB
  %% Vue subgraph: hidden title
  subgraph 1[ ]
    %% 1st level subgraph: transparent
    style 1 fill:transparent, stroke:transparent
    %% Hidden link
    Vue([Vue]):::invertedtheme --- |"⁞"| new_vue("new Vue( fa:fa-list-ul )")
    linkStyle 0 stroke: transparent
    subgraph 1_1 [Vue instance]
      %% Subgraph background
      style 1_1 fill:#262626
      new_vue --> |assign to| window{{window}}
      window --- |property| ms_instance{{__MYSTATION_VUE_INSTANCE__}}
      subgraph 1_1_1 [ ]
        %% Subgraph background
        style 1_1_1 fill:#262626
        call_async([call async]):::disabledNode --- ms_boot("this.boot()"):::greenNode
      end
      ms_instance --> |"created()"| call_async
    end
  end
  %% MyStation subgraph: hidden title
  subgraph 2 [ ]
    %% 1st level subgraph: transparent
    style 2 fill:transparent, stroke:transparent
    %% Hidden link
    MyStation([MyStation]):::invertedtheme --- ms_init("init()")
    linkStyle 5 stroke: transparent
    subgraph 2_1 [System]
      %% Subgraph background
      style 2_1 fill:#262626, stroke:#1EAB7F, stroke-width:2px;
      ms_init --- ms_hooks{{"main (hooks)"}}
      linkStyle 6 stroke: transparent
    end
    %% 'Hide' link
    ms_hooks --- AppManager
    linkStyle 7 stroke: transparent
    subgraph 2_3 [Services]
      %% Subgraph background
      style 2_3 fill:#262626
      AppManager(fa:fa-ring AppManager)
      APIManager(fa:fa-ring APIManager)
      services_etc([. . .]):::disabledNode
      AppManager --- APIManager --- services_etc
      linkStyle 8 stroke: transparent
      linkStyle 9 stroke: transparent
    end
    %% 'Hide' link
    MyStation --- module_emit
    linkStyle 10 stroke: transparent
    subgraph 2_2 [Modules]
      %% Subgraph background
      style 2_2 fill:#262626
      module_emit("fa:fa-ring emit()")
      module_log("fa:fa-ring log()")
      module_wait("fa:fa-ring wait()")
      module_etc([". . ."]):::disabledNode
      module_emit --- module_log --- module_wait --- module_etc
      linkStyle 11 stroke: transparent
      linkStyle 12 stroke: transparent
      linkStyle 13 stroke: transparent
    end
  end
  %% Add-ons subgraph: hidden title
  subgraph 3 [ ]
    %% 1st level subgraph: transparent
    style 3 fill:transparent, stroke:transparent
    AddOns([Add-Ons]):::invertedtheme --- mytasks
    linkStyle 14 stroke: transparent
    AddOns --- not_supported
    linkStyle 15 stroke: transparent
    subgraph 3_1 [Apps]
      %% Subgraph background
      style 3_1 fill:#262626
      mytasks([mytasks]) --- myfeeds([myfeeds])
      myfeeds --- mysango([mysango]) 
      mysango --- mynotes([mynotes]) 
      mynotes --- 3_apps_etc([. . .]):::disabledNode
      linkStyle 16 stroke: transparent
      linkStyle 17 stroke: transparent
      linkStyle 18 stroke: transparent
      linkStyle 19 stroke: transparent
    end
    subgraph 3_2 [Plugins]
      %% Subgraph background
      style 3_2 fill:#262626
      not_supported([Not supported]):::disabledNode
    end
  end