{
    "name": "Api rest en Python / Flask",
    "version": "0.1.0",
    "description": "Api rest pour lister, ajouter, modifier et supprimer des veilles technos",
    "title": "Custom apiDoc browser title",
    "url" : "http://127.0.0.1:5000/",
    "header": {
        "title": "My own header title",
        "filename": ""
    },
    "footer": {
        "title": "My own footer title",
        "filename": ""
    }
    
}